9 Replies Latest reply on May 11, 2012 4:52 AM by Tomaz Cerar

    JDR : generate-jdr-report throwing exception

    Vimal Kansal Newbie

      Hi,

      I am running on Windows 7 64 bit. When I execute the /subsystem=jdr:generate-jdr-report, I see the following error in the log :

       

      09:31:52,341 INFO  [org.jboss.as.jdr] (Remoting "the_beast:MANAGEMENT" task-11) JBAS014500: Starting creation of a JBoss Diagnostic Report (JDR).

      09:32:00,856 INFO  [stdout] (MainThread) net localgroup administrators | find "%USERNAME"

       

       

      09:32:01,495 ERROR [stderr] (_CouplerThread-5 (stderr)) The syntax of this command is:

       

       

      09:32:01,496 ERROR [stderr] (_CouplerThread-5 (stderr))

       

       

      09:32:01,497 ERROR [stderr] (_CouplerThread-5 (stderr)) NET LOCALGROUP

       

       

      09:32:01,498 ERROR [stderr] (_CouplerThread-5 (stderr)) [groupname [/COMMENT:"text"]] [/DOMAIN]

       

       

      09:32:01,499 ERROR [stderr] (_CouplerThread-5 (stderr))               groupname {/ADD [/COMMENT:"text"] | /DELETE}  [/DOMAIN]

       

       

      09:32:01,500 ERROR [stderr] (_CouplerThread-5 (stderr))               groupname name [...] {/ADD | /DELETE} [/DOMAIN]

       

       

      09:32:01,501 ERROR [stderr] (_CouplerThread-5 (stderr))

       

       

      09:32:02,736 ERROR [org.jboss.as.controller] (MainThread) JBAS014612: Operation ("dump-all-threads") failed - address: ([

          ("core-service" => "platform-mbean"),

          ("type" => "threading")

      ]): java.lang.IllegalArgumentException: newValue is null

                at org.jboss.dmr.ModelNode.set(ModelNode.java:349) [jboss-dmr-1.0.0.Final.jar:1.0.0.Final]

                at org.jboss.as.platform.mbean.PlatformMBeanUtil.getDetypedStackTraceElement(PlatformMBeanUtil.java:191)

                at org.jboss.as.platform.mbean.PlatformMBeanUtil.getDetypedThreadInfo(PlatformMBeanUtil.java:145)

                at org.jboss.as.platform.mbean.ThreadMXBeanDumpAllThreadsHandler.execute(ThreadMXBeanDumpAllThreadsHandler.java:71)

                at org.jboss.as.controller.AbstractOperationContext.executeStep(AbstractOperationContext.java:327) [jboss-as-controller-7.1.0.Alpha2-SNAPSHOT.jar:7.1.0.Alpha2-SNAPSHOT]

                at org.jboss.as.controller.AbstractOperationContext.doCompleteStep(AbstractOperationContext.java:221) [jboss-as-controller-7.1.0.Alpha2-SNAPSHOT.jar:7.1.0.Alpha2-SNAPSHOT]

                at org.jboss.as.controller.AbstractOperationContext.completeStep(AbstractOperationContext.java:157) [jboss-as-controller-7.1.0.Alpha2-SNAPSHOT.jar:7.1.0.Alpha2-SNAPSHOT]

                at org.jboss.as.controller.ModelControllerImpl$DefaultPrepareStepHandler.execute(ModelControllerImpl.java:418) [jboss-as-controller-7.1.0.Alpha2-SNAPSHOT.jar:7.1.0.Alpha2-SNAPSHOT]

                at org.jboss.as.controller.AbstractOperationContext.executeStep(AbstractOperationContext.java:327) [jboss-as-controller-7.1.0.Alpha2-SNAPSHOT.jar:7.1.0.Alpha2-SNAPSHOT]

                at org.jboss.as.controller.AbstractOperationContext.doCompleteStep(AbstractOperationContext.java:221) [jboss-as-controller-7.1.0.Alpha2-SNAPSHOT.jar:7.1.0.Alpha2-SNAPSHOT]

                at org.jboss.as.controller.AbstractOperationContext.completeStep(AbstractOperationContext.java:157) [jboss-as-controller-7.1.0.Alpha2-SNAPSHOT.jar:7.1.0.Alpha2-SNAPSHOT]

                at org.jboss.as.controller.ModelControllerImpl.execute(ModelControllerImpl.java:112) [jboss-as-controller-7.1.0.Alpha2-SNAPSHOT.jar:7.1.0.Alpha2-SNAPSHOT]

                at org.jboss.as.controller.ModelControllerImpl$1.execute(ModelControllerImpl.java:288) [jboss-as-controller-7.1.0.Alpha2-SNAPSHOT.jar:7.1.0.Alpha2-SNAPSHOT]

                at org.jboss.as.controller.ModelControllerImpl$1.execute(ModelControllerImpl.java:278) [jboss-as-controller-7.1.0.Alpha2-SNAPSHOT.jar:7.1.0.Alpha2-SNAPSHOT]

                at org.jboss.as.jdr.ModelControllerClientProxy.execute(ModelControllerClientProxy.java:36)

                at sun.reflect.NativeMethodAccessorImpl.invoke0(Native Method) [:1.6.0_27]

                at sun.reflect.NativeMethodAccessorImpl.invoke(NativeMethodAccessorImpl.java:39) [:1.6.0_27]

                at sun.reflect.DelegatingMethodAccessorImpl.invoke(DelegatingMethodAccessorImpl.java:25) [:1.6.0_27]

                at java.lang.reflect.Method.invoke(Method.java:597) [:1.6.0_27]

                at org.python.core.PyReflectedFunction.__call__(PyReflectedFunction.java:186)

                at org.python.core.PyReflectedFunction.__call__(PyReflectedFunction.java:204)

                at org.python.core.PyObject.__call__(PyObject.java:404)

                at org.python.core.PyObject.__call__(PyObject.java:408)

                at org.python.core.PyMethod.__call__(PyMethod.java:124)

                at sos.plugins.eap6$py.query_java$11(C:\jboss-as\build\target\jboss-as-7.1.0.Alpha2-SNAPSHOT\modules\org\jboss\as\jdr\main\jboss-as-sos-7.1.0.Alpha2-SNAPSHOT.jar\sos\plugins\eap6.py:164)

                at sos.plugins.eap6$py.call_function(C:\jboss-as\build\target\jboss-as-7.1.0.Alpha2-SNAPSHOT\modules\org\jboss\as\jdr\main\jboss-as-sos-7.1.0.Alpha2-SNAPSHOT.jar\sos\plugins\eap6.py)

                at org.python.core.PyTableCode.call(PyTableCode.java:165)

                at org.python.core.PyBaseCode.call(PyBaseCode.java:149)

                at org.python.core.PyFunction.__call__(PyFunction.java:327)

                at org.python.core.PyMethod.__call__(PyMethod.java:124)

                at sos.plugins.eap6$py.query$10(C:\jboss-as\build\target\jboss-as-7.1.0.Alpha2-SNAPSHOT\modules\org\jboss\as\jdr\main\jboss-as-sos-7.1.0.Alpha2-SNAPSHOT.jar\sos\plugins\eap6.py:148)

                at sos.plugins.eap6$py.call_function(C:\jboss-as\build\target\jboss-as-7.1.0.Alpha2-SNAPSHOT\modules\org\jboss\as\jdr\main\jboss-as-sos-7.1.0.Alpha2-SNAPSHOT.jar\sos\plugins\eap6.py)

                at org.python.core.PyTableCode.call(PyTableCode.java:165)

                at org.python.core.PyBaseCode.call(PyBaseCode.java:149)

                at org.python.core.PyFunction.__call__(PyFunction.java:327)

                at org.python.core.PyMethod.__call__(PyMethod.java:124)

                at sos.plugins.eap6$py.get_online_data$13(C:\jboss-as\build\target\jboss-as-7.1.0.Alpha2-SNAPSHOT\modules\org\jboss\as\jdr\main\jboss-as-sos-7.1.0.Alpha2-SNAPSHOT.jar\sos\plugins\eap6.py:216)

                at sos.plugins.eap6$py.call_function(C:\jboss-as\build\target\jboss-as-7.1.0.Alpha2-SNAPSHOT\modules\org\jboss\as\jdr\main\jboss-as-sos-7.1.0.Alpha2-SNAPSHOT.jar\sos\plugins\eap6.py)

                at org.python.core.PyTableCode.call(PyTableCode.java:165)

                at org.python.core.PyBaseCode.call(PyBaseCode.java:134)

                at org.python.core.PyFunction.__call__(PyFunction.java:317)

                at org.python.core.PyMethod.__call__(PyMethod.java:109)

                at sos.plugins.eap6$py.setup$15(C:\jboss-as\build\target\jboss-as-7.1.0.Alpha2-SNAPSHOT\modules\org\jboss\as\jdr\main\jboss-as-sos-7.1.0.Alpha2-SNAPSHOT.jar\sos\plugins\eap6.py:275)

                at sos.plugins.eap6$py.call_function(C:\jboss-as\build\target\jboss-as-7.1.0.Alpha2-SNAPSHOT\modules\org\jboss\as\jdr\main\jboss-as-sos-7.1.0.Alpha2-SNAPSHOT.jar\sos\plugins\eap6.py)

                at org.python.core.PyTableCode.call(PyTableCode.java:165)

                at org.python.core.PyBaseCode.call(PyBaseCode.java:134)

                at org.python.core.PyFunction.__call__(PyFunction.java:317)

                at org.python.core.PyMethod.__call__(PyMethod.java:109)

                at sos.sosreport$py.setup$49(C:\jboss-as\build\target\jboss-as-7.1.0.Alpha2-SNAPSHOT\modules\org\jboss\as\jdr\main\jboss-as-sos-7.1.0.Alpha2-SNAPSHOT.jar\sos\sosreport.py:736)

                at sos.sosreport$py.call_function(C:\jboss-as\build\target\jboss-as-7.1.0.Alpha2-SNAPSHOT\modules\org\jboss\as\jdr\main\jboss-as-sos-7.1.0.Alpha2-SNAPSHOT.jar\sos\sosreport.py)

                at org.python.core.PyTableCode.call(PyTableCode.java:165)

                at org.python.core.PyBaseCode.call(PyBaseCode.java:134)

                at org.python.core.PyFunction.__call__(PyFunction.java:317)

                at org.python.core.PyMethod.__call__(PyMethod.java:109)

                at sos.sosreport$py.main$58(C:\jboss-as\build\target\jboss-as-7.1.0.Alpha2-SNAPSHOT\modules\org\jboss\as\jdr\main\jboss-as-sos-7.1.0.Alpha2-SNAPSHOT.jar\sos\sosreport.py:948)

                at sos.sosreport$py.call_function(C:\jboss-as\build\target\jboss-as-7.1.0.Alpha2-SNAPSHOT\modules\org\jboss\as\jdr\main\jboss-as-sos-7.1.0.Alpha2-SNAPSHOT.jar\sos\sosreport.py)

                at org.python.core.PyTableCode.call(PyTableCode.java:165)

                at org.python.core.PyBaseCode.call(PyBaseCode.java:134)

                at org.python.core.PyFunction.__call__(PyFunction.java:317)

                at org.python.pycode._pyx12.f$0(<string>:1)

                at org.python.pycode._pyx12.call_function(<string>)

                at org.python.core.PyTableCode.call(PyTableCode.java:165)

                at org.python.core.PyCode.call(PyCode.java:18)

                at org.python.core.Py.runCode(Py.java:1261)

                at org.python.core.Py.exec(Py.java:1305)

                at org.python.util.PythonInterpreter.exec(PythonInterpreter.java:206)

                at org.jboss.as.jdr.SosInterpreter.collect(SosInterpreter.java:94)

                at org.jboss.as.jdr.JdrReportService.collect(JdrReportService.java:92)

                at org.jboss.as.jdr.JdrReportRequestHandler$1.execute(JdrReportRequestHandler.java:71)

                at org.jboss.as.controller.AbstractOperationContext.executeStep(AbstractOperationContext.java:327) [jboss-as-controller-7.1.0.Alpha2-SNAPSHOT.jar:7.1.0.Alpha2-SNAPSHOT]

                at org.jboss.as.controller.AbstractOperationContext.doCompleteStep(AbstractOperationContext.java:221) [jboss-as-controller-7.1.0.Alpha2-SNAPSHOT.jar:7.1.0.Alpha2-SNAPSHOT]

                at org.jboss.as.controller.AbstractOperationContext.completeStep(AbstractOperationContext.java:157) [jboss-as-controller-7.1.0.Alpha2-SNAPSHOT.jar:7.1.0.Alpha2-SNAPSHOT]

                at org.jboss.as.jdr.JdrReportRequestHandler.execute(JdrReportRequestHandler.java:87)

                at org.jboss.as.controller.AbstractOperationContext.executeStep(AbstractOperationContext.java:327) [jboss-as-controller-7.1.0.Alpha2-SNAPSHOT.jar:7.1.0.Alpha2-SNAPSHOT]

                at org.jboss.as.controller.AbstractOperationContext.doCompleteStep(AbstractOperationContext.java:221) [jboss-as-controller-7.1.0.Alpha2-SNAPSHOT.jar:7.1.0.Alpha2-SNAPSHOT]

                at org.jboss.as.controller.AbstractOperationContext.completeStep(AbstractOperationContext.java:157) [jboss-as-controller-7.1.0.Alpha2-SNAPSHOT.jar:7.1.0.Alpha2-SNAPSHOT]

                at org.jboss.as.controller.ModelControllerImpl$DefaultPrepareStepHandler.execute(ModelControllerImpl.java:418) [jboss-as-controller-7.1.0.Alpha2-SNAPSHOT.jar:7.1.0.Alpha2-SNAPSHOT]

                at org.jboss.as.controller.AbstractOperationContext.executeStep(AbstractOperationContext.java:327) [jboss-as-controller-7.1.0.Alpha2-SNAPSHOT.jar:7.1.0.Alpha2-SNAPSHOT]

                at org.jboss.as.controller.AbstractOperationContext.doCompleteStep(AbstractOperationContext.java:221) [jboss-as-controller-7.1.0.Alpha2-SNAPSHOT.jar:7.1.0.Alpha2-SNAPSHOT]

                at org.jboss.as.controller.AbstractOperationContext.completeStep(AbstractOperationContext.java:157) [jboss-as-controller-7.1.0.Alpha2-SNAPSHOT.jar:7.1.0.Alpha2-SNAPSHOT]

                at org.jboss.as.controller.ModelControllerImpl.execute(ModelControllerImpl.java:112) [jboss-as-controller-7.1.0.Alpha2-SNAPSHOT.jar:7.1.0.Alpha2-SNAPSHOT]

                at org.jboss.as.controller.remote.ModelControllerClientOperationHandler$ExecuteRequestHandler.doProcessRequest(ModelControllerClientOperationHandler.java:158) [jboss-as-controller-7.1.0.Alpha2-SNAPSHOT.jar:7.1.0.Alpha2-SNAPSHOT]

                at org.jboss.as.controller.remote.ModelControllerClientOperationHandler$ExecuteRequestHandler.processRequest(ModelControllerClientOperationHandler.java:111) [jboss-as-controller-7.1.0.Alpha2-SNAPSHOT.jar:7.1.0.Alpha2-SNAPSHOT]

                at org.jboss.as.protocol.mgmt.ManagementChannel$RequestReceiver.processRequest(ManagementChannel.java:283) [jboss-as-protocol-7.1.0.Alpha2-SNAPSHOT.jar:7.1.0.Alpha2-SNAPSHOT]

                at org.jboss.as.protocol.mgmt.ManagementChannel$RequestReceiver.access$500(ManagementChannel.java:257) [jboss-as-protocol-7.1.0.Alpha2-SNAPSHOT.jar:7.1.0.Alpha2-SNAPSHOT]

                at org.jboss.as.protocol.mgmt.ManagementChannel.doHandle(ManagementChannel.java:158) [jboss-as-protocol-7.1.0.Alpha2-SNAPSHOT.jar:7.1.0.Alpha2-SNAPSHOT]

                at org.jboss.as.protocol.ProtocolChannel.handleMessage(ProtocolChannel.java:159) [jboss-as-protocol-7.1.0.Alpha2-SNAPSHOT.jar:7.1.0.Alpha2-SNAPSHOT]

                at org.jboss.remoting3.remote.RemoteConnectionChannel$5.run(RemoteConnectionChannel.java:409) [jboss-remoting-3.2.0.Beta6.jar:3.2.0.Beta6]

                at java.util.concurrent.ThreadPoolExecutor$Worker.runTask(ThreadPoolExecutor.java:886) [:1.6.0_27]

                at java.util.concurrent.ThreadPoolExecutor$Worker.run(ThreadPoolExecutor.java:908) [:1.6.0_27]

                at java.lang.Thread.run(Thread.java:662) [:1.6.0_27]

                at org.jboss.remoting3.EndpointImpl$EndpointThread.run(EndpointImpl.java:624) [jboss-remoting-3.2.0.Beta6.jar:3.2.0.Beta6]

       

       

      09:32:23,682 INFO  [org.jboss.as.jdr] (MainThread) JBAS014501: Completed creation of a JBoss Diagnostic Report (JDR).

        • 1. Re: JDR : generate-jdr-report throwing exception
          Jesse Jaggars Newbie

          Hey Vimal,

           

          You have encountered two known issues with running the JDR report. Both of which are going to be worked around in the next pull request sent upstream.  These errors don't necessiarily indicate a failure as you should still get an archive produced by JDR.

           

          Jesse

          • 2. Re: JDR : generate-jdr-report throwing exception
            Vimal Kansal Newbie

            Yup, I do get the report. But in the report itself I see errors and also when I am running AS7 on a Windows platform, the report says it is going to collect info about Red Hat Enterprise Linux :

             

             

             

             

            2011-11-10 10:26:35,566 INFO:

            sosreport (version @SOSVERSION@)

             

             

            2011-11-10 10:26:36,565 INFO: This utility will collect some detailed  information about the

            hardware and setup of your Red Hat Enterprise Linux system.

            The information is collected and an archive is  packaged under

            /tmp, which you can send to a support representative.

            Red Hat Enterprise Linux will use this information for diagnostic purposes ONLY

            and it will be considered confidential information.

             

             

            This process may take a while to complete.

            No changes will be made to your system.

             

             

             

             

            2011-11-10 10:26:37,545 ERROR: ERROR: reading manifest from C:\jboss-as\build\target\jboss-as-7.1.0.Alpha2-SNAPSHOT\modules\javax\inject\api\main\javax.inject-1.jar.  Error: 'META-INF/MANIFEST.MF'

            2011-11-10 10:26:39,681 ERROR: ERROR: reading manifest from C:\jboss-as\build\target\jboss-as-7.1.0.Alpha2-SNAPSHOT\modules\org\jboss\resteasy\resteasy-atom-provider\main\resteasy-atom-provider-2.2.3.GA-jandex.jar.  Error: 'META-INF/MANIFEST.MF'

            2011-11-10 10:26:39,687 ERROR: ERROR: reading manifest from C:\jboss-as\build\target\jboss-as-7.1.0.Alpha2-SNAPSHOT\modules\org\jboss\resteasy\resteasy-jackson-provider\main\resteasy-jackson-provider-2.2.3.GA-jandex.jar.  Error: 'META-INF/MANIFEST.MF'

            2011-11-10 10:26:39,690 ERROR: ERROR: reading manifest from C:\jboss-as\build\target\jboss-as-7.1.0.Alpha2-SNAPSHOT\modules\org\jboss\resteasy\resteasy-jaxb-provider\main\resteasy-jaxb-provider-2.2.3.GA-jandex.jar.  Error: 'META-INF/MANIFEST.MF'

            2011-11-10 10:26:39,698 ERROR: ERROR: reading manifest from C:\jboss-as\build\target\jboss-as-7.1.0.Alpha2-SNAPSHOT\modules\org\jboss\resteasy\resteasy-jaxrs\main\async-http-servlet-3.0-2.2.3.GA-jandex.jar.  Error: 'META-INF/MANIFEST.MF'

            2011-11-10 10:26:39,700 ERROR: ERROR: reading manifest from C:\jboss-as\build\target\jboss-as-7.1.0.Alpha2-SNAPSHOT\modules\org\jboss\resteasy\resteasy-jaxrs\main\resteasy-jaxrs-2.2.3.GA-jandex.jar.  Error: 'META-INF/MANIFEST.MF'

            2011-11-10 10:26:39,714 ERROR: ERROR: reading manifest from C:\jboss-as\build\target\jboss-as-7.1.0.Alpha2-SNAPSHOT\modules\org\jboss\resteasy\resteasy-jsapi\main\resteasy-jsapi-2.2.3.GA-jandex.jar.  Error: 'META-INF/MANIFEST.MF'

            2011-11-10 10:26:39,717 ERROR: ERROR: reading manifest from C:\jboss-as\build\target\jboss-as-7.1.0.Alpha2-SNAPSHOT\modules\org\jboss\resteasy\resteasy-multipart-provider\main\resteasy-multipart-provider-2.2.3.GA-jandex.jar.  Error: 'META-INF/MANIFEST.MF'

            2011-11-10 10:26:53,348 INFO:  Running plugins. Please wait ...

            2011-11-10 10:26:53,348 INFO:

            2011-11-10 10:26:53,391 INFO:

            • 3. Re: JDR : generate-jdr-report throwing exception
              Jesse Jaggars Newbie

              Hey Vimal,

               

              I think both of these things are things that will be cleaned up very soon. I think that the error messages that refer to META-INF/MANIFEST.MF are a little alarming, but really just indicate that there was no manifest to read from that jar file. In the future we will likely just report to the user that we looked for a manifest but did not find one.

               

              The fact that JDR reported that it was collecting from a RHEL system is clearly a bug that will likely be cleaned up in the next pull request.

               

              Thanks,

              Jesse

              • 4. Re: JDR : generate-jdr-report throwing exception
                janus1999 peng Newbie

                I build source under win7 64bit get the same error:

                 

                 

                2012-5-9 16:03:09 org.jboss.as.controller.AbstractOperationContext executeStep

                ERROR: JBAS014612: Operation ("dump-all-threads") failed - address: ([

                    ("core-service" => "platform-mbean"),

                    ("type" => "threading")

                ])

                java.lang.IllegalArgumentException: newValue is null

                          at org.jboss.dmr.ModelNode.set(ModelNode.java:458)

                          at org.jboss.as.platform.mbean.PlatformMBeanUtil.getDetypedStackTraceElement(PlatformMBeanUtil.java:188)

                          at org.jboss.as.platform.mbean.PlatformMBeanUtil.getDetypedThreadInfo(PlatformMBeanUtil.java:142)

                          at org.jboss.as.platform.mbean.ThreadMXBeanDumpAllThreadsHandler.execute(ThreadMXBeanDumpAllThreadsHandler.java:71)

                          at org.jboss.as.controller.AbstractOperationContext.executeStep(AbstractOperationContext.java:397)

                          at org.jboss.as.controller.AbstractOperationContext.doCompleteStep(AbstractOperationContext.java:284)

                          at org.jboss.as.controller.AbstractOperationContext.completeStep(AbstractOperationContext.java:211)

                          at org.jboss.as.controller.ModelControllerImpl$DefaultPrepareStepHandler.execute(ModelControllerImpl.java:473)

                          at org.jboss.as.controller.AbstractOperationContext.executeStep(AbstractOperationContext.java:397)

                          at org.jboss.as.controller.AbstractOperationContext.doCompleteStep(AbstractOperationContext.java:284)

                          at org.jboss.as.controller.AbstractOperationContext.completeStep(AbstractOperationContext.java:211)

                          at org.jboss.as.controller.ModelControllerImpl.internalExecute(ModelControllerImpl.java:126)

                          at org.jboss.as.controller.ModelControllerImpl.execute(ModelControllerImpl.java:111)

                          at org.jboss.as.controller.ModelControllerImpl$1.execute(ModelControllerImpl.java:311)

                          at org.jboss.as.controller.ModelControllerImpl$1.execute(ModelControllerImpl.java:301)

                          at org.jboss.as.platform.mbean.PlatformMBeanResourceUnitTestCase.executeOp(PlatformMBeanResourceUnitTestCase.java:601)

                          at org.jboss.as.platform.mbean.PlatformMBeanResourceUnitTestCase.testThreadingMXBean(PlatformMBeanResourceUnitTestCase.java:375)

                          at sun.reflect.NativeMethodAccessorImpl.invoke0(Native Method)

                          at sun.reflect.NativeMethodAccessorImpl.invoke(Unknown Source)

                          at sun.reflect.DelegatingMethodAccessorImpl.invoke(Unknown Source)

                          at java.lang.reflect.Method.invoke(Unknown Source)

                          at org.junit.runners.model.FrameworkMethod$1.runReflectiveCall(FrameworkMethod.java:45)

                          at org.junit.internal.runners.model.ReflectiveCallable.run(ReflectiveCallable.java:15)

                          at org.junit.runners.model.FrameworkMethod.invokeExplosively(FrameworkMethod.java:42)

                          at org.junit.internal.runners.statements.InvokeMethod.evaluate(InvokeMethod.java:20)

                          at org.junit.runners.ParentRunner.runLeaf(ParentRunner.java:263)

                          at org.junit.runners.BlockJUnit4ClassRunner.runChild(BlockJUnit4ClassRunner.java:68)

                          at org.junit.runners.BlockJUnit4ClassRunner.runChild(BlockJUnit4ClassRunner.java:47)

                          at org.junit.runners.ParentRunner$3.run(ParentRunner.java:231)

                          at org.junit.runners.ParentRunner$1.schedule(ParentRunner.java:60)

                          at org.junit.runners.ParentRunner.runChildren(ParentRunner.java:229)

                          at org.junit.runners.ParentRunner.access$000(ParentRunner.java:50)

                          at org.junit.runners.ParentRunner$2.evaluate(ParentRunner.java:222)

                          at org.junit.internal.runners.statements.RunBefores.evaluate(RunBefores.java:28)

                          at org.junit.internal.runners.statements.RunAfters.evaluate(RunAfters.java:30)

                          at org.junit.runners.ParentRunner.run(ParentRunner.java:300)

                          at org.apache.maven.surefire.junit4.JUnit4Provider.execute(JUnit4Provider.java:234)

                          at org.apache.maven.surefire.junit4.JUnit4Provider.executeTestSet(JUnit4Provider.java:133)

                          at org.apache.maven.surefire.junit4.JUnit4Provider.invoke(JUnit4Provider.java:114)

                          at sun.reflect.NativeMethodAccessorImpl.invoke0(Native Method)

                          at sun.reflect.NativeMethodAccessorImpl.invoke(Unknown Source)

                          at sun.reflect.DelegatingMethodAccessorImpl.invoke(Unknown Source)

                          at java.lang.reflect.Method.invoke(Unknown Source)

                          at org.apache.maven.surefire.util.ReflectionUtils.invokeMethodWithArray(ReflectionUtils.java:188)

                          at org.apache.maven.surefire.booter.ProviderFactory$ProviderProxy.invoke(ProviderFactory.java:166)

                          at org.apache.maven.surefire.booter.ProviderFactory.invokeProvider(ProviderFactory.java:86)

                          at org.apache.maven.surefire.booter.ForkedBooter.runSuitesInProcess(ForkedBooter.java:101)

                          at org.apache.maven.surefire.booter.ForkedBooter.main(ForkedBooter.java:74)

                Tests run: 12, Failures: 1, Errors: 0, Skipped: 1, Time elapsed: 0.509 sec <<< FAILURE!

                • 5. Re: JDR : generate-jdr-report throwing exception
                  Tomaz Cerar Master

                  Hi,

                   

                  What source you ware building? as I am building latest upstream on win7 64bit and everything goes trough as expected without any test failures.

                  there ware some recent fixes for jdr on windows...

                   

                   

                  --

                  tomaz

                  • 6. Re: JDR : generate-jdr-report throwing exception
                    janus1999 peng Newbie

                    I get the lastest version from github today.

                    • 7. Re: JDR : generate-jdr-report throwing exception
                      Tomaz Cerar Master

                      hey,

                       

                      what is this test that failes for you? part of as7 codebase or some of your own tests?

                       

                      and how do you run as7 build to get this failure?

                       

                      btw, you can come to irc channel #jboss-as7

                       

                      --

                      tomaz

                      • 8. Re: JDR : generate-jdr-report throwing exception
                        janus1999 peng Newbie

                        the error test is org.jboss.as.platform.mbean.PlatformMBeanResourceUnitTestCase, it's part of as7 codebase.

                         

                        i build the newest source on windows7 64bit, sun jdk16. and i run build.bat to build the souce.

                        • 9. Re: JDR : generate-jdr-report throwing exception
                          Tomaz Cerar Master

                          Hi,

                           

                          this is really strange, I build as7 on win7 64bit / sun jdk6 regulary and cannot reproduce failed test you have.

                          maybe you have corrupt local maven repo, can you try with clean one?