1 Reply Latest reply on Apr 4, 2008 1:45 PM by Clint Popetz

    Default UnitTest throws Exception: Error installing to Described: name=BeanDeployer

    Michael Imari Newbie

      Hi,


      I created a SEAM-Project (jboss-seam-2.0.1.GA) with JBoss-Tools 2.0.1 GA using Eclipse 3.3.1.1 (M20071023-1652).
      Everything is default.


      Then I ran the UnitTest org.domain.FF.test.ActionTest.


      The following error occurs. I shortend the stacktrace because of the text limit of this forum.


      Any hints?


      Regards,


      Mika



      [Parser] Running:
        C:\test\workspace_demo\FF-test\temp-testng-customsuite.xml
      
      ERROR 
      [org.jboss.kernel.plugins.dependency.AbstractKernelController] Error installing to Described: name=BeanDeployer st
      ate=PreInstall
      java.lang.RuntimeException: java.lang.reflect.UndeclaredThrowableException
           at org.jboss.aop.util.ClassInfoMethodHashing.methodHash(ClassInfoMethodHashing.java:70)
           at org.jboss.aop.util.ClassInfoMethodHashing.addDeclaredMethods(ClassInfoMethodHashing.java:169)
           at org.jboss.aop.util.ClassInfoMethodHashing.populateMethodTables(ClassInfoMethodHashing.java:182)
           at org.jboss.aop.util.ClassInfoMethodHashing.populateMethodTables(ClassInfoMethodHashing.java:181)
           at org.jboss.aop.util.ClassInfoMethodHashing.populateMethodTables(ClassInfoMethodHashing.java:181)
           at org.jboss.aop.util.ClassInfoMethodHashing.populateMethodTables(ClassInfoMethodHashing.java:181)
           at org.jboss.aop.util.ClassInfoMethodHashing.populateMethodTables(ClassInfoMethodHashing.java:181)
           at org.jboss.aop.util.ClassInfoMethodHashing.populateMethodTables(ClassInfoMethodHashing.java:181)
           at org.jboss.aop.util.ClassInfoMethodHashing.getMethodMap(ClassInfoMethodHashing.java:188)
           at org.jboss.aop.microcontainer.integration.AOPDependencyBuilder.getMethodAnnotationDependencies(AOPDependencyBuilder.j
      ava:197)
           at org.jboss.aop.microcontainer.integration.AOPDependencyBuilder.getAnnotationDependencies(AOPDependencyBuilder.java:15
      2)
           at org.jboss.aop.microcontainer.integration.AOPDependencyBuilder.getDependencies(AOPDependencyBuilder.java:130)
           at org.jboss.classadapter.plugins.BasicClassAdapter.getDependencies(BasicClassAdapter.java:80)
           at org.jboss.beans.info.plugins.AbstractBeanInfo.getDependencies(AbstractBeanInfo.java:211)
           at org.jboss.kernel.plugins.dependency.DescribeAction.installActionInternal(DescribeAction.java:53)
           at org.jboss.kernel.plugins.dependency.KernelControllerContextAction.installAction(KernelControllerContextAction.java:1
      35)
           at org.jboss.kernel.plugins.dependency.KernelControllerContextAction.installAction(KernelControllerContextAction.java:4
      6)
           at org.jboss.dependency.plugins.action.SimpleControllerContextAction.simpleInstallAction(SimpleControllerContextAction.
      java:62)
           at org.jboss.dependency.plugins.action.AccessControllerContextAction.install(AccessControllerContextAction.java:71)
           at org.jboss.dependency.plugins.AbstractControllerContextActions.install(AbstractControllerContextActions.java:51)
           at org.jboss.dependency.plugins.AbstractControllerContext.install(AbstractControllerContext.java:327)
           at org.jboss.dependency.plugins.AbstractController.install(AbstractController.java:1309)
           at org.jboss.dependency.plugins.AbstractController.incrementState(AbstractController.java:734)
           at org.jboss.dependency.plugins.AbstractController.resolveContexts(AbstractController.java:862)
           at org.jboss.dependency.plugins.AbstractController.resolveContexts(AbstractController.java:784)
           at org.jboss.dependency.plugins.AbstractController.install(AbstractController.java:574)
           at org.jboss.dependency.plugins.AbstractController.install(AbstractController.java:398)
           at org.jboss.kernel.plugins.deployment.AbstractKernelDeployer.deployBean(AbstractKernelDeployer.java:309)
           at org.jboss.kernel.plugins.deployment.AbstractKernelDeployer.deployBeans(AbstractKernelDeployer.java:279)
           at org.jboss.kernel.plugins.deployment.AbstractKernelDeployer.deploy(AbstractKernelDeployer.java:130)
           at org.jboss.kernel.plugins.deployment.xml.BeanXMLDeployer.deploy(BeanXMLDeployer.java:96)
           at org.jboss.embedded.Bootstrap.deployBaseBootstrapUrl(Bootstrap.java:130)
           at org.jboss.embedded.Bootstrap.bootstrapURL(Bootstrap.java:142)
           at org.jboss.embedded.Bootstrap.bootstrap(Bootstrap.java:183)
           at org.jboss.embedded.Bootstrap.bootstrap(Bootstrap.java:195)
           at org.jboss.seam.mock.EmbeddedBootstrap.startAndDeployResources(EmbeddedBootstrap.java:11)
           at org.jboss.seam.mock.BaseSeamTest.startJbossEmbeddedIfNecessary(BaseSeamTest.java:1041)
           at org.jboss.seam.mock.BaseSeamTest.startSeam(BaseSeamTest.java:935)
           at org.jboss.seam.mock.BaseSeamTest.init(BaseSeamTest.java:923)
           at org.jboss.seam.mock.SeamTest.init(SeamTest.java:42)
           at sun.reflect.NativeMethodAccessorImpl.invoke0(Native Method)
           at sun.reflect.NativeMethodAccessorImpl.invoke(Unknown Source)
           at sun.reflect.DelegatingMethodAccessorImpl.invoke(Unknown Source)
           at java.lang.reflect.Method.invoke(Unknown Source)
           at org.testng.internal.MethodHelper.invokeMethod(MethodHelper.java:580)
           at org.testng.internal.Invoker.invokeConfigurationMethod(Invoker.java:398)
           at org.testng.internal.Invoker.invokeConfigurations(Invoker.java:145)
           at org.testng.internal.Invoker.invokeConfigurations(Invoker.java:82)
           at org.testng.internal.TestMethodWorker.invokeBeforeClassMethods(TestMethodWorker.java:166)
           at org.testng.internal.TestMethodWorker.run(TestMethodWorker.java:103)
           at org.testng.TestRunner.runWorkers(TestRunner.java:689)
           at org.testng.TestRunner.privateRun(TestRunner.java:566)
           at org.testng.TestRunner.run(TestRunner.java:466)
           at org.testng.SuiteRunner.runTest(SuiteRunner.java:301)
           at org.testng.SuiteRunner.runSequentially(SuiteRunner.java:296)
           at org.testng.SuiteRunner.privateRun(SuiteRunner.java:276)
           at org.testng.SuiteRunner.run(SuiteRunner.java:191)
           at org.testng.TestNG.createAndRunSuiteRunners(TestNG.java:808)
           at org.testng.TestNG.runSuitesLocally(TestNG.java:776)
           at org.testng.TestNG.run(TestNG.java:701)
           at org.testng.remote.RemoteTestNG.run(RemoteTestNG.java:73)
           at org.testng.remote.RemoteTestNG.main(RemoteTestNG.java:124)
      Caused by: java.lang.reflect.UndeclaredThrowableException
           at org.jboss.reflect.plugins.ArrayInfoImpl.getType(ArrayInfoImpl.java:103)
           at org.jboss.reflect.plugins.ClassInfoImpl.isArray(ClassInfoImpl.java:495)
           at org.jboss.aop.util.ClassInfoMethodHashing.getTypeString(ClassInfoMethodHashing.java:149)
           at org.jboss.aop.util.ClassInfoMethodHashing.methodHash(ClassInfoMethodHashing.java:53)
           ... 61 more
      Caused by: java.lang.ClassNotFoundException: [Ljava.lang.Class;
           at java.net.URLClassLoader$1.run(Unknown Source)
           at java.security.AccessController.doPrivileged(Native Method)
           at java.net.URLClassLoader.findClass(Unknown Source)
           at java.lang.ClassLoader.loadClass(Unknown Source)
           at sun.misc.Launcher$AppClassLoader.loadClass(Unknown Source)
           at java.lang.ClassLoader.loadClass(Unknown Source)
           at org.jboss.reflect.plugins.introspection.IntrospectionTypeInfoFactoryImpl.resolveComplexTypeInfo(IntrospectionTypeInf
      oFactoryImpl.java:367)
           at org.jboss.reflect.plugins.introspection.IntrospectionTypeInfoFactoryImpl.getTypeInfo(IntrospectionTypeInfoFactoryImp
      l.java:344)
           at org.jboss.reflect.plugins.introspection.IntrospectionTypeInfoFactory.getTypeInfo(IntrospectionTypeInfoFactory.java:5
      4)
           at org.jboss.reflect.plugins.ArrayInfoImpl.getType(ArrayInfoImpl.java:99)
           ... 64 more
      ERROR [org.jboss.kernel.plugins.dependency.AbstractKernelController] Error installing to Described: name=KernelDeploymen
      tDeployer state=PreInstall
      java.lang.RuntimeException: java.lang.reflect.UndeclaredThrowableException
           at org.jboss.aop.util.ClassInfoMethodHashing.methodHash(ClassInfoMethodHashing.java:70)
           at org.jboss.aop.util.ClassInfoMethodHashing.addDeclaredMethods(ClassInfoMethodHashing.java:169)
           at org.jboss.aop.util.ClassInfoMethodHashing.populateMethodTables(ClassInfoMethodHashing.java:182)
           at org.jboss.aop.util.ClassInfoMethodHashing.populateMethodTables(ClassInfoMethodHashing.java:181)
           at org.jboss.aop.util.ClassInfoMethodHashing.populateMethodTables(ClassInfoMethodHashing.java:181)
           at org.jboss.aop.util.ClassInfoMethodHashing.populateMethodTables(ClassInfoMethodHashing.java:181)
           at org.jboss.aop.util.ClassInfoMethodHashing.populateMethodTables(ClassInfoMethodHashing.java:181)
           at org.jboss.aop.util.ClassInfoMethodHashing.getMethodMap(ClassInfoMethodHashing.java:188)
           at org.jboss.aop.microcontainer.integration.AOPDependencyBuilder.getMethodAnnotationDependencies(AOPDependencyBuilder.j
      ava:197)
           at org.jboss.aop.microcontainer.integration.AOPDependencyBuilder.getAnnotationDependencies(AOPDependencyBuilder.java:15
      2)
           at org.jboss.aop.microcontainer.integration.AOPDependencyBuilder.getDependencies(AOPDependencyBuilder.java:130)
           at org.jboss.classadapter.plugins.BasicClassAdapter.getDependencies(BasicClassAdapter.java:80)
           at org.jboss.beans.info.plugins.AbstractBeanInfo.getDependencies(AbstractBeanInfo.java:211)
           at org.jboss.kernel.plugins.dependency.DescribeAction.installActionInternal(DescribeAction.java:53)
           at org.jboss.kernel.plugins.dependency.KernelControllerContextAction.installAction(KernelControllerContextAction.java:1
      35)
           at org.jboss.kernel.plugins.dependency.KernelControllerContextAction.installAction(KernelControllerContextAction.java:4
      6)
           at org.jboss.dependency.plugins.action.SimpleControllerContextAction.simpleInstallAction(SimpleControllerContextAction.
      java:62)
           at org.jboss.dependency.plugins.action.AccessControllerContextAction.install(AccessControllerContextAction.java:71)
           at org.jboss.dependency.plugins.AbstractControllerContextActions.install(AbstractControllerContextActions.java:51)
           at org.jboss.dependency.plugins.AbstractControllerContext.install(AbstractControllerContext.java:327)
           at org.jboss.dependency.plugins.AbstractController.install(AbstractController.java:1309)
           at org.jboss.dependency.plugins.AbstractController.incrementState(AbstractController.java:734)
           at org.jboss.dependency.plugins.AbstractController.resolveContexts(AbstractController.java:862)
           at org.jboss.dependency.plugins.AbstractController.resolveContexts(AbstractController.java:784)
           at org.jboss.dependency.plugins.AbstractController.install(AbstractController.java:574)
           at org.jboss.dependency.plugins.AbstractController.install(AbstractController.java:398)
           at org.jboss.kernel.plugins.deployment.AbstractKernelDeployer.deployBean(AbstractKernelDeployer.java:309)
           at org.jboss.kernel.plugins.deployment.AbstractKernelDeployer.deployBeans(AbstractKernelDeployer.java:279)
           at org.jboss.kernel.plugins.deployment.AbstractKernelDeployer.deploy(AbstractKernelDeployer.java:130)
           at org.jboss.kernel.plugins.deployment.xml.BeanXMLDeployer.deploy(BeanXMLDeployer.java:96)
           at org.jboss.embedded.Bootstrap.deployBaseBootstrapUrl(Bootstrap.java:130)
           at org.jboss.embedded.Bootstrap.bootstrapURL(Bootstrap.java:142)
           at org.jboss.embedded.Bootstrap.bootstrap(Bootstrap.java:183)
           at org.jboss.embedded.Bootstrap.bootstrap(Bootstrap.java:195)
           at org.jboss.seam.mock.EmbeddedBootstrap.startAndDeployResources(EmbeddedBootstrap.java:11)
           at org.jboss.seam.mock.BaseSeamTest.startJbossEmbeddedIfNecessary(BaseSeamTest.java:1041)
           at org.jboss.seam.mock.BaseSeamTest.startSeam(BaseSeamTest.java:935)
           at org.jboss.seam.mock.BaseSeamTest.init(BaseSeamTest.java:923)
           at org.jboss.seam.mock.SeamTest.init(SeamTest.java:42)
           at sun.reflect.NativeMethodAccessorImpl.invoke0(Native Method)
           at sun.reflect.NativeMethodAccessorImpl.invoke(Unknown Source)
           at sun.reflect.DelegatingMethodAccessorImpl.invoke(Unknown Source)
           at java.lang.reflect.Method.invoke(Unknown Source)
           at org.testng.internal.MethodHelper.invokeMethod(MethodHelper.java:580)
           at org.testng.internal.Invoker.invokeConfigurationMethod(Invoker.java:398)
           at org.testng.internal.Invoker.invokeConfigurations(Invoker.java:145)
           at org.testng.internal.Invoker.invokeConfigurations(Invoker.java:82)
           at org.testng.internal.TestMethodWorker.invokeBeforeClassMethods(TestMethodWorker.java:166)
           at org.testng.internal.TestMethodWorker.run(TestMethodWorker.java:103)
           at org.testng.TestRunner.runWorkers(TestRunner.java:689)
           at org.testng.TestRunner.privateRun(TestRunner.java:566)
           at org.testng.TestRunner.run(TestRunner.java:466)
           at org.testng.SuiteRunner.runTest(SuiteRunner.java:301)
           at org.testng.SuiteRunner.runSequentially(SuiteRunner.java:296)
           at org.testng.SuiteRunner.privateRun(SuiteRunner.java:276)
           at org.testng.SuiteRunner.run(SuiteRunner.java:191)
           at org.testng.TestNG.createAndRunSuiteRunners(TestNG.java:808)
           at org.testng.TestNG.runSuitesLocally(TestNG.java:776)
           at org.testng.TestNG.run(TestNG.java:701)
           at org.testng.remote.RemoteTestNG.run(RemoteTestNG.java:73)
           at org.testng.remote.RemoteTestNG.main(RemoteTestNG.java:124)
      Caused by: java.lang.reflect.UndeclaredThrowableException
           at org.jboss.reflect.plugins.ArrayInfoImpl.getType(ArrayInfoImpl.java:103)
           at org.jboss.reflect.plugins.ClassInfoImpl.isArray(ClassInfoImpl.java:495)
           at org.jboss.aop.util.ClassInfoMethodHashing.getTypeString(ClassInfoMethodHashing.java:149)
           at org.jboss.aop.util.ClassInfoMethodHashing.methodHash(ClassInfoMethodHashing.java:53)
           ... 60 more
      Caused by: java.lang.ClassNotFoundException: [Ljava.lang.Class;
           at java.net.URLClassLoader$1.run(Unknown Source)
           at java.security.AccessController.doPrivileged(Native Method)
           at java.net.URLClassLoader.findClass(Unknown Source)
           at java.lang.ClassLoader.loadClass(Unknown Source)
           at sun.misc.Launcher$AppClassLoader.loadClass(Unknown Source)
           at java.lang.ClassLoader.loadClass(Unknown Source)
           at org.jboss.reflect.plugins.introspection.IntrospectionTypeInfoFactoryImpl.resolveComplexTypeInfo(IntrospectionTypeInf
      oFactoryImpl.java:367)
           at org.jboss.reflect.plugins.introspection.IntrospectionTypeInfoFactoryImpl.getTypeInfo(IntrospectionTypeInfoFactoryImp
      l.java:344)
           at org.jboss.reflect.plugins.introspection.IntrospectionTypeInfoFactory.getTypeInfo(IntrospectionTypeInfoFactory.java:5
      4)
           at org.jboss.reflect.plugins.ArrayInfoImpl.getType(ArrayInfoImpl.java:99)
           ... 63 more
      ERROR [org.jboss.kernel.plugins.dependency.AbstractKernelController] Error installing to Described: name=BeanMetaDataDep
      loyer state=PreInstall
      java.lang.RuntimeException: java.lang.reflect.UndeclaredThrowableException
           at org.jboss.aop.util.ClassInfoMethodHashing.methodHash(ClassInfoMethodHashing.java:70)
           at org.jboss.aop.util.ClassInfoMethodHashing.addDeclaredMethods(ClassInfoMethodHashing.java:169)
           at org.jboss.aop.util.ClassInfoMethodHashing.populateMethodTables(ClassInfoMethodHashing.java:182)
           at org.jboss.aop.util.ClassInfoMethodHashing.populateMethodTables(ClassInfoMethodHashing.java:181)
           at org.jboss.aop.util.ClassInfoMethodHashing.populateMethodTables(ClassInfoMethodHashing.java:181)
           at org.jboss.aop.util.ClassInfoMethodHashing.populateMethodTables(ClassInfoMethodHashing.java:181)
           at org.jboss.aop.util.ClassInfoMethodHashing.getMethodMap(ClassInfoMethodHashing.java:188)
           at org.jboss.aop.microcontainer.integration.AOPDependencyBuilder.getMethodAnnotationDependencies(AOPDependencyBuilder.j
      ava:197)
           at org.jboss.aop.microcontainer.integration.AOPDependencyBuilder.getAnnotationDependencies(AOPDependencyBuilder.java:15
      2)
           at org.jboss.aop.microcontainer.integration.AOPDependencyBuilder.getDependencies(AOPDependencyBuilder.java:130)
           at org.jboss.classadapter.plugins.BasicClassAdapter.getDependencies(BasicClassAdapter.java:80)
           at org.jboss.beans.info.plugins.AbstractBeanInfo.getDependencies(AbstractBeanInfo.java:211)
           at org.jboss.kernel.plugins.dependency.DescribeAction.installActionInternal(DescribeAction.java:53)
           at org.jboss.kernel.plugins.dependency.KernelControllerContextAction.installAction(KernelControllerContextAction.java:1
      35)
           at org.jboss.kernel.plugins.dependency.KernelControllerContextAction.installAction(KernelControllerContextAction.java:4
      6)
           at org.jboss.dependency.plugins.action.SimpleControllerContextAction.simpleInstallAction(SimpleControllerContextAction.
      java:62)
           at org.jboss.dependency.plugins.action.AccessControllerContextAction.install(AccessControllerContextAction.java:71)
           at org.jboss.dependency.plugins.AbstractControllerContextActions.install(AbstractControllerContextActions.java:51)
           at org.jboss.dependency.plugins.AbstractControllerContext.install(AbstractControllerContext.java:327)
           at org.jboss.dependency.plugins.AbstractController.install(AbstractController.java:1309)
           at org.jboss.dependency.plugins.AbstractController.incrementState(AbstractController.java:734)
           at org.jboss.dependency.plugins.AbstractController.resolveContexts(AbstractController.java:862)
           at org.jboss.dependency.plugins.AbstractController.resolveContexts(AbstractController.java:784)
           at org.jboss.dependency.plugins.AbstractController.install(AbstractController.java:574)
           at org.jboss.dependency.plugins.AbstractController.install(AbstractController.java:398)
           at org.jboss.kernel.plugins.deployment.AbstractKernelDeployer.deployBean(AbstractKernelDeployer.java:309)
           at org.jboss.kernel.plugins.deployment.AbstractKernelDeployer.deployBeans(AbstractKernelDeployer.java:279)
           at org.jboss.kernel.plugins.deployment.AbstractKernelDeployer.deploy(AbstractKernelDeployer.java:130)
           at org.jboss.kernel.plugins.deployment.xml.BeanXMLDeployer.deploy(BeanXMLDeployer.java:96)
           at org.jboss.embedded.Bootstrap.deployBaseBootstrapUrl(Bootstrap.java:130)
           at org.jboss.embedded.Bootstrap.bootstrapURL(Bootstrap.java:142)
           at org.jboss.embedded.Bootstrap.bootstrap(Bootstrap.java:183)
           at org.jboss.embedded.Bootstrap.bootstrap(Bootstrap.java:195)
           at org.jboss.seam.mock.EmbeddedBootstrap.startAndDeployResources(EmbeddedBootstrap.java:11)
           at org.jboss.seam.mock.BaseSeamTest.startJbossEmbeddedIfNecessary(BaseSeamTest.java:1041)
           at org.jboss.seam.mock.BaseSeamTest.startSeam(BaseSeamTest.java:935)
           at org.jboss.seam.mock.BaseSeamTest.init(BaseSeamTest.java:923)
           at org.jboss.seam.mock.SeamTest.init(SeamTest.java:42)
           at sun.reflect.NativeMethodAccessorImpl.invoke0(Native Method)
           at sun.reflect.NativeMethodAccessorImpl.invoke(Unknown Source)
           at sun.reflect.DelegatingMethodAccessorImpl.invoke(Unknown Source)
           at java.lang.reflect.Method.invoke(Unknown Source)
           at org.testng.internal.MethodHelper.invokeMethod(MethodHelper.java:580)
           at org.testng.internal.Invoker.invokeConfigurationMethod(Invoker.java:398)
           at org.testng.internal.Invoker.invokeConfigurations(Invoker.java:145)
           at org.testng.internal.Invoker.invokeConfigurations(Invoker.java:82)
           at org.testng.internal.TestMethodWorker.invokeBeforeClassMethods(TestMethodWorker.java:166)
           at org.testng.internal.TestMethodWorker.run(TestMethodWorker.java:103)
           at org.testng.TestRunner.runWorkers(TestRunner.java:689)
           at org.testng.TestRunner.privateRun(TestRunner.java:566)
           at org.testng.TestRunner.run(TestRunner.java:466)
           at org.testng.SuiteRunner.runTest(SuiteRunner.java:301)
           at org.testng.SuiteRunner.runSequentially(SuiteRunner.java:296)
           at org.testng.SuiteRunner.privateRun(SuiteRunner.java:276)
           at org.testng.SuiteRunner.run(SuiteRunner.java:191)
           at org.testng.TestNG.createAndRunSuiteRunners(TestNG.java:808)
           at org.testng.TestNG.runSuitesLocally(TestNG.java:776)
           at org.testng.TestNG.run(TestNG.java:701)
           at org.testng.remote.RemoteTestNG.run(RemoteTestNG.java:73)
           at org.testng.remote.RemoteTestNG.main(RemoteTestNG.java:124)
      Caused by: java.lang.reflect.UndeclaredThrowableException
           at org.jboss.reflect.plugins.ArrayInfoImpl.getType(ArrayInfoImpl.java:103)
           at org.jboss.reflect.plugins.ClassInfoImpl.isArray(ClassInfoImpl.java:495)
           at org.jboss.aop.util.ClassInfoMethodHashing.getTypeString(ClassInfoMethodHashing.java:149)
           at org.jboss.aop.util.ClassInfoMethodHashing.methodHash(ClassInfoMethodHashing.java:53)
           ... 59 more
      Caused by: java.lang.ClassNotFoundException: [Ljava.lang.Class;
           at java.net.URLClassLoader$1.run(Unknown Source)
           at java.security.AccessController.doPrivileged(Native Method)
           at java.net.URLClassLoader.findClass(Unknown Source)
           at java.lang.ClassLoader.loadClass(Unknown Source)
           at sun.misc.Launcher$AppClassLoader.loadClass(Unknown Source)
           at java.lang.ClassLoader.loadClass(Unknown Source)
           at org.jboss.reflect.plugins.introspection.IntrospectionTypeInfoFactoryImpl.resolveComplexTypeInfo(IntrospectionTypeInf
      oFactoryImpl.java:367)
           at org.jboss.reflect.plugins.introspection.IntrospectionTypeInfoFactoryImpl.getTypeInfo(IntrospectionTypeInfoFactoryImp
      l.java:344)
           at org.jboss.reflect.plugins.introspection.IntrospectionTypeInfoFactory.getTypeInfo(IntrospectionTypeInfoFactory.java:5
      4)
           at org.jboss.reflect.plugins.ArrayInfoImpl.getType(ArrayInfoImpl.java:99)
           ... 62 more
      ERROR 
      
      ... Removed 22 stack frames
      SKIPPED CONFIGURATION: @BeforeMethod begin
      SKIPPED CONFIGURATION: @AfterMethod end
      SKIPPED CONFIGURATION: @AfterClass cleanup
      SKIPPED: test
      
      ===============================================
          org.domain.FF.test.ActionTest
          Tests run: 1, Failures: 0, Skips: 1
          Configuration Failures: 1, Skips: 3
      ===============================================
      
      
      ===============================================
      FF-test
      Total tests run: 1, Failures: 0, Skips: 1
      Configuration Failures: 1, Skips: 3
      ===============================================