0 Replies Latest reply on Oct 3, 2012 5:30 PM by Eazy James

    problem test-continuous-integration

    Eazy James Newbie

      Hi everyone , I have problem with my test-continuous-integration

       

       

      Buildfile: C:\Work\...\build.xml

      init:

           [echo] local

      generate-jaxb-catalog-entites:

            [xjc] files are up to date

            [xjc] files are up to date

            [xjc] files are up to date

            [xjc] files are up to date

            [xjc] files are up to date

            [xjc] files are up to date

            [xjc] files are up to date

      groovy.compiletest:

      compiletest:

          [javac] C:\Work\...\build.xml:562: warning: 'includeantruntime' was not set, defaulting to build.sysclasspath=last; set to false for repeatable builds

      copytestclasses:

      buildtest:

           [copy] Copying 1 file to C:\Work\GU_Work\GUapps\test-build

      test-continuous-integration:

         [testng] [Parser] Running:

         [testng]   C:\Work\....\test-build\GuAppsContinuousIntegration2Test.xml

         [testng]   C:\Work\....\test-build\GuAppsContinuousIntegrationTest.xml

         [testng] ERROR [org.jboss.embedded.DeploymentScanner] Failed to deploy

         [testng] org.jboss.deployers.spi.DeploymentException: Error populating deployment vfsfile:/C:/Work..../bootstrap/conf/jboss-service.xml

         [testng] at org.jboss.deployers.spi.DeploymentException.rethrowAsDeploymentException(DeploymentException.java:49)

         [testng] at org.jboss.deployers.structure.spi.helpers.AbstractStructureBuilder.populateContext(AbstractStructureBuilder.java:77)

         [testng] at org.jboss.deployers.structure.spi.helpers.AbstractStructuralDeployers.determineStructure(AbstractStructuralDeployers.java:89)

         [testng] at org.jboss.deployers.plugins.main.MainDeployerImpl.determineStructure(MainDeployerImpl.java:743)

         [testng] at org.jboss.deployers.plugins.main.MainDeployerImpl.addDeployment(MainDeployerImpl.java:280)

         [testng] at org.jboss.deployers.plugins.main.MainDeployerImpl.addDeployment(MainDeployerImpl.java:237)

         [testng] at org.jboss.embedded.DeploymentGroup.add(DeploymentGroup.java:153)

         [testng] at org.jboss.embedded.DeploymentGroup.add(DeploymentGroup.java:166)

         [testng] at org.jboss.embedded.DeploymentGroup.addResource(DeploymentGroup.java:326)

         [testng] at org.jboss.embedded.DeploymentScanner.start(DeploymentScanner.java:81)

         [testng] at sun.reflect.NativeMethodAccessorImpl.invoke0(Native Method)

         [testng] at sun.reflect.NativeMethodAccessorImpl.invoke(Unknown Source)

         [testng] at sun.reflect.DelegatingMethodAccessorImpl.invoke(Unknown Source)

         [testng] at java.lang.reflect.Method.invoke(Unknown Source)

         [testng] at org.jboss.reflect.plugins.introspection.ReflectionUtils.invoke(ReflectionUtils.java:56)

         [testng] at org.jboss.reflect.plugins.introspection.ReflectMethodInfoImpl.invoke(ReflectMethodInfoImpl.java:110)

         [testng] at org.jboss.joinpoint.plugins.BasicMethodJoinPoint.dispatch(BasicMethodJoinPoint.java:66)

         [testng] at org.jboss.kernel.plugins.dependency.KernelControllerContextAction$JoinpointDispatchWrapper.execute(KernelControllerContextAction.java:214)

         [testng] at org.jboss.kernel.plugins.dependency.ExecutionWrapper.execute(ExecutionWrapper.java:45)

         [testng] at org.jboss.kernel.plugins.dependency.KernelControllerContextAction.dispatchExecutionWrapper(KernelControllerContextAction.java:108)

         [testng] at org.jboss.kernel.plugins.dependency.KernelControllerContextAction.dispatchJoinPoint(KernelControllerContextAction.java:69)

         [testng] at org.jboss.kernel.plugins.dependency.LifecycleAction.installActionInternal(LifecycleAction.java:221)

         [testng] at org.jboss.kernel.plugins.dependency.KernelControllerContextAction.installAction(KernelControllerContextAction.java:135)

         [testng] at org.jboss.kernel.plugins.dependency.KernelControllerContextAction.installAction(KernelControllerContextAction.java:46)

         [testng] at org.jboss.dependency.plugins.action.SimpleControllerContextAction.simpleInstallAction(SimpleControllerContextAction.java:62)

         [testng] at org.jboss.dependency.plugins.action.AccessControllerContextAction.install(AccessControllerContextAction.java:71)

         [testng] at org.jboss.dependency.plugins.AbstractControllerContextActions.install(AbstractControllerContextActions.java:51)

         [testng] at org.jboss.dependency.plugins.AbstractControllerContext.install(AbstractControllerContext.java:327)

         [testng] at org.jboss.dependency.plugins.AbstractController.install(AbstractController.java:1309)

         [testng] at org.jboss.dependency.plugins.AbstractController.incrementState(AbstractController.java:734)

         [testng] at org.jboss.dependency.plugins.AbstractController.resolveContexts(AbstractController.java:862)

         [testng] at org.jboss.dependency.plugins.AbstractController.resolveContexts(AbstractController.java:784)

         [testng] at org.jboss.dependency.plugins.AbstractController.install(AbstractController.java:574)

         [testng] at org.jboss.dependency.plugins.AbstractController.install(AbstractController.java:398)

         [testng] at org.jboss.kernel.plugins.deployment.AbstractKernelDeployer.deployBean(AbstractKernelDeployer.java:309)

         [testng] at org.jboss.kernel.plugins.deployment.AbstractKernelDeployer.deployBeans(AbstractKernelDeployer.java:279)

         [testng] at org.jboss.kernel.plugins.deployment.AbstractKernelDeployer.deploy(AbstractKernelDeployer.java:130)

         [testng] at org.jboss.kernel.plugins.deployment.xml.BeanXMLDeployer.deploy(BeanXMLDeployer.java:96)

         [testng] at org.jboss.embedded.Bootstrap.deployBaseBootstrapUrl(Bootstrap.java:130)

         [testng] at org.jboss.embedded.Bootstrap.bootstrapURL(Bootstrap.java:142)

         [testng] at org.jboss.embedded.Bootstrap.bootstrap(Bootstrap.java:183)

         [testng] at org.jboss.embedded.Bootstrap.bootstrap(Bootstrap.java:195)

         [testng] at org.jboss.seam.mock.EmbeddedBootstrap.startAndDeployResources(EmbeddedBootstrap.java:11)

         [testng] at org.jboss.seam.mock.AbstractSeamTest.startJbossEmbeddedIfNecessary(AbstractSeamTest.java:1024)

         [testng] at org.jboss.seam.mock.AbstractSeamTest.startSeam(AbstractSeamTest.java:915)

         [testng] at org.jboss.seam.mock.SeamTest.startSeam(SeamTest.java:58)

         [testng] at sun.reflect.NativeMethodAccessorImpl.invoke0(Native Method)

         [testng] at sun.reflect.NativeMethodAccessorImpl.invoke(Unknown Source)

         [testng] at sun.reflect.DelegatingMethodAccessorImpl.invoke(Unknown Source)

         [testng] at java.lang.reflect.Method.invoke(Unknown Source)

         [testng] at org.testng.internal.MethodHelper.invokeMethod(MethodHelper.java:607)

         [testng] at org.testng.internal.Invoker.invokeConfigurationMethod(Invoker.java:417)

         [testng] at org.testng.internal.Invoker.invokeConfigurations(Invoker.java:154)

         [testng] at org.testng.internal.Invoker.invokeConfigurations(Invoker.java:88)

         [testng] at org.testng.SuiteRunner.privateRun(SuiteRunner.java:284)

         [testng] at org.testng.SuiteRunner.run(SuiteRunner.java:204)

         [testng] at org.testng.TestNG.createAndRunSuiteRunners(TestNG.java:877)

         [testng] at org.testng.TestNG.runSuitesLocally(TestNG.java:842)

         [testng] at org.testng.TestNG.run(TestNG.java:751)

         [testng] at org.testng.TestNG.privateMain(TestNG.java:914)

         [testng] at org.testng.TestNG.main(TestNG.java:887)

         [testng] Caused by: java.lang.NoSuchMethodError: org.jboss.deployers.spi.structure.ContextInfo.getMetaDataPath()Ljava/util/List;

         [testng] at org.jboss.deployers.vfs.plugins.structure.VFSStructureBuilder.applyContextInfo(VFSStructureBuilder.java:93)

         [testng] at org.jboss.deployers.structure.spi.helpers.AbstractStructureBuilder.populateContext(AbstractStructureBuilder.java:73)

         [testng] ... 59 more

         [testng] ERROR [org.jboss.kernel.plugins.dependency.AbstractKernelController] Error installing to Start: name=ResourcesToDeploy state=Create

         [testng] org.jboss.deployers.spi.DeploymentException: Error populating deployment vfsfile:/C:/Work/...bootstrap/conf/jboss-service.xml

         [testng] at org.jboss.deployers.spi.DeploymentException.rethrowAsDeploymentException(DeploymentException.java:49)

         [testng] at org.jboss.deployers.structure.spi.helpers.AbstractStructureBuilder.populateContext(AbstractStructureBuilder.java:77)

         [testng] at org.jboss.deployers.structure.spi.helpers.AbstractStructuralDeployers.determineStructure(AbstractStructuralDeployers.java:89)

         [testng] at org.jboss.deployers.plugins.main.MainDeployerImpl.determineStructure(MainDeployerImpl.java:743)

         [testng] at org.jboss.deployers.plugins.main.MainDeployerImpl.addDeployment(MainDeployerImpl.java:280)

         [testng] at org.jboss.deployers.plugins.main.MainDeployerImpl.addDeployment(MainDeployerImpl.java:237)

         [testng] at org.jboss.embedded.DeploymentGroup.add(DeploymentGroup.java:153)

         [testng] at org.jboss.embedded.DeploymentGroup.add(DeploymentGroup.java:166)

         [testng] at org.jboss.embedded.DeploymentGroup.addResource(DeploymentGroup.java:326)

         [testng] at org.jboss.embedded.DeploymentScanner.start(DeploymentScanner.java:81)

         [testng] at sun.reflect.NativeMethodAccessorImpl.invoke0(Native Method)

         [testng] at sun.reflect.NativeMethodAccessorImpl.invoke(Unknown Source)

         [testng] at sun.reflect.DelegatingMethodAccessorImpl.invoke(Unknown Source)

         [testng] at java.lang.reflect.Method.invoke(Unknown Source)

         [testng] at org.jboss.reflect.plugins.introspection.ReflectionUtils.invoke(ReflectionUtils.java:56)

         [testng] at org.jboss.reflect.plugins.introspection.ReflectMethodInfoImpl.invoke(ReflectMethodInfoImpl.java:110)

         [testng] at org.jboss.joinpoint.plugins.BasicMethodJoinPoint.dispatch(BasicMethodJoinPoint.java:66)

         [testng] at org.jboss.kernel.plugins.dependency.KernelControllerContextAction$JoinpointDispatchWrapper.execute(KernelControllerContextAction.java:214)

         [testng] at org.jboss.kernel.plugins.dependency.ExecutionWrapper.execute(ExecutionWrapper.java:45)

         [testng] at org.jboss.kernel.plugins.dependency.KernelControllerContextAction.dispatchExecutionWrapper(KernelControllerContextAction.java:108)

         [testng] at org.jboss.kernel.plugins.dependency.KernelControllerContextAction.dispatchJoinPoint(KernelControllerContextAction.java:69)

         [testng] at org.jboss.kernel.plugins.dependency.LifecycleAction.installActionInternal(LifecycleAction.java:221)

         [testng] at org.jboss.kernel.plugins.dependency.KernelControllerContextAction.installAction(KernelControllerContextAction.java:135)

         [testng] at org.jboss.kernel.plugins.dependency.KernelControllerContextAction.installAction(KernelControllerContextAction.java:46)

         [testng] at org.jboss.dependency.plugins.action.SimpleControllerContextAction.simpleInstallAction(SimpleControllerContextAction.java:62)

         [testng] at org.jboss.dependency.plugins.action.AccessControllerContextAction.install(AccessControllerContextAction.java:71)

         [testng] at org.jboss.dependency.plugins.AbstractControllerContextActions.install(AbstractControllerContextActions.java:51)

         [testng] at org.jboss.dependency.plugins.AbstractControllerContext.install(AbstractControllerContext.java:327)

         [testng] at org.jboss.dependency.plugins.AbstractController.install(AbstractController.java:1309)

         [testng] at org.jboss.dependency.plugins.AbstractController.incrementState(AbstractController.java:734)

         [testng] at org.jboss.dependency.plugins.AbstractController.resolveContexts(AbstractController.java:862)

         [testng] at org.jboss.dependency.plugins.AbstractController.resolveContexts(AbstractController.java:784)

         [testng] at org.jboss.dependency.plugins.AbstractController.install(AbstractController.java:574)

         [testng] at org.jboss.dependency.plugins.AbstractController.install(AbstractController.java:398)

         [testng] at org.jboss.kernel.plugins.deployment.AbstractKernelDeployer.deployBean(AbstractKernelDeployer.java:309)

         [testng] at org.jboss.kernel.plugins.deployment.AbstractKernelDeployer.deployBeans(AbstractKernelDeployer.java:279)

         [testng] at org.jboss.kernel.plugins.deployment.AbstractKernelDeployer.deploy(AbstractKernelDeployer.java:130)

         [testng] at org.jboss.kernel.plugins.deployment.xml.BeanXMLDeployer.deploy(BeanXMLDeployer.java:96)

         [testng] at org.jboss.embedded.Bootstrap.deployBaseBootstrapUrl(Bootstrap.java:130)

         [testng] at org.jboss.embedded.Bootstrap.bootstrapURL(Bootstrap.java:142)

         [testng] at org.jboss.embedded.Bootstrap.bootstrap(Bootstrap.java:183)

         [testng] at org.jboss.embedded.Bootstrap.bootstrap(Bootstrap.java:195)

         [testng] at org.jboss.seam.mock.EmbeddedBootstrap.startAndDeployResources(EmbeddedBootstrap.java:11)

         [testng] at org.jboss.seam.mock.AbstractSeamTest.startJbossEmbeddedIfNecessary(AbstractSeamTest.java:1024)

         [testng] at org.jboss.seam.mock.AbstractSeamTest.startSeam(AbstractSeamTest.java:915)

         [testng] at org.jboss.seam.mock.SeamTest.startSeam(SeamTest.java:58)

         [testng] at sun.reflect.NativeMethodAccessorImpl.invoke0(Native Method)

         [testng] at sun.reflect.NativeMethodAccessorImpl.invoke(Unknown Source)

         [testng] at sun.reflect.DelegatingMethodAccessorImpl.invoke(Unknown Source)

         [testng] at java.lang.reflect.Method.invoke(Unknown Source)

         [testng] at org.testng.internal.MethodHelper.invokeMethod(MethodHelper.java:607)

         [testng] at org.testng.internal.Invoker.invokeConfigurationMethod(Invoker.java:417)

         [testng] at org.testng.internal.Invoker.invokeConfigurations(Invoker.java:154)

         [testng] at org.testng.internal.Invoker.invokeConfigurations(Invoker.java:88)

         [testng] at org.testng.SuiteRunner.privateRun(SuiteRunner.java:284)

         [testng] at org.testng.SuiteRunner.run(SuiteRunner.java:204)

         [testng] at org.testng.TestNG.createAndRunSuiteRunners(TestNG.java:877)

         [testng] at org.testng.TestNG.runSuitesLocally(TestNG.java:842)

         [testng] at org.testng.TestNG.run(TestNG.java:751)

         [testng] at org.testng.TestNG.privateMain(TestNG.java:914)

         [testng] at org.testng.TestNG.main(TestNG.java:887)

         [testng] Caused by: java.lang.NoSuchMethodError: org.jboss.deployers.spi.structure.ContextInfo.getMetaDataPath()Ljava/util/List;

         [testng] at org.jboss.deployers.vfs.plugins.structure.VFSStructureBuilder.applyContextInfo(VFSStructureBuilder.java:93)

         [testng] at org.jboss.deployers.structure.spi.helpers.AbstractStructureBuilder.populateContext(AbstractStructureBuilder.java:73)

         [testng] ... 59 more

         [testng] ERROR [org.jboss.kernel.plugins.dependency.AbstractKernelController] Error installing to Start: name=UserTransaction state=Create

         [testng] java.lang.RuntimeException: Unable to locate the transaction manager

         [testng] at org.jboss.tm.TransactionManagerLocator.locate(TransactionManagerLocator.java:105)

         [testng] at org.jboss.ejb3.tx.TxUtil.getTransactionManager(TxUtil.java:56)

         [testng] at org.jboss.embedded.adapters.LocalOnlyUserTransaction.start(LocalOnlyUserTransaction.java:69)

         [testng] at sun.reflect.NativeMethodAccessorImpl.invoke0(Native Method)

         [testng] at sun.reflect.NativeMethodAccessorImpl.invoke(Unknown Source)

         [testng] at sun.reflect.DelegatingMethodAccessorImpl.invoke(Unknown Source)

         [testng] at java.lang.reflect.Method.invoke(Unknown Source)

         [testng] at org.jboss.reflect.plugins.introspection.ReflectionUtils.invoke(ReflectionUtils.java:56)

         [testng] at org.jboss.reflect.plugins.introspection.ReflectMethodInfoImpl.invoke(ReflectMethodInfoImpl.java:110)

         [testng] at org.jboss.joinpoint.plugins.BasicMethodJoinPoint.dispatch(BasicMethodJoinPoint.java:66)

         [testng] at org.jboss.kernel.plugins.dependency.KernelControllerContextAction$JoinpointDispatchWrapper.execute(KernelControllerContextAction.java:214)

         [testng] at org.jboss.kernel.plugins.dependency.ExecutionWrapper.execute(ExecutionWrapper.java:45)

         [testng] at org.jboss.kernel.plugins.dependency.KernelControllerContextAction.dispatchExecutionWrapper(KernelControllerContextAction.java:108)

         [testng] at org.jboss.kernel.plugins.dependency.KernelControllerContextAction.dispatchJoinPoint(KernelControllerContextAction.java:69)

         [testng] at org.jboss.kernel.plugins.dependency.LifecycleAction.installActionInternal(LifecycleAction.java:221)

         [testng] at org.jboss.kernel.plugins.dependency.KernelControllerContextAction.installAction(KernelControllerContextAction.java:135)

         [testng] at org.jboss.kernel.plugins.dependency.KernelControllerContextAction.installAction(KernelControllerContextAction.java:46)

         [testng] at org.jboss.dependency.plugins.action.SimpleControllerContextAction.simpleInstallAction(SimpleControllerContextAction.java:62)

         [testng] at org.jboss.dependency.plugins.action.AccessControllerContextAction.install(AccessControllerContextAction.java:71)

         [testng] at org.jboss.dependency.plugins.AbstractControllerContextActions.install(AbstractControllerContextActions.java:51)

         [testng] at org.jboss.dependency.plugins.AbstractControllerContext.install(AbstractControllerContext.java:327)

         [testng] at org.jboss.dependency.plugins.AbstractController.install(AbstractController.java:1309)

         [testng] at org.jboss.dependency.plugins.AbstractController.incrementState(AbstractController.java:734)

         [testng] at org.jboss.dependency.plugins.AbstractController.resolveContexts(AbstractController.java:862)

         [testng] at org.jboss.dependency.plugins.AbstractController.resolveContexts(AbstractController.java:784)

         [testng] at org.jboss.dependency.plugins.AbstractController.install(AbstractController.java:574)

         [testng] at org.jboss.dependency.plugins.AbstractController.install(AbstractController.java:398)

         [testng] at org.jboss.kernel.plugins.deployment.AbstractKernelDeployer.deployBean(AbstractKernelDeployer.java:309)

         [testng] at org.jboss.kernel.plugins.deployment.AbstractKernelDeployer.deployBeans(AbstractKernelDeployer.java:279)

         [testng] at org.jboss.kernel.plugins.deployment.AbstractKernelDeployer.deploy(AbstractKernelDeployer.java:130)

         [testng] at org.jboss.kernel.plugins.deployment.xml.BeanXMLDeployer.deploy(BeanXMLDeployer.java:96)

         [testng] at org.jboss.embedded.Bootstrap.deployBaseBootstrapUrl(Bootstrap.java:130)

         [testng] at org.jboss.embedded.Bootstrap.bootstrapURL(Bootstrap.java:142)

         [testng] at org.jboss.embedded.Bootstrap.bootstrap(Bootstrap.java:183)

         [testng] at org.jboss.embedded.Bootstrap.bootstrap(Bootstrap.java:195)

         [testng] at org.jboss.seam.mock.EmbeddedBootstrap.startAndDeployResources(EmbeddedBootstrap.java:11)

         [testng] at org.jboss.seam.mock.AbstractSeamTest.startJbossEmbeddedIfNecessary(AbstractSeamTest.java:1024)

         [testng] at org.jboss.seam.mock.AbstractSeamTest.startSeam(AbstractSeamTest.java:915)

         [testng] at org.jboss.seam.mock.SeamTest.startSeam(SeamTest.java:58)

         [testng] at sun.reflect.NativeMethodAccessorImpl.invoke0(Native Method)

         [testng] at sun.reflect.NativeMethodAccessorImpl.invoke(Unknown Source)

         [testng] at sun.reflect.DelegatingMethodAccessorImpl.invoke(Unknown Source)

         [testng] at java.lang.reflect.Method.invoke(Unknown Source)

         [testng] at org.testng.internal.MethodHelper.invokeMethod(MethodHelper.java:607)

         [testng] at org.testng.internal.Invoker.invokeConfigurationMethod(Invoker.java:417)

         [testng] at org.testng.internal.Invoker.invokeConfigurations(Invoker.java:154)

         [testng] at org.testng.internal.Invoker.invokeConfigurations(Invoker.java:88)

         [testng] at org.testng.SuiteRunner.privateRun(SuiteRunner.java:284)

         [testng] at org.testng.SuiteRunner.run(SuiteRunner.java:204)

         [testng] at org.testng.TestNG.createAndRunSuiteRunners(TestNG.java:877)

         [testng] at org.testng.TestNG.runSuitesLocally(TestNG.java:842)

         [testng] at org.testng.TestNG.run(TestNG.java:751)

         [testng] at org.testng.TestNG.privateMain(TestNG.java:914)

         [testng] at org.testng.TestNG.main(TestNG.java:887)

         [testng] ERROR [org.jboss.embedded.DeploymentScanner] Failed to deploy

         [testng] org.jboss.deployers.spi.DeploymentException: Error populating deployment vfsfile:/C:/Work/..../bootstrap/deployers/aspect-deployer-beans.xml

         [testng] at org.jboss.deployers.spi.DeploymentException.rethrowAsDeploymentException(DeploymentException.java:49)

         [testng] at org.jboss.deployers.structure.spi.helpers.AbstractStructureBuilder.populateContext(AbstractStructureBuilder.java:77)

         [testng] at org.jboss.deployers.structure.spi.helpers.AbstractStructuralDeployers.determineStructure(AbstractStructuralDeployers.java:89)

         [testng] at org.jboss.deployers.plugins.main.MainDeployerImpl.determineStructure(MainDeployerImpl.java:743)

         [testng] at org.jboss.deployers.plugins.main.MainDeployerImpl.addDeployment(MainDeployerImpl.java:280)

         [testng] at org.jboss.deployers.plugins.main.MainDeployerImpl.addDeployment(MainDeployerImpl.java:237)

         [testng] at org.jboss.embedded.DeploymentGroup.add(DeploymentGroup.java:153)

         [testng] at org.jboss.embedded.DeploymentGroup.addVirtualFiles(DeploymentGroup.java:194)

         [testng] at org.jboss.embedded.DeploymentGroup.addDirectoryByResource(DeploymentGroup.java:466)

         [testng] at org.jboss.embedded.DeploymentScanner.start(DeploymentScanner.java:95)

         [testng] at sun.reflect.NativeMethodAccessorImpl.invoke0(Native Method)

         [testng] at sun.reflect.NativeMethodAccessorImpl.invoke(Unknown Source)

         [testng] at sun.reflect.DelegatingMethodAccessorImpl.invoke(Unknown Source)

         [testng] at java.lang.reflect.Method.invoke(Unknown Source)

         [testng] at org.jboss.reflect.plugins.introspection.ReflectionUtils.invoke(ReflectionUtils.java:56)

         [testng] at org.jboss.reflect.plugins.introspection.ReflectMethodInfoImpl.invoke(ReflectMethodInfoImpl.java:110)

         [testng] at org.jboss.joinpoint.plugins.BasicMethodJoinPoint.dispatch(BasicMethodJoinPoint.java:66)

         [testng] at org.jboss.kernel.plugins.dependency.KernelControllerContextAction$JoinpointDispatchWrapper.execute(KernelControllerContextAction.java:214)

         [testng] at org.jboss.kernel.plugins.dependency.ExecutionWrapper.execute(ExecutionWrapper.java:45)

         [testng] at org.jboss.kernel.plugins.dependency.KernelControllerContextAction.dispatchExecutionWrapper(KernelControllerContextAction.java:108)

         [testng] at org.jboss.kernel.plugins.dependency.KernelControllerContextAction.dispatchJoinPoint(KernelControllerContextAction.java:69)

         [testng] at org.jboss.kernel.plugins.dependency.LifecycleAction.installActionInternal(LifecycleAction.java:221)

         [testng] at org.jboss.kernel.plugins.dependency.KernelControllerContextAction.installAction(KernelControllerContextAction.java:135)

         [testng] at org.jboss.kernel.plugins.dependency.KernelControllerContextAction.installAction(KernelControllerContextAction.java:46)

         [testng] at org.jboss.dependency.plugins.action.SimpleControllerContextAction.simpleInstallAction(SimpleControllerContextAction.java:62)

         [testng] at org.jboss.dependency.plugins.action.AccessControllerContextAction.install(AccessControllerContextAction.java:71)

         [testng] at org.jboss.dependency.plugins.AbstractControllerContextActions.install(AbstractControllerContextActions.java:51)

         [testng] at org.jboss.dependency.plugins.AbstractControllerContext.install(AbstractControllerContext.java:327)

         [testng] at org.jboss.dependency.plugins.AbstractController.install(AbstractController.java:1309)

         [testng] at org.jboss.dependency.plugins.AbstractController.incrementState(AbstractController.java:734)

         [testng] at org.jboss.dependency.plugins.AbstractController.resolveContexts(AbstractController.java:862)

         [testng] at org.jboss.dependency.plugins.AbstractController.resolveContexts(AbstractController.java:784)

         [testng] at org.jboss.dependency.plugins.AbstractController.install(AbstractController.java:574)

         [testng] at org.jboss.dependency.plugins.AbstractController.install(AbstractController.java:398)

         [testng] at org.jboss.kernel.plugins.deployment.AbstractKernelDeployer.deployBean(AbstractKernelDeployer.java:309)

         [testng] at org.jboss.kernel.plugins.deployment.AbstractKernelDeployer.deployBeans(AbstractKernelDeployer.java:279)

         [testng] at org.jboss.kernel.plugins.deployment.AbstractKernelDeployer.deploy(AbstractKernelDeployer.java:130)

         [testng] at org.jboss.kernel.plugins.deployment.xml.BeanXMLDeployer.deploy(BeanXMLDeployer.java:96)

         [testng] at org.jboss.embedded.Bootstrap.deployBaseBootstrapUrl(Bootstrap.java:130)

         [testng] at org.jboss.embedded.Bootstrap.bootstrapURL(Bootstrap.java:142)

         [testng] at org.jboss.embedded.Bootstrap.bootstrap(Bootstrap.java:183)

         [testng] at org.jboss.embedded.Bootstrap.bootstrap(Bootstrap.java:195)

         [testng] at org.jboss.seam.mock.EmbeddedBootstrap.startAndDeployResources(EmbeddedBootstrap.java:11)

         [testng] at org.jboss.seam.mock.AbstractSeamTest.startJbossEmbeddedIfNecessary(AbstractSeamTest.java:1024)

         [testng] at org.jboss.seam.mock.AbstractSeamTest.startSeam(AbstractSeamTest.java:915)

         [testng] at org.jboss.seam.mock.SeamTest.startSeam(SeamTest.java:58)

         [testng] at sun.reflect.NativeMethodAccessorImpl.invoke0(Native Method)

         [testng] at sun.reflect.NativeMethodAccessorImpl.invoke(Unknown Source)

         [testng] at sun.reflect.DelegatingMethodAccessorImpl.invoke(Unknown Source)

         [testng] at java.lang.reflect.Method.invoke(Unknown Source)

         [testng] at org.testng.internal.MethodHelper.invokeMethod(MethodHelper.java:607)

         [testng] at org.testng.internal.Invoker.invokeConfigurationMethod(Invoker.java:417)

         [testng] at org.testng.internal.Invoker.invokeConfigurations(Invoker.java:154)

         [testng] at org.testng.internal.Invoker.invokeConfigurations(Invoker.java:88)

         [testng] at org.testng.SuiteRunner.privateRun(SuiteRunner.java:284)

         [testng] at org.testng.SuiteRunner.run(SuiteRunner.java:204)

         [testng] at org.testng.TestNG.createAndRunSuiteRunners(TestNG.java:877)

         [testng] at org.testng.TestNG.runSuitesLocally(TestNG.java:842)

         [testng] at org.testng.TestNG.run(TestNG.java:751)

         [testng] at org.testng.TestNG.privateMain(TestNG.java:914)

         [testng] at org.testng.TestNG.main(TestNG.java:887)

         [testng] Caused by: java.lang.NoSuchMethodError: org.jboss.deployers.spi.structure.ContextInfo.getMetaDataPath()Ljava/util/List;

         [testng] at org.jboss.deployers.vfs.plugins.structure.VFSStructureBuilder.applyContextInfo(VFSStructureBuilder.java:93)

         [testng] at org.jboss.deployers.structure.spi.helpers.AbstractStructureBuilder.populateContext(AbstractStructureBuilder.java:73)

         [testng] ... 59 more

         [testng] ERROR [org.jboss.kernel.plugins.dependency.AbstractKernelController] Error installing to Start: name=ResourcesToDeploy2 state=Create

         [testng] org.jboss.deployers.spi.DeploymentException: Error populating deployment vfsfile:/C:/Work..../bootstrap/deployers/aspect-deployer-beans.xml

         [testng] at org.jboss.deployers.spi.DeploymentException.rethrowAsDeploymentException(DeploymentException.java:49)

         [testng] at org.jboss.deployers.structure.spi.helpers.AbstractStructureBuilder.populateContext(AbstractStructureBuilder.java:77)

         [testng] at org.jboss.deployers.structure.spi.helpers.AbstractStructuralDeployers.determineStructure(AbstractStructuralDeployers.java:89)

         [testng] at org.jboss.deployers.plugins.main.MainDeployerImpl.determineStructure(MainDeployerImpl.java:743)

         [testng] at org.jboss.deployers.plugins.main.MainDeployerImpl.addDeployment(MainDeployerImpl.java:280)

         [testng] at org.jboss.deployers.plugins.main.MainDeployerImpl.addDeployment(MainDeployerImpl.java:237)

         [testng] at org.jboss.embedded.DeploymentGroup.add(DeploymentGroup.java:153)

         [testng] at org.jboss.embedded.DeploymentGroup.addVirtualFiles(DeploymentGroup.java:194)

         [testng] at org.jboss.embedded.DeploymentGroup.addDirectoryByResource(DeploymentGroup.java:466)

         [testng] at org.jboss.embedded.DeploymentScanner.start(DeploymentScanner.java:95)

         [testng] at sun.reflect.NativeMethodAccessorImpl.invoke0(Native Method)

         [testng] at sun.reflect.NativeMethodAccessorImpl.invoke(Unknown Source)

         [testng] at sun.reflect.DelegatingMethodAccessorImpl.invoke(Unknown Source)

         [testng] at java.lang.reflect.Method.invoke(Unknown Source)

         [testng] at org.jboss.reflect.plugins.introspection.ReflectionUtils.invoke(ReflectionUtils.java:56)

         [testng] at org.jboss.reflect.plugins.introspection.ReflectMethodInfoImpl.invoke(ReflectMethodInfoImpl.java:110)

         [testng] at org.jboss.joinpoint.plugins.BasicMethodJoinPoint.dispatch(BasicMethodJoinPoint.java:66)

         [testng] at org.jboss.kernel.plugins.dependency.KernelControllerContextAction$JoinpointDispatchWrapper.execute(KernelControllerContextAction.java:214)

         [testng] at org.jboss.kernel.plugins.dependency.ExecutionWrapper.execute(ExecutionWrapper.java:45)

         [testng] at org.jboss.kernel.plugins.dependency.KernelControllerContextAction.dispatchExecutionWrapper(KernelControllerContextAction.java:108)

         [testng] at org.jboss.kernel.plugins.dependency.KernelControllerContextAction.dispatchJoinPoint(KernelControllerContextAction.java:69)

         [testng] at org.jboss.kernel.plugins.dependency.LifecycleAction.installActionInternal(LifecycleAction.java:221)

         [testng] at org.jboss.kernel.plugins.dependency.KernelControllerContextAction.installAction(KernelControllerContextAction.java:135)

         [testng] at org.jboss.kernel.plugins.dependency.KernelControllerContextAction.installAction(KernelControllerContextAction.java:46)

         [testng] at org.jboss.dependency.plugins.action.SimpleControllerContextAction.simpleInstallAction(SimpleControllerContextAction.java:62)

         [testng] at org.jboss.dependency.plugins.action.AccessControllerContextAction.install(AccessControllerContextAction.java:71)

         [testng] at org.jboss.dependency.plugins.AbstractControllerContextActions.install(AbstractControllerContextActions.java:51)

         [testng] at org.jboss.dependency.plugins.AbstractControllerContext.install(AbstractControllerContext.java:327)

         [testng] at org.jboss.dependency.plugins.AbstractController.install(AbstractController.java:1309)

         [testng] at org.jboss.dependency.plugins.AbstractController.incrementState(AbstractController.java:734)

         [testng] at org.jboss.dependency.plugins.AbstractController.resolveContexts(AbstractController.java:862)

         [testng] at org.jboss.dependency.plugins.AbstractController.resolveContexts(AbstractController.java:784)

         [testng] at org.jboss.dependency.plugins.AbstractController.install(AbstractController.java:574)

         [testng] at org.jboss.dependency.plugins.AbstractController.install(AbstractController.java:398)

         [testng] at org.jboss.kernel.plugins.deployment.AbstractKernelDeployer.deployBean(AbstractKernelDeployer.java:309)

         [testng] at org.jboss.kernel.plugins.deployment.AbstractKernelDeployer.deployBeans(AbstractKernelDeployer.java:279)

         [testng] at org.jboss.kernel.plugins.deployment.AbstractKernelDeployer.deploy(AbstractKernelDeployer.java:130)

         [testng] at org.jboss.kernel.plugins.deployment.xml.BeanXMLDeployer.deploy(BeanXMLDeployer.java:96)

         [testng] at org.jboss.embedded.Bootstrap.deployBaseBootstrapUrl(Bootstrap.java:130)

         [testng] at org.jboss.embedded.Bootstrap.bootstrapURL(Bootstrap.java:142)

         [testng] at org.jboss.embedded.Bootstrap.bootstrap(Bootstrap.java:183)

         [testng] at org.jboss.embedded.Bootstrap.bootstrap(Bootstrap.java:195)

         [testng] at org.jboss.seam.mock.EmbeddedBootstrap.startAndDeployResources(EmbeddedBootstrap.java:11)

         [testng] at org.jboss.seam.mock.AbstractSeamTest.startJbossEmbeddedIfNecessary(AbstractSeamTest.java:1024)

         [testng] at org.jboss.seam.mock.AbstractSeamTest.startSeam(AbstractSeamTest.java:915)

         [testng] at org.jboss.seam.mock.SeamTest.startSeam(SeamTest.java:58)

         [testng] at sun.reflect.NativeMethodAccessorImpl.invoke0(Native Method)

         [testng] at sun.reflect.NativeMethodAccessorImpl.invoke(Unknown Source)

         [testng] at sun.reflect.DelegatingMethodAccessorImpl.invoke(Unknown Source)

         [testng] at java.lang.reflect.Method.invoke(Unknown Source)

         [testng] at org.testng.internal.MethodHelper.invokeMethod(MethodHelper.java:607)

         [testng] at org.testng.internal.Invoker.invokeConfigurationMethod(Invoker.java:417)

         [testng] at org.testng.internal.Invoker.invokeConfigurations(Invoker.java:154)

         [testng] at org.testng.internal.Invoker.invokeConfigurations(Invoker.java:88)

         [testng] at org.testng.SuiteRunner.privateRun(SuiteRunner.java:284)

         [testng] at org.testng.SuiteRunner.run(SuiteRunner.java:204)

         [testng] at org.testng.TestNG.createAndRunSuiteRunners(TestNG.java:877)

         [testng] at org.testng.TestNG.runSuitesLocally(TestNG.java:842)

         [testng] at org.testng.TestNG.run(TestNG.java:751)

         [testng] at org.testng.TestNG.privateMain(TestNG.java:914)

         [testng] at org.testng.TestNG.main(TestNG.java:887)

         [testng] Caused by: java.lang.NoSuchMethodError: org.jboss.deployers.spi.structure.ContextInfo.getMetaDataPath()Ljava/util/List;

         [testng] at org.jboss.deployers.vfs.plugins.structure.VFSStructureBuilder.applyContextInfo(VFSStructureBuilder.java:93)

         [testng] at org.jboss.deployers.structure.spi.helpers.AbstractStructureBuilder.populateContext(AbstractStructureBuilder.java:73)

         [testng] ... 59 more

         [testng] ERROR [org.jboss.embedded.DeploymentScanner] Failed to deploy

         [testng] org.jboss.deployers.spi.DeploymentException: Error populating deployment vfsfile:/C:/..../bootstrap/deploy/ejb3-interceptors-aop.xml

         [testng] at org.jboss.deployers.spi.DeploymentException.rethrowAsDeploymentException(DeploymentException.java:49)

         [testng] at org.jboss.deployers.structure.spi.helpers.AbstractStructureBuilder.populateContext(AbstractStructureBuilder.java:77)

         [testng] at org.jboss.deployers.structure.spi.helpers.AbstractStructuralDeployers.determineStructure(AbstractStructuralDeployers.java:89)

         [testng] at org.jboss.deployers.plugins.main.MainDeployerImpl.determineStructure(MainDeployerImpl.java:743)

         [testng] at org.jboss.deployers.plugins.main.MainDeployerImpl.addDeployment(MainDeployerImpl.java:280)

         [testng] at org.jboss.deployers.plugins.main.MainDeployerImpl.addDeployment(MainDeployerImpl.java:237)

         [testng] at org.jboss.embedded.DeploymentGroup.add(DeploymentGroup.java:153)

         [testng] at org.jboss.embedded.DeploymentGroup.addVirtualFiles(DeploymentGroup.java:194)

         [testng] at org.jboss.embedded.DeploymentGroup.addDirectoryByResource(DeploymentGroup.java:466)

         [testng] at org.jboss.embedded.DeploymentScanner.start(DeploymentScanner.java:95)

         [testng] at sun.reflect.NativeMethodAccessorImpl.invoke0(Native Method)

         [testng] at sun.reflect.NativeMethodAccessorImpl.invoke(Unknown Source)

         [testng] at sun.reflect.DelegatingMethodAccessorImpl.invoke(Unknown Source)

         [testng] at java.lang.reflect.Method.invoke(Unknown Source)

         [testng] at org.jboss.reflect.plugins.introspection.ReflectionUtils.invoke(ReflectionUtils.java:56)

         [testng] at org.jboss.reflect.plugins.introspection.ReflectMethodInfoImpl.invoke(ReflectMethodInfoImpl.java:110)

         [testng] at org.jboss.joinpoint.plugins.BasicMethodJoinPoint.dispatch(BasicMethodJoinPoint.java:66)

         [testng] at org.jboss.kernel.plugins.dependency.KernelControllerContextAction$JoinpointDispatchWrapper.execute(KernelControllerContextAction.java:214)

         [testng] at org.jboss.kernel.plugins.dependency.ExecutionWrapper.execute(ExecutionWrapper.java:45)

         [testng] at org.jboss.kernel.plugins.dependency.KernelControllerContextAction.dispatchExecutionWrapper(KernelControllerContextAction.java:108)

         [testng] at org.jboss.kernel.plugins.dependency.KernelControllerContextAction.dispatchJoinPoint(KernelControllerContextAction.java:69)

         [testng] at org.jboss.kernel.plugins.dependency.LifecycleAction.installActionInternal(LifecycleAction.java:221)

         [testng] at org.jboss.kernel.plugins.dependency.KernelControllerContextAction.installAction(KernelControllerContextAction.java:135)

         [testng] at org.jboss.kernel.plugins.dependency.KernelControllerContextAction.installAction(KernelControllerContextAction.java:46)

         [testng] at org.jboss.dependency.plugins.action.SimpleControllerContextAction.simpleInstallAction(SimpleControllerContextAction.java:62)

         [testng] at org.jboss.dependency.plugins.action.AccessControllerContextAction.install(AccessControllerContextAction.java:71)

         [testng] at org.jboss.dependency.plugins.AbstractControllerContextActions.install(AbstractControllerContextActions.java:51)

         [testng] at org.jboss.dependency.plugins.AbstractControllerContext.install(AbstractControllerContext.java:327)

         [testng] at org.jboss.dependency.plugins.AbstractController.install(AbstractController.java:1309)

         [testng] at org.jboss.dependency.plugins.AbstractController.incrementState(AbstractController.java:734)

         [testng] at org.jboss.dependency.plugins.AbstractController.resolveContexts(AbstractController.java:862)

         [testng] at org.jboss.dependency.plugins.AbstractController.resolveContexts(AbstractController.java:784)

         [testng] at org.jboss.dependency.plugins.AbstractController.install(AbstractController.java:574)

         [testng] at org.jboss.dependency.plugins.AbstractController.install(AbstractController.java:398)

         [testng] at org.jboss.kernel.plugins.deployment.AbstractKernelDeployer.deployBean(AbstractKernelDeployer.java:309)

         [testng] at org.jboss.kernel.plugins.deployment.AbstractKernelDeployer.deployBeans(AbstractKernelDeployer.java:279)

         [testng] at org.jboss.kernel.plugins.deployment.AbstractKernelDeployer.deploy(AbstractKernelDeployer.java:130)

         [testng] at org.jboss.kernel.plugins.deployment.xml.BeanXMLDeployer.deploy(BeanXMLDeployer.java:96)

         [testng] at org.jboss.embedded.Bootstrap.deployBaseBootstrapUrl(Bootstrap.java:130)

         [testng] at org.jboss.embedded.Bootstrap.bootstrapURL(Bootstrap.java:142)

         [testng] at org.jboss.embedded.Bootstrap.bootstrap(Bootstrap.java:183)

         [testng] at org.jboss.embedded.Bootstrap.bootstrap(Bootstrap.java:195)

         [testng] at org.jboss.seam.mock.EmbeddedBootstrap.startAndDeployResources(EmbeddedBootstrap.java:11)

         [testng] at org.jboss.seam.mock.AbstractSeamTest.startJbossEmbeddedIfNecessary(AbstractSeamTest.java:1024)

         [testng] at org.jboss.seam.mock.AbstractSeamTest.startSeam(AbstractSeamTest.java:915)

         [testng] at org.jboss.seam.mock.SeamTest.startSeam(SeamTest.java:58)

         [testng] at sun.reflect.NativeMethodAccessorImpl.invoke0(Native Method)

         [testng] at sun.reflect.NativeMethodAccessorImpl.invoke(Unknown Source)

         [testng] at sun.reflect.DelegatingMethodAccessorImpl.invoke(Unknown Source)

         [testng] at java.lang.reflect.Method.invoke(Unknown Source)

         [testng] at org.testng.internal.MethodHelper.invokeMethod(MethodHelper.java:607)

         [testng] at org.testng.internal.Invoker.invokeConfigurationMethod(Invoker.java:417)

         [testng] at org.testng.internal.Invoker.invokeConfigurations(Invoker.java:154)

         [testng] at org.testng.internal.Invoker.invokeConfigurations(Invoker.java:88)

         [testng] at org.testng.SuiteRunner.privateRun(SuiteRunner.java:284)

         [testng] at org.testng.SuiteRunner.run(SuiteRunner.java:204)

         [testng] at org.testng.TestNG.createAndRunSuiteRunners(TestNG.java:877)

         [testng] at org.testng.TestNG.runSuitesLocally(TestNG.java:842)

         [testng] at org.testng.TestNG.run(TestNG.java:751)

         [testng] at org.testng.TestNG.privateMain(TestNG.java:914)

         [testng] at org.testng.TestNG.main(TestNG.java:887)

         [testng] Caused by: java.lang.NoSuchMethodError: org.jboss.deployers.spi.structure.ContextInfo.getMetaDataPath()Ljava/util/List;

         [testng] at org.jboss.deployers.vfs.plugins.structure.VFSStructureBuilder.applyContextInfo(VFSStructureBuilder.java:93)

         [testng] at org.jboss.deployers.structure.spi.helpers.AbstractStructureBuilder.populateContext(AbstractStructureBuilder.java:73)

         [testng] ... 59 more

         [testng] ERROR [org.jboss.kernel.plugins.dependency.AbstractKernelController] Error installing to Start: name=ResourcesToDeploy3 state=Create

         [testng] org.jboss.deployers.spi.DeploymentException: Error populating deployment vfsfile:/.../bootstrap/deploy/ejb3-interceptors-aop.xml

         [testng] at org.jboss.deployers.spi.DeploymentException.rethrowAsDeploymentException(DeploymentException.java:49)

         [testng] at org.jboss.deployers.structure.spi.helpers.AbstractStructureBuilder.populateContext(AbstractStructureBuilder.java:77)

         [testng] at org.jboss.deployers.structure.spi.helpers.AbstractStructuralDeployers.determineStructure(AbstractStructuralDeployers.java:89)

         [testng] at org.jboss.deployers.plugins.main.MainDeployerImpl.determineStructure(MainDeployerImpl.java:743)

         [testng] at org.jboss.deployers.plugins.main.MainDeployerImpl.addDeployment(MainDeployerImpl.java:280)

         [testng] at org.jboss.deployers.plugins.main.MainDeployerImpl.addDeployment(MainDeployerImpl.java:237)

         [testng] at org.jboss.embedded.DeploymentGroup.add(DeploymentGroup.java:153)

         [testng] at org.jboss.embedded.DeploymentGroup.addVirtualFiles(DeploymentGroup.java:194)

         [testng] at org.jboss.embedded.DeploymentGroup.addDirectoryByResource(DeploymentGroup.java:466)

         [testng] at org.jboss.embedded.DeploymentScanner.start(DeploymentScanner.java:95)

         [testng] at sun.reflect.NativeMethodAccessorImpl.invoke0(Native Method)

         [testng] at sun.reflect.NativeMethodAccessorImpl.invoke(Unknown Source)

         [testng] at sun.reflect.DelegatingMethodAccessorImpl.invoke(Unknown Source)

         [testng] at java.lang.reflect.Method.invoke(Unknown Source)

         [testng] at org.jboss.reflect.plugins.introspection.ReflectionUtils.invoke(ReflectionUtils.java:56)

         [testng] at org.jboss.reflect.plugins.introspection.ReflectMethodInfoImpl.invoke(ReflectMethodInfoImpl.java:110)

         [testng] at org.jboss.joinpoint.plugins.BasicMethodJoinPoint.dispatch(BasicMethodJoinPoint.java:66)

         [testng] at org.jboss.kernel.plugins.dependency.KernelControllerContextAction$JoinpointDispatchWrapper.execute(KernelControllerContextAction.java:214)

         [testng] at org.jboss.kernel.plugins.dependency.ExecutionWrapper.execute(ExecutionWrapper.java:45)

         [testng] at org.jboss.kernel.plugins.dependency.KernelControllerContextAction.dispatchExecutionWrapper(KernelControllerContextAction.java:108)

         [testng] at org.jboss.kernel.plugins.dependency.KernelControllerContextAction.dispatchJoinPoint(KernelControllerContextAction.java:69)

         [testng] at org.jboss.kernel.plugins.dependency.LifecycleAction.installActionInternal(LifecycleAction.java:221)

         [testng] at org.jboss.kernel.plugins.dependency.KernelControllerContextAction.installAction(KernelControllerContextAction.java:135)

         [testng] at org.jboss.kernel.plugins.dependency.KernelControllerContextAction.installAction(KernelControllerContextAction.java:46)

         [testng] at org.jboss.dependency.plugins.action.SimpleControllerContextAction.simpleInstallAction(SimpleControllerContextAction.java:62)

         [testng] at org.jboss.dependency.plugins.action.AccessControllerContextAction.install(AccessControllerContextAction.java:71)

         [testng] at org.jboss.dependency.plugins.AbstractControllerContextActions.install(AbstractControllerContextActions.java:51)

         [testng] at org.jboss.dependency.plugins.AbstractControllerContext.install(AbstractControllerContext.java:327)

         [testng] at org.jboss.dependency.plugins.AbstractController.install(AbstractController.java:1309)

         [testng] at org.jboss.dependency.plugins.AbstractController.incrementState(AbstractController.java:734)

         [testng] at org.jboss.dependency.plugins.AbstractController.resolveContexts(AbstractController.java:862)

         [testng] at org.jboss.dependency.plugins.AbstractController.resolveContexts(AbstractController.java:784)

         [testng] at org.jboss.dependency.plugins.AbstractController.install(AbstractController.java:574)

         [testng] at org.jboss.dependency.plugins.AbstractController.install(AbstractController.java:398)

         [testng] at org.jboss.kernel.plugins.deployment.AbstractKernelDeployer.deployBean(AbstractKernelDeployer.java:309)

         [testng] at org.jboss.kernel.plugins.deployment.AbstractKernelDeployer.deployBeans(AbstractKernelDeployer.java:279)

         [testng] at org.jboss.kernel.plugins.deployment.AbstractKernelDeployer.deploy(AbstractKernelDeployer.java:130)

         [testng] at org.jboss.kernel.plugins.deployment.xml.BeanXMLDeployer.deploy(BeanXMLDeployer.java:96)

         [testng] at org.jboss.embedded.Bootstrap.deployBaseBootstrapUrl(Bootstrap.java:130)

         [testng] at org.jboss.embedded.Bootstrap.bootstrapURL(Bootstrap.java:142)

         [testng] at org.jboss.embedded.Bootstrap.bootstrap(Bootstrap.java:183)

         [testng] at org.jboss.embedded.Bootstrap.bootstrap(Bootstrap.java:195)

         [testng] at org.jboss.seam.mock.EmbeddedBootstrap.startAndDeployResources(EmbeddedBootstrap.java:11)

         [testng] at org.jboss.seam.mock.AbstractSeamTest.startJbossEmbeddedIfNecessary(AbstractSeamTest.java:1024)

         [testng] at org.jboss.seam.mock.AbstractSeamTest.startSeam(AbstractSeamTest.java:915)

         [testng] at org.jboss.seam.mock.SeamTest.startSeam(SeamTest.java:58)

         [testng] at sun.reflect.NativeMethodAccessorImpl.invoke0(Native Method)

         [testng] at sun.reflect.NativeMethodAccessorImpl.invoke(Unknown Source)

         [testng] at sun.reflect.DelegatingMethodAccessorImpl.invoke(Unknown Source)

         [testng] at java.lang.reflect.Method.invoke(Unknown Source)

         [testng] at org.testng.internal.MethodHelper.invokeMethod(MethodHelper.java:607)

         [testng] at org.testng.internal.Invoker.invokeConfigurationMethod(Invoker.java:417)

         [testng] at org.testng.internal.Invoker.invokeConfigurations(Invoker.java:154)

         [testng] at org.testng.internal.Invoker.invokeConfigurations(Invoker.java:88)

         [testng] at org.testng.SuiteRunner.privateRun(SuiteRunner.java:284)

         [testng] at org.testng.SuiteRunner.run(SuiteRunner.java:204)

         [testng] at org.testng.TestNG.createAndRunSuiteRunners(TestNG.java:877)

         [testng] at org.testng.TestNG.runSuitesLocally(TestNG.java:842)

         [testng] at org.testng.TestNG.run(TestNG.java:751)

         [testng] at org.testng.TestNG.privateMain(TestNG.java:914)

         [testng] at org.testng.TestNG.main(TestNG.java:887)

         [testng] Caused by: java.lang.NoSuchMethodError: org.jboss.deployers.spi.structure.ContextInfo.getMetaDataPath()Ljava/util/List;

         [testng] at org.jboss.deployers.vfs.plugins.structure.VFSStructureBuilder.applyContextInfo(VFSStructureBuilder.java:93)

         [testng] at org.jboss.deployers.structure.spi.helpers.AbstractStructureBuilder.populateContext(AbstractStructureBuilder.java:73)

         [testng] ... 59 more

         [testng] FAILED CONFIGURATION: @BeforeSuite startSeam

         [testng] org.jboss.deployers.client.spi.IncompleteDeploymentException: Summary of incomplete deployments (SEE PREVIOUS ERRORS FOR DETAILS):

         [testng] *** DEPLOYMENTS MISSING DEPLOYERS: Name

         [testng] vfsfile:/C:/Work/.../bootstrap/conf/jboss-service.xml

         [testng] vfsfile:/C:/Work/.../bootstrap/deploy/ejb3-interceptors-aop.xml

         [testng] vfsfile:/C:/Work/.../bootstrap/deployers/aspect-deployer-beans.xml

         [testng] *** CONTEXTS MISSING DEPENDENCIES: Name -> Dependency{Required State:Actual State}

         [testng] UserTransactionBinding

         [testng]  -> UserTransaction{Configured:**ERROR**}

         [testng] UserTransactionBinding2

         [testng]  -> UserTransaction{Configured:**ERROR**}

         [testng] *** CONTEXTS IN ERROR: Name -> Error

         [testng] ResourcesToDeploy2 -> java.lang.NoSuchMethodError: org.jboss.deployers.spi.structure.ContextInfo.getMetaDataPath()Ljava/util/List;

         [testng] ResourcesToDeploy3 -> java.lang.NoSuchMethodError: org.jboss.deployers.spi.structure.ContextInfo.getMetaDataPath()Ljava/util/List;

         [testng] UserTransaction -> java.lang.RuntimeException: Unable to locate the transaction manager

         [testng] ResourcesToDeploy -> java.lang.NoSuchMethodError: org.jboss.deployers.spi.structure.ContextInfo.getMetaDataPath()Ljava/util/List;

         [testng] at org.jboss.deployers.plugins.deployers.DeployersImpl.checkComplete(DeployersImpl.java:576)

         [testng] at org.jboss.deployers.plugins.main.MainDeployerImpl.checkComplete(MainDeployerImpl.java:559)

         [testng] at org.jboss.embedded.Bootstrap.bootstrapURL(Bootstrap.java:149)

         [testng] at org.jboss.embedded.Bootstrap.bootstrap(Bootstrap.java:183)

         [testng] at org.jboss.embedded.Bootstrap.bootstrap(Bootstrap.java:195)

         [testng] at org.jboss.seam.mock.EmbeddedBootstrap.startAndDeployResources(EmbeddedBootstrap.java:11)

         [testng] at org.jboss.seam.mock.AbstractSeamTest.startJbossEmbeddedIfNecessary(AbstractSeamTest.java:1024)

         [testng] at org.jboss.seam.mock.AbstractSeamTest.startSeam(AbstractSeamTest.java:915)

         [testng] at org.jboss.seam.mock.SeamTest.startSeam(SeamTest.java:58)

         [testng] ... Removed 15 stack frames

         [testng] SKIPPED CONFIGURATION: @BeforeClass setDatasourceJndiName

         [testng] SKIPPED CONFIGURATION: @BeforeClass init

         [testng] SKIPPED CONFIGURATION: @BeforeClass setBinaryDir

         [testng] SKIPPED CONFIGURATION: @BeforeClass setDatabase

         [testng] SKIPPED CONFIGURATION: @BeforeClass setupClass

         [testng] SKIPPED CONFIGURATION: @BeforeMethod begin

         [testng] SKIPPED CONFIGURATION: @BeforeMethod prepareDataBeforeTest

         [testng] SKIPPED CONFIGURATION: @AfterMethod cleanDataAfterTest

         [testng] SKIPPED CONFIGURATION: @AfterMethod end

         [testng] SKIPPED CONFIGURATION: @BeforeMethod begin

         [testng] SKIPPED CONFIGURATION: @BeforeMethod prepareDataBeforeTest

         [testng] SKIPPED CONFIGURATION: @AfterMethod cleanDataAfterTest

         [testng] SKIPPED CONFIGURATION: @AfterMethod end

         [testng] SKIPPED CONFIGURATION: @BeforeMethod begin

         [testng] SKIPPED CONFIGURATION: @BeforeMethod prepareDataBeforeTest

         [testng] SKIPPED CONFIGURATION: @AfterMethod cleanDataAfterTest

         [testng] SKIPPED CONFIGURATION: @AfterMethod end

         [testng] SKIPPED CONFIGURATION: @BeforeMethod begin

         [testng] SKIPPED CONFIGURATION: @BeforeMethod prepareDataBeforeTest

         [testng] SKIPPED CONFIGURATION: @AfterMethod cleanDataAfterTest

         [testng] SKIPPED CONFIGURATION: @AfterMethod end

         [testng] SKIPPED CONFIGURATION: @AfterClass destroy

         [testng] SKIPPED CONFIGURATION: @AfterClass cleanupClass

         [testng] SKIPPED CONFIGURATION: @BeforeClass setDatabase

         [testng] SKIPPED CONFIGURATION: @BeforeClass setupClass

         [testng] SKIPPED CONFIGURATION: @BeforeClass setDatasourceJndiName

         [testng] SKIPPED CONFIGURATION: @BeforeClass init

         [testng] SKIPPED CONFIGURATION: @BeforeClass setBinaryDir

         [testng] SKIPPED CONFIGURATION: @BeforeMethod begin

         [testng] SKIPPED CONFIGURATION: @BeforeMethod prepareDataBeforeTest

         [testng] SKIPPED CONFIGURATION: @AfterMethod cleanDataAfterTest

         [testng] SKIPPED CONFIGURATION: @AfterMethod end

         [testng] SKIPPED CONFIGURATION: @AfterClass cleanupClass

         [testng] SKIPPED CONFIGURATION: @BeforeClass setupClass

         [testng] SKIPPED CONFIGURATION: @BeforeClass init

         [testng] SKIPPED CONFIGURATION: @BeforeMethod begin

         [testng] SKIPPED CONFIGURATION: @AfterMethod end

         [testng] SKIPPED CONFIGURATION: @AfterClass cleanupClass

         [testng] SKIPPED CONFIGURATION: @BeforeClass setDatasourceJndiName

         [testng] SKIPPED CONFIGURATION: @BeforeClass init

         [testng] SKIPPED CONFIGURATION: @BeforeClass setBinaryDir

         [testng] SKIPPED CONFIGURATION: @BeforeClass setDatabase

         [testng] SKIPPED CONFIGURATION: @BeforeClass setupClass

         [testng] SKIPPED CONFIGURATION: @BeforeMethod begin

         [testng] SKIPPED CONFIGURATION: @BeforeMethod prepareDataBeforeTest

         [testng] SKIPPED CONFIGURATION: @AfterMethod cleanDataAfterTest

         [testng] SKIPPED CONFIGURATION: @AfterMethod end

         [testng] SKIPPED CONFIGURATION: @BeforeMethod begin

         [testng] SKIPPED CONFIGURATION: @BeforeMethod prepareDataBeforeTest

         [testng] SKIPPED CONFIGURATION: @AfterMethod cleanDataAfterTest

         [testng] SKIPPED CONFIGURATION: @AfterMethod end

         [testng] SKIPPED CONFIGURATION: @AfterClass cleanupClass

         [testng] SKIPPED CONFIGURATION: @BeforeClass setDatasourceJndiName

         [testng] SKIPPED CONFIGURATION: @BeforeClass init

         [testng] SKIPPED CONFIGURATION: @BeforeClass setBinaryDir

         [testng] SKIPPED CONFIGURATION: @BeforeClass setDatabase

         [testng] SKIPPED CONFIGURATION: @BeforeClass setupClass

         [testng] SKIPPED CONFIGURATION: @BeforeMethod begin

         [testng] SKIPPED CONFIGURATION: @BeforeMethod prepareDataBeforeTest

         [testng] SKIPPED CONFIGURATION: @AfterMethod cleanDataAfterTest

         [testng] SKIPPED CONFIGURATION: @AfterMethod end

         [testng] SKIPPED CONFIGURATION: @AfterClass cleanupClass

         [testng] SKIPPED CONFIGURATION: @BeforeClass setDatasourceJndiName

         [testng] SKIPPED CONFIGURATION: @BeforeClass init

         [testng] SKIPPED CONFIGURATION: @BeforeClass setBinaryDir

         [testng] SKIPPED CONFIGURATION: @BeforeClass setDatabase

         [testng] SKIPPED CONFIGURATION: @BeforeClass setupClass

         [testng] SKIPPED CONFIGURATION: @BeforeMethod begin

         [testng] SKIPPED CONFIGURATION: @BeforeMethod prepareDataBeforeTest

         [testng] SKIPPED CONFIGURATION: @AfterMethod cleanDataAfterTest

         [testng] SKIPPED CONFIGURATION: @AfterMethod end

         [testng] SKIPPED CONFIGURATION: @AfterClass cleanupClass

         [testng] SKIPPED CONFIGURATION: @BeforeClass setDatabase

         [testng] SKIPPED CONFIGURATION: @BeforeClass setupClass

         [testng] SKIPPED CONFIGURATION: @BeforeClass setDatasourceJndiName

         [testng] SKIPPED CONFIGURATION: @BeforeClass init

         [testng] SKIPPED CONFIGURATION: @BeforeClass setBinaryDir

         [testng] SKIPPED CONFIGURATION: @BeforeMethod begin

         [testng] SKIPPED CONFIGURATION: @BeforeMethod prepareDataBeforeTest

         [testng] SKIPPED CONFIGURATION: @AfterMethod cleanDataAfterTest

         [testng] SKIPPED CONFIGURATION: @AfterMethod end

         [testng] SKIPPED CONFIGURATION: @AfterClass cleanupClass

         [testng] SKIPPED CONFIGURATION: @BeforeClass setDatasourceJndiName

         [testng] SKIPPED CONFIGURATION: @BeforeClass init

         [testng] SKIPPED CONFIGURATION: @BeforeClass setBinaryDir

         [testng] SKIPPED CONFIGURATION: @BeforeClass setDatabase

         [testng] SKIPPED CONFIGURATION: @BeforeClass setupClass

         [testng] SKIPPED CONFIGURATION: @BeforeMethod begin

         [testng] SKIPPED CONFIGURATION: @BeforeMethod prepareDataBeforeTest

         [testng] SKIPPED CONFIGURATION: @AfterMethod cleanDataAfterTest

         [testng] SKIPPED CONFIGURATION: @AfterMethod end

         [testng] SKIPPED CONFIGURATION: @AfterClass cleanupClass

         [testng] SKIPPED CONFIGURATION: @BeforeClass setDatabase

         [testng] SKIPPED CONFIGURATION: @BeforeClass setupClass

         [testng] SKIPPED CONFIGURATION: @BeforeClass setDatasourceJndiName

         [testng] SKIPPED CONFIGURATION: @BeforeClass init

         [testng] SKIPPED CONFIGURATION: @BeforeClass setBinaryDir

         [testng] SKIPPED CONFIGURATION: @BeforeMethod begin

         [testng] SKIPPED CONFIGURATION: @BeforeMethod prepareDataBeforeTest

         [testng] SKIPPED CONFIGURATION: @AfterMethod cleanDataAfterTest

         [testng] SKIPPED CONFIGURATION: @AfterMethod end

         [testng] SKIPPED CONFIGURATION: @BeforeMethod begin

         [testng] SKIPPED CONFIGURATION: @BeforeMethod prepareDataBeforeTest

         [testng] SKIPPED CONFIGURATION: @AfterMethod cleanDataAfterTest

         [testng] SKIPPED CONFIGURATION: @AfterMethod end

         [testng] SKIPPED CONFIGURATION: @AfterClass cleanupClass

         [testng] SKIPPED CONFIGURATION: @BeforeClass setDatabase

         [testng] SKIPPED CONFIGURATION: @BeforeClass setupClass

         [testng] SKIPPED CONFIGURATION: @BeforeClass setDatasourceJndiName

         [testng] SKIPPED CONFIGURATION: @BeforeClass init

         [testng] SKIPPED CONFIGURATION: @BeforeClass setBinaryDir

         [testng] SKIPPED CONFIGURATION: @BeforeMethod begin

         [testng] SKIPPED CONFIGURATION: @BeforeMethod prepareDataBeforeTest

         [testng] SKIPPED CONFIGURATION: @AfterMethod cleanDataAfterTest

         [testng] SKIPPED CONFIGURATION: @AfterMethod end

         [testng] SKIPPED CONFIGURATION: @AfterClass cleanupClass

         [testng] SKIPPED CONFIGURATION: @BeforeClass setDatasourceJndiName

         [testng] SKIPPED CONFIGURATION: @BeforeClass init

         [testng] SKIPPED CONFIGURATION: @BeforeClass setBinaryDir

         [testng] SKIPPED CONFIGURATION: @BeforeClass setDatabase

         [testng] SKIPPED CONFIGURATION: @BeforeClass setupClass

         [testng] SKIPPED CONFIGURATION: @BeforeMethod begin

         [testng] SKIPPED CONFIGURATION: @BeforeMethod prepareDataBeforeTest

         [testng] SKIPPED CONFIGURATION: @AfterMethod cleanDataAfterTest

         [testng] SKIPPED CONFIGURATION: @AfterMethod end

         [testng] SKIPPED CONFIGURATION: @BeforeMethod begin

         [testng] SKIPPED CONFIGURATION: @BeforeMethod prepareDataBeforeTest

         [testng] SKIPPED CONFIGURATION: @AfterMethod cleanDataAfterTest

         [testng] SKIPPED CONFIGURATION: @AfterMethod end

         [testng] SKIPPED CONFIGURATION: @BeforeMethod begin

         [testng] SKIPPED CONFIGURATION: @BeforeMethod prepareDataBeforeTest

         [testng] SKIPPED CONFIGURATION: @AfterMethod cleanDataAfterTest

         [testng] SKIPPED CONFIGURATION: @AfterMethod end

         [testng] SKIPPED CONFIGURATION: @BeforeMethod begin

         [testng] SKIPPED CONFIGURATION: @BeforeMethod prepareDataBeforeTest

         [testng] SKIPPED CONFIGURATION: @AfterMethod cleanDataAfterTest

         [testng] SKIPPED CONFIGURATION: @AfterMethod end

         [testng] SKIPPED CONFIGURATION: @BeforeMethod begin

         [testng] SKIPPED CONFIGURATION: @BeforeMethod prepareDataBeforeTest

         [testng] SKIPPED CONFIGURATION: @AfterMethod cleanDataAfterTest

         [testng] SKIPPED CONFIGURATION: @AfterMethod end

         [testng] SKIPPED CONFIGURATION: @AfterClass cleanupClass

         [testng] SKIPPED CONFIGURATION: @BeforeClass setDatabase

         [testng] SKIPPED CONFIGURATION: @BeforeClass setupClass

         [testng] SKIPPED CONFIGURATION: @BeforeClass setDatasourceJndiName

         [testng] SKIPPED CONFIGURATION: @BeforeClass init

         [testng] SKIPPED CONFIGURATION: @BeforeClass setBinaryDir

         [testng] SKIPPED CONFIGURATION: @BeforeMethod begin

         [testng] SKIPPED CONFIGURATION: @BeforeMethod prepareDataBeforeTest

         [testng] SKIPPED CONFIGURATION: @AfterMethod cleanDataAfterTest

         [testng] SKIPPED CONFIGURATION: @AfterMethod end

         [testng] SKIPPED CONFIGURATION: @AfterClass cleanupClass

         [testng] SKIPPED CONFIGURATION: @BeforeClass setDatabase

         [testng] SKIPPED CONFIGURATION: @BeforeClass setDatasourceJndiName

         [testng] SKIPPED CONFIGURATION: @BeforeClass init

         [testng] SKIPPED CONFIGURATION: @BeforeClass setBinaryDir

         [testng] SKIPPED CONFIGURATION: @BeforeClass setupClass

         [testng] SKIPPED CONFIGURATION: @BeforeMethod begin

         [testng] SKIPPED CONFIGURATION: @BeforeMethod prepareDataBeforeTest

         [testng] SKIPPED CONFIGURATION: @AfterMethod cleanDataAfterTest

         [testng] SKIPPED CONFIGURATION: @AfterMethod end

         [testng] SKIPPED CONFIGURATION: @BeforeMethod begin

         [testng] SKIPPED CONFIGURATION: @BeforeMethod prepareDataBeforeTest

         [testng] SKIPPED CONFIGURATION: @AfterMethod cleanDataAfterTest

         [testng] SKIPPED CONFIGURATION: @AfterMethod end

         [testng] SKIPPED CONFIGURATION: @AfterClass cleanupClass

         [testng] SKIPPED: testCreateDemandeSansAssocie

         [testng] SKIPPED: testUpdateDemandeAvecAssocie

         [testng] SKIPPED: testUpdateDemandeSansAssocie

         [testng] SKIPPED: testCreateDemandeAvecAssocie

         [testng] SKIPPED: testNotificationServiceImportNotification

         [testng] SKIPPED: testMarcDisplayLink

         [testng] SKIPPED: testImportAutorite

         [testng] SKIPPED: testUmarshallAutorite

         [testng] SKIPPED: testLivreNonFranco

         [testng] SKIPPED: testPourJira518

         [testng] SKIPPED: testPourJira567

         [testng] SKIPPED: testPrincipal616

         [testng] SKIPPED: testAucunePref

         [testng] SKIPPED: testAvecPanier

         [testng] SKIPPED: testRessourceSelonPref

         [testng] SKIPPED: testHandleError

        [testng] SKIPPED: testRegistreServiceUpdatePrincipale

         [testng] SKIPPED: testRegistreServiceUpdateNonPrincipale

         [testng] SKIPPED: testRegistreServiceUpdateAvis

         [testng] SKIPPED: testAddToInsertToPanierList

         [testng] SKIPPED: testAvisNoticePartielle

         [testng] SKIPPED: testInsertAutoriteRelie

         [testng] SKIPPED: testInsertAutoriteRelieWithDate

         [testng] ===============================================

         [testng]     GUappsTestsLivraison_2_new

         [testng]     Tests run: 23, Failures: 0, Skips: 23

         [testng]     Configuration Failures: 1, Skips: 166

         [testng] ===============================================

         [testng] ===============================================

         [testng] GUapps Continuous Integration Tests Suite 2

         [testng] Total tests run: 23, Failures: 0, Skips: 23

         [testng] Configuration Failures: 1, Skips: 167

         [testng] ===============================================

         [testng] ===============================================

         [testng]     GUappsTestsLivraison_1

         [testng]     Tests run: 0, Failures: 0, Skips: 0

         [testng] ===============================================

         [testng] SKIPPED CONFIGURATION: @BeforeClass setDatabase

         [testng] SKIPPED CONFIGURATION: @BeforeClass setDatasourceJndiName

         [testng] SKIPPED CONFIGURATION: @BeforeClass init

         [testng] SKIPPED CONFIGURATION: @BeforeClass setBinaryDir

         [testng] SKIPPED CONFIGURATION: @BeforeClass setupClass

         [testng] SKIPPED CONFIGURATION: @BeforeMethod begin

         [testng] SKIPPED CONFIGURATION: @BeforeMethod prepareDataBeforeTest

         [testng] SKIPPED CONFIGURATION: @AfterMethod cleanDataAfterTest

         [testng] SKIPPED CONFIGURATION: @AfterMethod end

         [testng] SKIPPED CONFIGURATION: @BeforeMethod begin

         [testng] SKIPPED CONFIGURATION: @BeforeMethod prepareDataBeforeTest

         [testng] SKIPPED CONFIGURATION: @AfterMethod cleanDataAfterTest

         [testng] SKIPPED CONFIGURATION: @AfterMethod end

         [testng] SKIPPED CONFIGURATION: @BeforeMethod begin

         [testng] SKIPPED CONFIGURATION: @BeforeMethod prepareDataBeforeTest

         [testng] SKIPPED CONFIGURATION: @AfterMethod cleanDataAfterTest

         [testng] SKIPPED CONFIGURATION: @AfterMethod end

         [testng] SKIPPED CONFIGURATION: @BeforeMethod begin

        [testng] SKIPPED CONFIGURATION: @BeforeMethod prepareDataBeforeTest

         [testng] SKIPPED CONFIGURATION: @AfterMethod cleanDataAfterTest

         [testng] SKIPPED CONFIGURATION: @AfterMethod end

         [testng] SKIPPED CONFIGURATION: @BeforeMethod begin

         [testng] SKIPPED CONFIGURATION: @BeforeMethod prepareDataBeforeTest

         [testng] SKIPPED CONFIGURATION: @AfterMethod cleanDataAfterTest

         [testng] SKIPPED CONFIGURATION: @AfterMethod end

         [testng] SKIPPED CONFIGURATION: @BeforeMethod begin

         [testng] SKIPPED CONFIGURATION: @BeforeMethod prepareDataBeforeTest

         [testng] SKIPPED CONFIGURATION: @AfterMethod cleanDataAfterTest

         [testng] SKIPPED CONFIGURATION: @AfterMethod end

         [testng] SKIPPED CONFIGURATION: @AfterClass destroy

         [testng] SKIPPED CONFIGURATION: @AfterClass cleanupClass

         [testng] SKIPPED CONFIGURATION: @BeforeClass setBinaryDir

         [testng] SKIPPED CONFIGURATION: @BeforeClass setDatabase

         [testng] SKIPPED CONFIGURATION: @BeforeClass setupClass

         [testng] SKIPPED CONFIGURATION: @BeforeClass setDatasourceJndiName

         [testng] SKIPPED CONFIGURATION: @BeforeMethod begin

         [testng] SKIPPED CONFIGURATION: @BeforeMethod prepareDataBeforeTest

         [testng] SKIPPED CONFIGURATION: @AfterMethod cleanDataAfterTest

         [testng] SKIPPED CONFIGURATION: @AfterMethod end

         [testng] SKIPPED CONFIGURATION: @BeforeMethod begin

         [testng] SKIPPED CONFIGURATION: @BeforeMethod prepareDataBeforeTest

         [testng] SKIPPED CONFIGURATION: @AfterMethod cleanDataAfterTest

         [testng] SKIPPED CONFIGURATION: @AfterMethod end

         [testng] SKIPPED CONFIGURATION: @BeforeMethod begin

         [testng] SKIPPED CONFIGURATION: @BeforeMethod prepareDataBeforeTest

         [testng] SKIPPED CONFIGURATION: @AfterMethod cleanDataAfterTest

         [testng] SKIPPED CONFIGURATION: @AfterMethod end

         [testng] SKIPPED CONFIGURATION: @BeforeMethod begin

         [testng] SKIPPED CONFIGURATION: @BeforeMethod prepareDataBeforeTest

         [testng] SKIPPED CONFIGURATION: @AfterMethod cleanDataAfterTest

         [testng] SKIPPED CONFIGURATION: @AfterMethod end

         [testng] SKIPPED CONFIGURATION: @BeforeMethod begin

         [testng] SKIPPED CONFIGURATION: @BeforeMethod prepareDataBeforeTest

         [testng] SKIPPED CONFIGURATION: @AfterMethod cleanDataAfterTest

         [testng] SKIPPED CONFIGURATION: @AfterMethod end

         [testng] SKIPPED CONFIGURATION: @BeforeMethod begin

         [testng] SKIPPED CONFIGURATION: @BeforeMethod prepareDataBeforeTest

         [testng] SKIPPED CONFIGURATION: @AfterMethod cleanDataAfterTest

         [testng] SKIPPED CONFIGURATION: @AfterMethod end

         [testng] SKIPPED CONFIGURATION: @AfterClass cleanupClass

         [testng] SKIPPED CONFIGURATION: @BeforeClass setDatasourceJndiName

         [testng] SKIPPED CONFIGURATION: @BeforeClass init

         [testng] SKIPPED CONFIGURATION: @BeforeClass setBinaryDir

         [testng] SKIPPED CONFIGURATION: @BeforeClass setDatabase

         [testng] SKIPPED CONFIGURATION: @BeforeClass setupClass

         [testng] SKIPPED CONFIGURATION: @BeforeMethod begin

         [testng] SKIPPED CONFIGURATION: @BeforeMethod prepareDataBeforeTest

         [testng] SKIPPED CONFIGURATION: @AfterMethod cleanDataAfterTest

         [testng] SKIPPED CONFIGURATION: @AfterMethod end

         [testng] SKIPPED CONFIGURATION: @BeforeMethod begin

         [testng] SKIPPED CONFIGURATION: @BeforeMethod prepareDataBeforeTest

         [testng] SKIPPED CONFIGURATION: @AfterMethod cleanDataAfterTest

         [testng] SKIPPED CONFIGURATION: @AfterMethod end

         [testng] SKIPPED CONFIGURATION: @AfterClass destroy

         [testng] SKIPPED CONFIGURATION: @AfterClass cleanupClass

         [testng] SKIPPED CONFIGURATION: @BeforeClass setupClass

         [testng] SKIPPED CONFIGURATION: @BeforeClass init

         [testng] SKIPPED CONFIGURATION: @BeforeMethod begin

         [testng] SKIPPED CONFIGURATION: @AfterMethod end

         [testng] SKIPPED CONFIGURATION: @BeforeMethod begin

         [testng] SKIPPED CONFIGURATION: @AfterMethod end

         [testng] SKIPPED CONFIGURATION: @BeforeMethod begin

         [testng] SKIPPED CONFIGURATION: @AfterMethod end

         [testng] SKIPPED CONFIGURATION: @BeforeMethod begin

         [testng] SKIPPED CONFIGURATION: @AfterMethod end

         [testng] SKIPPED CONFIGURATION: @BeforeMethod begin

         [testng] SKIPPED CONFIGURATION: @AfterMethod end

         [testng] SKIPPED CONFIGURATION: @BeforeMethod begin

         [testng] SKIPPED CONFIGURATION: @AfterMethod end

         [testng] SKIPPED CONFIGURATION: @AfterClass cleanupClass

         [testng] SKIPPED CONFIGURATION: @BeforeClass setDatabase

         [testng] SKIPPED CONFIGURATION: @BeforeClass setupClass

         [testng] SKIPPED CONFIGURATION: @BeforeClass setDatasourceJndiName

         [testng] SKIPPED CONFIGURATION: @BeforeClass init

         [testng] SKIPPED CONFIGURATION: @BeforeClass setBinaryDir

         [testng] SKIPPED CONFIGURATION: @BeforeMethod begin

         [testng] SKIPPED CONFIGURATION: @BeforeMethod prepareDataBeforeTest

         [testng] SKIPPED CONFIGURATION: @AfterMethod cleanDataAfterTest

         [testng] SKIPPED CONFIGURATION: @AfterMethod end

         [testng] SKIPPED CONFIGURATION: @AfterClass destroy

         [testng] SKIPPED CONFIGURATION: @AfterClass cleanupClass

         [testng] SKIPPED CONFIGURATION: @BeforeClass setDatabase

         [testng] SKIPPED CONFIGURATION: @BeforeClass setupClass

         [testng] SKIPPED CONFIGURATION: @BeforeClass setDatasourceJndiName

         [testng] SKIPPED CONFIGURATION: @BeforeClass init

         [testng] SKIPPED CONFIGURATION: @BeforeClass setBinaryDir

         [testng] SKIPPED CONFIGURATION: @BeforeMethod begin

         [testng] SKIPPED CONFIGURATION: @BeforeMethod prepareDataBeforeTest

         [testng] SKIPPED CONFIGURATION: @AfterMethod cleanDataAfterTest

         [testng] SKIPPED CONFIGURATION: @AfterMethod end

         [testng] SKIPPED CONFIGURATION: @BeforeMethod begin

         [testng] SKIPPED CONFIGURATION: @BeforeMethod prepareDataBeforeTest

         [testng] SKIPPED CONFIGURATION: @AfterMethod cleanDataAfterTest

         [testng] SKIPPED CONFIGURATION: @AfterMethod end

         [testng] SKIPPED CONFIGURATION: @BeforeMethod begin

         [testng] SKIPPED CONFIGURATION: @BeforeMethod prepareDataBeforeTest

         [testng] SKIPPED CONFIGURATION: @AfterMethod cleanDataAfterTest

         [testng] SKIPPED CONFIGURATION: @AfterMethod end

         [testng] SKIPPED CONFIGURATION: @BeforeMethod begin

         [testng] SKIPPED CONFIGURATION: @BeforeMethod prepareDataBeforeTest

         [testng] SKIPPED CONFIGURATION: @AfterMethod cleanDataAfterTest

         [testng] SKIPPED CONFIGURATION: @AfterMethod end

         [testng] SKIPPED CONFIGURATION: @BeforeMethod begin

         [testng] SKIPPED CONFIGURATION: @BeforeMethod prepareDataBeforeTest

         [testng] SKIPPED CONFIGURATION: @AfterMethod cleanDataAfterTest

         [testng] SKIPPED CONFIGURATION: @AfterMethod end

         [testng] SKIPPED CONFIGURATION: @BeforeMethod begin

         [testng] SKIPPED CONFIGURATION: @BeforeMethod prepareDataBeforeTest

         [testng] SKIPPED CONFIGURATION: @AfterMethod cleanDataAfterTest

         [testng] SKIPPED CONFIGURATION: @AfterMethod end

         [testng] SKIPPED CONFIGURATION: @BeforeMethod begin

         [testng] SKIPPED CONFIGURATION: @BeforeMethod prepareDataBeforeTest

         [testng] SKIPPED CONFIGURATION: @AfterMethod cleanDataAfterTest

         [testng] SKIPPED CONFIGURATION: @AfterMethod end

         [testng] SKIPPED CONFIGURATION: @BeforeMethod begin

         [testng] SKIPPED CONFIGURATION: @BeforeMethod prepareDataBeforeTest

         [testng] SKIPPED CONFIGURATION: @AfterMethod cleanDataAfterTest

         [testng] SKIPPED CONFIGURATION: @AfterMethod end

         [testng] SKIPPED CONFIGURATION: @BeforeMethod begin

         [testng] SKIPPED CONFIGURATION: @BeforeMethod prepareDataBeforeTest

         [testng] SKIPPED CONFIGURATION: @AfterMethod cleanDataAfterTest

         [testng] SKIPPED CONFIGURATION: @AfterMethod end

         [testng] SKIPPED CONFIGURATION: @BeforeMethod begin

         [testng] SKIPPED CONFIGURATION: @BeforeMethod prepareDataBeforeTest

         [testng] SKIPPED CONFIGURATION: @AfterMethod cleanDataAfterTest

         [testng] SKIPPED CONFIGURATION: @AfterMethod end

         [testng] SKIPPED CONFIGURATION: @BeforeMethod begin

         [testng] SKIPPED CONFIGURATION: @BeforeMethod prepareDataBeforeTest

         [testng] SKIPPED CONFIGURATION: @AfterMethod cleanDataAfterTest

         [testng] SKIPPED CONFIGURATION: @AfterMethod end

         [testng] SKIPPED CONFIGURATION: @BeforeMethod begin

         [testng] SKIPPED CONFIGURATION: @BeforeMethod prepareDataBeforeTest

         [testng] SKIPPED CONFIGURATION: @AfterMethod cleanDataAfterTest

         [testng] SKIPPED CONFIGURATION: @AfterMethod end

         [testng] SKIPPED CONFIGURATION: @BeforeMethod begin

         [testng] SKIPPED CONFIGURATION: @BeforeMethod prepareDataBeforeTest

         [testng] SKIPPED CONFIGURATION: @AfterMethod cleanDataAfterTest

         [testng] SKIPPED CONFIGURATION: @AfterMethod end

         [testng] SKIPPED CONFIGURATION: @BeforeMethod begin

         [testng] SKIPPED CONFIGURATION: @BeforeMethod prepareDataBeforeTest

         [testng] SKIPPED CONFIGURATION: @AfterMethod cleanDataAfterTest

         [testng] SKIPPED CONFIGURATION: @AfterMethod end

         [testng] SKIPPED CONFIGURATION: @BeforeMethod begin

         [testng] SKIPPED CONFIGURATION: @BeforeMethod prepareDataBeforeTest

         [testng] SKIPPED CONFIGURATION: @AfterMethod cleanDataAfterTest

         [testng] SKIPPED CONFIGURATION: @AfterMethod end

         [testng] SKIPPED CONFIGURATION: @BeforeMethod begin

         [testng] SKIPPED CONFIGURATION: @BeforeMethod prepareDataBeforeTest

         [testng] SKIPPED CONFIGURATION: @AfterMethod cleanDataAfterTest

         [testng] SKIPPED CONFIGURATION: @AfterMethod end

         [testng] SKIPPED CONFIGURATION: @BeforeMethod begin

         [testng] SKIPPED CONFIGURATION: @BeforeMethod prepareDataBeforeTest

         [testng] SKIPPED CONFIGURATION: @AfterMethod cleanDataAfterTest

         [testng] SKIPPED CONFIGURATION: @AfterMethod end

         [testng] SKIPPED CONFIGURATION: @AfterClass destroy

         [testng] SKIPPED CONFIGURATION: @AfterClass cleanupClass

         [testng] SKIPPED CONFIGURATION: @BeforeClass setDatabase

         [testng] SKIPPED CONFIGURATION: @BeforeClass setupClass

         [testng] SKIPPED CONFIGURATION: @BeforeClass setDatasourceJndiName

         [testng] SKIPPED CONFIGURATION: @BeforeClass init

         [testng] SKIPPED CONFIGURATION: @BeforeClass setBinaryDir

         [testng] SKIPPED CONFIGURATION: @BeforeMethod begin

         [testng] SKIPPED CONFIGURATION: @BeforeMethod prepareDataBeforeTest

         [testng] SKIPPED CONFIGURATION: @AfterMethod cleanDataAfterTest

         [testng] SKIPPED CONFIGURATION: @AfterMethod end

         [testng] SKIPPED CONFIGURATION: @BeforeMethod begin

         [testng] SKIPPED CONFIGURATION: @BeforeMethod prepareDataBeforeTest

         [testng] SKIPPED CONFIGURATION: @AfterMethod cleanDataAfterTest

         [testng] SKIPPED CONFIGURATION: @AfterMethod end

         [testng] SKIPPED CONFIGURATION: @AfterClass destroy

         [testng] SKIPPED CONFIGURATION: @AfterClass cleanupClass

         [testng] SKIPPED CONFIGURATION: @BeforeClass setDatasourceJndiName

         [testng] SKIPPED CONFIGURATION: @BeforeClass init

         [testng] SKIPPED CONFIGURATION: @BeforeClass setBinaryDir

         [testng] SKIPPED CONFIGURATION: @BeforeClass setDatabase

         [testng] SKIPPED CONFIGURATION: @BeforeClass setupClass

         [testng] SKIPPED CONFIGURATION: @BeforeMethod begin

         [testng] SKIPPED CONFIGURATION: @BeforeMethod prepareDataBeforeTest

         [testng] SKIPPED CONFIGURATION: @AfterMethod cleanDataAfterTest

         [testng] SKIPPED CONFIGURATION: @AfterMethod end

         [testng] SKIPPED CONFIGURATION: @BeforeMethod begin

         [testng] SKIPPED CONFIGURATION: @BeforeMethod prepareDataBeforeTest

         [testng] SKIPPED CONFIGURATION: @AfterMethod cleanDataAfterTest

         [testng] SKIPPED CONFIGURATION: @AfterMethod end

         [testng] SKIPPED CONFIGURATION: @BeforeMethod begin

         [testng] SKIPPED CONFIGURATION: @BeforeMethod prepareDataBeforeTest

         [testng] SKIPPED CONFIGURATION: @AfterMethod cleanDataAfterTest

         [testng] SKIPPED CONFIGURATION: @AfterMethod end

         [testng] SKIPPED CONFIGURATION: @AfterClass destroy

         [testng] SKIPPED CONFIGURATION: @AfterClass cleanupClass

         [testng] SKIPPED CONFIGURATION: @BeforeClass setDatabase

         [testng] SKIPPED CONFIGURATION: @BeforeClass setupClass

         [testng] SKIPPED CONFIGURATION: @BeforeClass setDatasourceJndiName

         [testng] SKIPPED CONFIGURATION: @BeforeClass init

         [testng] SKIPPED CONFIGURATION: @BeforeClass setBinaryDir

         [testng] SKIPPED CONFIGURATION: @BeforeMethod begin

         [testng] SKIPPED CONFIGURATION: @BeforeMethod prepareDataBeforeTest

         [testng] SKIPPED CONFIGURATION: @AfterMethod cleanDataAfterTest

         [testng] SKIPPED CONFIGURATION: @AfterMethod end

         [testng] SKIPPED CONFIGURATION: @BeforeMethod begin

         [testng] SKIPPED CONFIGURATION: @BeforeMethod prepareDataBeforeTest

         [testng] SKIPPED CONFIGURATION: @AfterMethod cleanDataAfterTest

         [testng] SKIPPED CONFIGURATION: @AfterMethod end

         [testng] SKIPPED CONFIGURATION: @BeforeMethod begin

         [testng] SKIPPED CONFIGURATION: @BeforeMethod prepareDataBeforeTest

         [testng] SKIPPED CONFIGURATION: @AfterMethod cleanDataAfterTest

         [testng] SKIPPED CONFIGURATION: @AfterMethod end

         [testng] SKIPPED CONFIGURATION: @BeforeMethod begin

         [testng] SKIPPED CONFIGURATION: @BeforeMethod prepareDataBeforeTest

         [testng] SKIPPED CONFIGURATION: @AfterMethod cleanDataAfterTest

         [testng] SKIPPED CONFIGURATION: @AfterMethod end

         [testng] SKIPPED CONFIGURATION: @BeforeMethod begin

         [testng] SKIPPED CONFIGURATION: @BeforeMethod prepareDataBeforeTest

         [testng] SKIPPED CONFIGURATION: @AfterMethod cleanDataAfterTest

         [testng] SKIPPED CONFIGURATION: @AfterMethod end

         [testng] SKIPPED CONFIGURATION: @AfterClass destroy

         [testng] SKIPPED CONFIGURATION: @AfterClass cleanupClass

         [testng] SKIPPED CONFIGURATION: @BeforeClass setDatabase

         [testng] SKIPPED CONFIGURATION: @BeforeClass setupClass

         [testng] SKIPPED CONFIGURATION: @BeforeClass setDatasourceJndiName

         [testng] SKIPPED CONFIGURATION: @BeforeClass init

         [testng] SKIPPED CONFIGURATION: @BeforeClass setBinaryDir

         [testng] SKIPPED CONFIGURATION: @BeforeMethod begin

         [testng] SKIPPED CONFIGURATION: @BeforeMethod prepareDataBeforeTest

         [testng] SKIPPED CONFIGURATION: @AfterMethod cleanDataAfterTest

         [testng] SKIPPED CONFIGURATION: @AfterMethod end

         [testng] SKIPPED CONFIGURATION: @AfterClass destroy

         [testng] SKIPPED CONFIGURATION: @AfterClass cleanupClass

         [testng] SKIPPED CONFIGURATION: @BeforeClass setDatasourceJndiName

         [testng] SKIPPED CONFIGURATION: @BeforeClass init

         [testng] SKIPPED CONFIGURATION: @BeforeClass setBinaryDir

         [testng] SKIPPED CONFIGURATION: @BeforeClass setDatabase

         [testng] SKIPPED CONFIGURATION: @BeforeClass setupClass

         [testng] SKIPPED CONFIGURATION: @BeforeMethod begin

         [testng] SKIPPED CONFIGURATION: @BeforeMethod prepareDataBeforeTest

         [testng] SKIPPED CONFIGURATION: @AfterMethod cleanDataAfterTest

         [testng] SKIPPED CONFIGURATION: @AfterMethod end

         [testng] SKIPPED CONFIGURATION: @AfterClass destroy

         [testng] SKIPPED CONFIGURATION: @AfterClass cleanupClass

         [testng] SKIPPED CONFIGURATION: @BeforeClass setDatabase

         [testng] SKIPPED CONFIGURATION: @BeforeClass setupClass

         [testng] SKIPPED CONFIGURATION: @BeforeClass setDatasourceJndiName

         [testng] SKIPPED CONFIGURATION: @BeforeClass init

         [testng] SKIPPED CONFIGURATION: @BeforeClass setBinaryDir

         [testng] SKIPPED CONFIGURATION: @BeforeMethod begin

         [testng] SKIPPED CONFIGURATION: @BeforeMethod prepareDataBeforeTest

         [testng] SKIPPED CONFIGURATION: @AfterMethod cleanDataAfterTest

         [testng] SKIPPED CONFIGURATION: @AfterMethod end

         [testng] SKIPPED CONFIGURATION: @BeforeMethod begin

         [testng] SKIPPED CONFIGURATION: @BeforeMethod prepareDataBeforeTest

         [testng] SKIPPED CONFIGURATION: @AfterMethod cleanDataAfterTest

         [testng] SKIPPED CONFIGURATION: @AfterMethod end

         [testng] SKIPPED CONFIGURATION: @AfterClass destroy

         [testng] SKIPPED CONFIGURATION: @AfterClass cleanupClass

         [testng] SKIPPED CONFIGURATION: @BeforeClass setDatabase

         [testng] SKIPPED CONFIGURATION: @BeforeClass setupClass

         [testng] SKIPPED CONFIGURATION: @BeforeClass setDatasourceJndiName

         [testng] SKIPPED CONFIGURATION: @BeforeClass init

         [testng] SKIPPED CONFIGURATION: @BeforeClass setBinaryDir

         [testng] SKIPPED CONFIGURATION: @BeforeMethod begin

         [testng] SKIPPED CONFIGURATION: @BeforeMethod prepareDataBeforeTest

         [testng] SKIPPED CONFIGURATION: @AfterMethod cleanDataAfterTest

         [testng] SKIPPED CONFIGURATION: @AfterMethod end

         [testng] SKIPPED CONFIGURATION: @AfterClass destroy

         [testng] SKIPPED CONFIGURATION: @AfterClass cleanupClass

         [testng] SKIPPED CONFIGURATION: @BeforeClass setDatabase

         [testng] SKIPPED CONFIGURATION: @BeforeClass setupClass

         [testng] SKIPPED CONFIGURATION: @BeforeClass setDatasourceJndiName

         [testng] SKIPPED CONFIGURATION: @BeforeClass init

         [testng] SKIPPED CONFIGURATION: @BeforeClass setBinaryDir

         [testng] SKIPPED CONFIGURATION: @BeforeMethod begin

         [testng] SKIPPED CONFIGURATION: @BeforeMethod prepareDataBeforeTest

         [testng] SKIPPED CONFIGURATION: @AfterMethod cleanDataAfterTest

         [testng] SKIPPED CONFIGURATION: @AfterMethod end

         [testng] SKIPPED CONFIGURATION: @AfterClass destroy

         [testng] SKIPPED CONFIGURATION: @AfterClass cleanupClass

         [testng] SKIPPED CONFIGURATION: @BeforeClass setDatasourceJndiName

         [testng] SKIPPED CONFIGURATION: @BeforeClass init

         [testng] SKIPPED CONFIGURATION: @BeforeClass setBinaryDir

         [testng] SKIPPED CONFIGURATION: @BeforeClass setDatabase

         [testng] SKIPPED CONFIGURATION: @BeforeClass setupClass

         [testng] SKIPPED CONFIGURATION: @BeforeMethod begin

         [testng] SKIPPED CONFIGURATION: @BeforeMethod prepareDataBeforeTest

         [testng] SKIPPED CONFIGURATION: @AfterMethod cleanDataAfterTest

         [testng] SKIPPED CONFIGURATION: @AfterMethod end

         [testng] SKIPPED CONFIGURATION: @AfterClass destroy

         [testng] SKIPPED CONFIGURATION: @AfterClass cleanupClass

         [testng] SKIPPED CONFIGURATION: @BeforeClass setDatabase

         [testng] SKIPPED CONFIGURATION: @BeforeClass setDatasourceJndiName

         [testng] SKIPPED CONFIGURATION: @BeforeClass init

         [testng] SKIPPED CONFIGURATION: @BeforeClass setBinaryDir

         [testng] SKIPPED CONFIGURATION: @BeforeClass setupClass

         [testng] SKIPPED CONFIGURATION: @BeforeMethod begin

         [testng] SKIPPED CONFIGURATION: @BeforeMethod prepareDataBeforeTest

         [testng] SKIPPED CONFIGURATION: @AfterMethod cleanDataAfterTest

         [testng] SKIPPED CONFIGURATION: @AfterMethod end

         [testng] SKIPPED CONFIGURATION: @BeforeMethod begin

         [testng] SKIPPED CONFIGURATION: @BeforeMethod prepareDataBeforeTest

         [testng] SKIPPED CONFIGURATION: @AfterMethod cleanDataAfterTest

         [testng] SKIPPED CONFIGURATION: @AfterMethod end

         [testng] SKIPPED CONFIGURATION: @AfterClass destroy

         [testng] SKIPPED CONFIGURATION: @AfterClass cleanupClass

         [testng] SKIPPED CONFIGURATION: @BeforeClass setDatasourceJndiName

         [testng] SKIPPED CONFIGURATION: @BeforeClass init

         [testng] SKIPPED CONFIGURATION: @BeforeClass setBinaryDir

         [testng] SKIPPED CONFIGURATION: @BeforeClass setDatabase

         [testng] SKIPPED CONFIGURATION: @BeforeClass setupClass

         [testng] SKIPPED CONFIGURATION: @BeforeMethod begin

         [testng] SKIPPED CONFIGURATION: @BeforeMethod prepareDataBeforeTest

         [testng] SKIPPED CONFIGURATION: @AfterMethod cleanDataAfterTest

         [testng] SKIPPED CONFIGURATION: @AfterMethod end

         [testng] SKIPPED CONFIGURATION: @AfterClass destroy

         [testng] SKIPPED CONFIGURATION: @AfterClass cleanupClass

         [testng] SKIPPED CONFIGURATION: @BeforeClass setDatabase

         [testng] SKIPPED CONFIGURATION: @BeforeClass setupClass

         [testng] SKIPPED CONFIGURATION: @BeforeClass setDatasourceJndiName

         [testng] SKIPPED CONFIGURATION: @BeforeClass init

         [testng] SKIPPED CONFIGURATION: @BeforeClass setBinaryDir

         [testng] SKIPPED CONFIGURATION: @BeforeMethod begin

         [testng] SKIPPED CONFIGURATION: @BeforeMethod prepareDataBeforeTest

         [testng] SKIPPED CONFIGURATION: @AfterMethod cleanDataAfterTest

         [testng] SKIPPED CONFIGURATION: @AfterMethod end

         [testng] SKIPPED CONFIGURATION: @BeforeMethod begin

         [testng] SKIPPED CONFIGURATION: @BeforeMethod prepareDataBeforeTest

         [testng] SKIPPED CONFIGURATION: @AfterMethod cleanDataAfterTest

         [testng] SKIPPED CONFIGURATION: @AfterMethod end

         [testng] SKIPPED CONFIGURATION: @AfterClass destroy

         [testng] SKIPPED CONFIGURATION: @AfterClass cleanupClass

         [testng] SKIPPED CONFIGURATION: @BeforeClass setBinaryDir

         [testng] SKIPPED CONFIGURATION: @BeforeClass setDatabase

         [testng] SKIPPED CONFIGURATION: @BeforeClass setupClass

         [testng] SKIPPED CONFIGURATION: @BeforeClass setDatasourceJndiName

         [testng] SKIPPED CONFIGURATION: @BeforeMethod begin

         [testng] SKIPPED CONFIGURATION: @BeforeMethod prepareDataBeforeTest

         [testng] SKIPPED CONFIGURATION: @BeforeMethod init

         [testng] SKIPPED CONFIGURATION: @AfterMethod destroy

         [testng] SKIPPED CONFIGURATION: @AfterMethod cleanDataAfterTest

         [testng] SKIPPED CONFIGURATION: @AfterMethod end

         [testng] SKIPPED CONFIGURATION: @BeforeMethod begin

         [testng] SKIPPED CONFIGURATION: @BeforeMethod prepareDataBeforeTest

         [testng] SKIPPED CONFIGURATION: @BeforeMethod init

         [testng] SKIPPED CONFIGURATION: @AfterMethod destroy

         [testng] SKIPPED CONFIGURATION: @AfterMethod cleanDataAfterTest

         [testng] SKIPPED CONFIGURATION: @AfterMethod end

         [testng] SKIPPED CONFIGURATION: @AfterClass cleanupClass

         [testng] SKIPPED CONFIGURATION: @BeforeClass setBinaryDir

         [testng] SKIPPED CONFIGURATION: @BeforeClass setDatabase

         [testng] SKIPPED CONFIGURATION: @BeforeClass setupClass

         [testng] SKIPPED CONFIGURATION: @BeforeClass setDatasourceJndiName

         [testng] SKIPPED CONFIGURATION: @BeforeMethod begin

         [testng] SKIPPED CONFIGURATION: @BeforeMethod prepareDataBeforeTest

         [testng] SKIPPED CONFIGURATION: @AfterMethod cleanDataAfterTest

         [testng] SKIPPED CONFIGURATION: @AfterMethod end

         [testng] SKIPPED CONFIGURATION: @BeforeMethod begin

         [testng] SKIPPED CONFIGURATION: @BeforeMethod prepareDataBeforeTest

         [testng] SKIPPED CONFIGURATION: @AfterMethod cleanDataAfterTest

         [testng] SKIPPED CONFIGURATION: @AfterMethod end

         [testng] SKIPPED CONFIGURATION: @AfterClass cleanupClass

         [testng] SKIPPED CONFIGURATION: @BeforeClass setDatabase

         [testng] SKIPPED CONFIGURATION: @BeforeClass setupClass

         [testng] SKIPPED CONFIGURATION: @BeforeClass setDatasourceJndiName

         [testng] SKIPPED CONFIGURATION: @BeforeClass init

         [testng] SKIPPED CONFIGURATION: @BeforeClass setBinaryDir

         [testng] SKIPPED CONFIGURATION: @BeforeMethod begin

         [testng] SKIPPED CONFIGURATION: @BeforeMethod prepareDataBeforeTest

         [testng] SKIPPED CONFIGURATION: @AfterMethod cleanDataAfterTest

         [testng] SKIPPED CONFIGURATION: @AfterMethod end

         [testng] SKIPPED CONFIGURATION: @BeforeMethod begin

         [testng] SKIPPED CONFIGURATION: @BeforeMethod prepareDataBeforeTest

         [testng] SKIPPED CONFIGURATION: @AfterMethod cleanDataAfterTest

         [testng] SKIPPED CONFIGURATION: @AfterMethod end

         [testng] SKIPPED CONFIGURATION: @BeforeMethod begin

         [testng] SKIPPED CONFIGURATION: @BeforeMethod prepareDataBeforeTest

         [testng] SKIPPED CONFIGURATION: @AfterMethod cleanDataAfterTest

         [testng] SKIPPED CONFIGURATION: @AfterMethod end

         [testng] SKIPPED CONFIGURATION: @BeforeMethod begin

         [testng] SKIPPED CONFIGURATION: @BeforeMethod prepareDataBeforeTest

         [testng] SKIPPED CONFIGURATION: @AfterMethod cleanDataAfterTest

         [testng] SKIPPED CONFIGURATION: @AfterMethod end

         [testng] SKIPPED CONFIGURATION: @BeforeMethod begin

         [testng] SKIPPED CONFIGURATION: @BeforeMethod prepareDataBeforeTest

         [testng] SKIPPED CONFIGURATION: @AfterMethod cleanDataAfterTest

         [testng] SKIPPED CONFIGURATION: @AfterMethod end

         [testng] SKIPPED CONFIGURATION: @BeforeMethod begin

         [testng] SKIPPED CONFIGURATION: @BeforeMethod prepareDataBeforeTest

         [testng] SKIPPED CONFIGURATION: @AfterMethod cleanDataAfterTest

         [testng] SKIPPED CONFIGURATION: @AfterMethod end

         [testng] SKIPPED CONFIGURATION: @BeforeMethod begin

         [testng] SKIPPED CONFIGURATION: @BeforeMethod prepareDataBeforeTest

         [testng] SKIPPED CONFIGURATION: @AfterMethod cleanDataAfterTest

         [testng] SKIPPED CONFIGURATION: @AfterMethod end

         [testng] SKIPPED CONFIGURATION: @BeforeMethod begin

         [testng] SKIPPED CONFIGURATION: @BeforeMethod prepareDataBeforeTest

         [testng] SKIPPED CONFIGURATION: @AfterMethod cleanDataAfterTest

         [testng] SKIPPED CONFIGURATION: @AfterMethod end

         [testng] SKIPPED CONFIGURATION: @BeforeMethod begin

         [testng] SKIPPED CONFIGURATION: @BeforeMethod prepareDataBeforeTest

         [testng] SKIPPED CONFIGURATION: @AfterMethod cleanDataAfterTest

         [testng] SKIPPED CONFIGURATION: @AfterMethod end

         [testng] SKIPPED CONFIGURATION: @BeforeMethod begin

         [testng] SKIPPED CONFIGURATION: @BeforeMethod prepareDataBeforeTest

         [testng] SKIPPED CONFIGURATION: @AfterMethod cleanDataAfterTest

         [testng] SKIPPED CONFIGURATION: @AfterMethod end

         [testng] SKIPPED CONFIGURATION: @BeforeMethod begin

         [testng] SKIPPED CONFIGURATION: @BeforeMethod prepareDataBeforeTest

         [testng] SKIPPED CONFIGURATION: @AfterMethod cleanDataAfterTest

         [testng] SKIPPED CONFIGURATION: @AfterMethod end

         [testng] SKIPPED CONFIGURATION: @AfterClass destroy

         [testng] SKIPPED CONFIGURATION: @AfterClass cleanupClass

         [testng] SKIPPED CONFIGURATION: @BeforeClass setDatasourceJndiName

         [testng] SKIPPED CONFIGURATION: @BeforeClass init

         [testng] SKIPPED CONFIGURATION: @BeforeClass setBinaryDir

         [testng] SKIPPED CONFIGURATION: @BeforeClass setDatabase

         [testng] SKIPPED CONFIGURATION: @BeforeClass setupClass

         [testng] SKIPPED CONFIGURATION: @BeforeMethod begin

         [testng] SKIPPED CONFIGURATION: @BeforeMethod prepareDataBeforeTest

         [testng] SKIPPED CONFIGURATION: @AfterMethod cleanDataAfterTest

         [testng] SKIPPED CONFIGURATION: @AfterMethod end

         [testng] SKIPPED CONFIGURATION: @AfterClass destroy

         [testng] SKIPPED CONFIGURATION: @AfterClass cleanupClass

         [testng] SKIPPED CONFIGURATION: @BeforeClass setupClass

         [testng] SKIPPED CONFIGURATION: @BeforeMethod begin

         [testng] SKIPPED CONFIGURATION: @BeforeMethod init

         [testng] SKIPPED CONFIGURATION: @AfterMethod destroy

         [testng] SKIPPED CONFIGURATION: @AfterMethod end

         [testng] SKIPPED CONFIGURATION: @BeforeMethod begin

         [testng] SKIPPED CONFIGURATION: @BeforeMethod init

         [testng] SKIPPED CONFIGURATION: @AfterMethod destroy

         [testng] SKIPPED CONFIGURATION: @AfterMethod end

         [testng] SKIPPED CONFIGURATION: @BeforeMethod begin

         [testng] SKIPPED CONFIGURATION: @BeforeMethod init

         [testng] SKIPPED CONFIGURATION: @AfterMethod destroy

         [testng] SKIPPED CONFIGURATION: @AfterMethod end

         [testng] SKIPPED CONFIGURATION: @AfterClass cleanupClass

         [testng] SKIPPED CONFIGURATION: @BeforeClass setDatabase

         [testng] SKIPPED CONFIGURATION: @BeforeClass setDatasourceJndiName

         [testng] SKIPPED CONFIGURATION: @BeforeClass init

         [testng] SKIPPED CONFIGURATION: @BeforeClass setBinaryDir

         [testng] SKIPPED CONFIGURATION: @BeforeClass setupClass

         [testng] SKIPPED CONFIGURATION: @BeforeMethod begin

         [testng] SKIPPED CONFIGURATION: @BeforeMethod prepareDataBeforeTest

         [testng] SKIPPED CONFIGURATION: @AfterMethod cleanDataAfterTest

         [testng] SKIPPED CONFIGURATION: @AfterMethod end

         [testng] SKIPPED CONFIGURATION: @BeforeMethod begin

         [testng] SKIPPED CONFIGURATION: @BeforeMethod prepareDataBeforeTest

         [testng] SKIPPED CONFIGURATION: @AfterMethod cleanDataAfterTest

         [testng] SKIPPED CONFIGURATION: @AfterMethod end

         [testng] SKIPPED CONFIGURATION: @BeforeMethod begin

         [testng] SKIPPED CONFIGURATION: @BeforeMethod prepareDataBeforeTest

         [testng] SKIPPED CONFIGURATION: @AfterMethod cleanDataAfterTest

         [testng] SKIPPED CONFIGURATION: @AfterMethod end

         [testng] SKIPPED CONFIGURATION: @AfterClass destroy

         [testng] SKIPPED CONFIGURATION: @AfterClass cleanupClass

         [testng] SKIPPED CONFIGURATION: @BeforeClass setDatasourceJndiName

         [testng] SKIPPED CONFIGURATION: @BeforeClass init

         [testng] SKIPPED CONFIGURATION: @BeforeClass setBinaryDir

         [testng] SKIPPED CONFIGURATION: @BeforeClass setDatabase

         [testng] SKIPPED CONFIGURATION: @BeforeClass setupClass

         [testng] SKIPPED CONFIGURATION: @BeforeMethod begin

         [testng] SKIPPED CONFIGURATION: @BeforeMethod prepareDataBeforeTest

         [testng] SKIPPED CONFIGURATION: @AfterMethod cleanDataAfterTest

         [testng] SKIPPED CONFIGURATION: @AfterMethod end

         [testng] SKIPPED CONFIGURATION: @AfterClass cleanupClass

         [testng] SKIPPED CONFIGURATION: @BeforeClass setBinaryDir

         [testng] SKIPPED CONFIGURATION: @BeforeClass setDatabase

         [testng] SKIPPED CONFIGURATION: @BeforeClass setupClass

         [testng] SKIPPED CONFIGURATION: @BeforeClass setDatasourceJndiName

         [testng] SKIPPED CONFIGURATION: @BeforeMethod begin

         [testng] SKIPPED CONFIGURATION: @BeforeMethod prepareDataBeforeTest

         [testng] SKIPPED CONFIGURATION: @BeforeMethod init

         [testng] SKIPPED CONFIGURATION: @AfterMethod cleanDataAfterTest

         [testng] SKIPPED CONFIGURATION: @AfterMethod end

         [testng] SKIPPED CONFIGURATION: @BeforeMethod begin

         [testng] SKIPPED CONFIGURATION: @BeforeMethod prepareDataBeforeTest

         [testng] SKIPPED CONFIGURATION: @BeforeMethod init

         [testng] SKIPPED CONFIGURATION: @AfterMethod cleanDataAfterTest

         [testng] SKIPPED CONFIGURATION: @AfterMethod end

         [testng] SKIPPED CONFIGURATION: @BeforeMethod begin

         [testng] SKIPPED CONFIGURATION: @BeforeMethod prepareDataBeforeTest

         [testng] SKIPPED CONFIGURATION: @BeforeMethod init

         [testng] SKIPPED CONFIGURATION: @AfterMethod cleanDataAfterTest

         [testng] SKIPPED CONFIGURATION: @AfterMethod end

         [testng] SKIPPED CONFIGURATION: @BeforeMethod begin

         [testng] SKIPPED CONFIGURATION: @BeforeMethod prepareDataBeforeTest

         [testng] SKIPPED CONFIGURATION: @BeforeMethod init

         [testng] SKIPPED CONFIGURATION: @AfterMethod cleanDataAfterTest

         [testng] SKIPPED CONFIGURATION: @AfterMethod end

         [testng] SKIPPED CONFIGURATION: @BeforeMethod begin

         [testng] SKIPPED CONFIGURATION: @BeforeMethod prepareDataBeforeTest

         [testng] SKIPPED CONFIGURATION: @BeforeMethod init

         [testng] SKIPPED CONFIGURATION: @AfterMethod cleanDataAfterTest

         [testng] SKIPPED CONFIGURATION: @AfterMethod end

         [testng] SKIPPED CONFIGURATION: @AfterClass destroy

         [testng] SKIPPED CONFIGURATION: @AfterClass cleanupClass

         [testng] SKIPPED CONFIGURATION: @BeforeClass setBinaryDir

         [testng] SKIPPED CONFIGURATION: @BeforeClass setDatabase

         [testng] SKIPPED CONFIGURATION: @BeforeClass setupClass

        [testng] SKIPPED CONFIGURATION: @BeforeClass setDatasourceJndiName

         [testng] SKIPPED CONFIGURATION: @BeforeMethod begin

         [testng] SKIPPED CONFIGURATION: @BeforeMethod prepareDataBeforeTest

         [testng] SKIPPED CONFIGURATION: @BeforeMethod init

         [testng] SKIPPED CONFIGURATION: @AfterMethod cleanDataAfterTest

         [testng] SKIPPED CONFIGURATION: @AfterMethod end

         [testng] SKIPPED CONFIGURATION: @BeforeMethod begin

         [testng] SKIPPED CONFIGURATION: @BeforeMethod prepareDataBeforeTest

         [testng] SKIPPED CONFIGURATION: @BeforeMethod init

         [testng] SKIPPED CONFIGURATION: @AfterMethod cleanDataAfterTest

         [testng] SKIPPED CONFIGURATION: @AfterMethod end

         [testng] SKIPPED CONFIGURATION: @BeforeMethod begin

         [testng] SKIPPED CONFIGURATION: @BeforeMethod prepareDataBeforeTest

         [testng] SKIPPED CONFIGURATION: @BeforeMethod init

         [testng] SKIPPED CONFIGURATION: @AfterMethod cleanDataAfterTest

         [testng] SKIPPED CONFIGURATION: @AfterMethod end

         [testng] SKIPPED CONFIGURATION: @AfterClass destroy

         [testng] SKIPPED CONFIGURATION: @AfterClass cleanupClass

         [testng] SKIPPED CONFIGURATION: @BeforeClass setupClass

         [testng] SKIPPED CONFIGURATION: @BeforeMethod begin

         [testng] SKIPPED CONFIGURATION: @BeforeMethod init

         [testng] SKIPPED CONFIGURATION: @AfterMethod destroy

         [testng] SKIPPED CONFIGURATION: @AfterMethod end

         [testng] SKIPPED CONFIGURATION: @BeforeMethod begin

         [testng] SKIPPED CONFIGURATION: @BeforeMethod init

         [testng] SKIPPED CONFIGURATION: @AfterMethod destroy

         [testng] SKIPPED CONFIGURATION: @AfterMethod end

         [testng] SKIPPED CONFIGURATION: @BeforeMethod begin

         [testng] SKIPPED CONFIGURATION: @BeforeMethod init

         [testng] SKIPPED CONFIGURATION: @AfterMethod destroy

         [testng] SKIPPED CONFIGURATION: @AfterMethod end

         [testng] SKIPPED CONFIGURATION: @BeforeMethod begin

         [testng] SKIPPED CONFIGURATION: @BeforeMethod init

         [testng] SKIPPED CONFIGURATION: @AfterMethod destroy

         [testng] SKIPPED CONFIGURATION: @AfterMethod end

         [testng] SKIPPED CONFIGURATION: @BeforeMethod begin

         [testng] SKIPPED CONFIGURATION: @BeforeMethod init

         [testng] SKIPPED CONFIGURATION: @AfterMethod destroy

         [testng] SKIPPED CONFIGURATION: @AfterMethod end

         [testng] SKIPPED CONFIGURATION: @BeforeMethod begin

         [testng] SKIPPED CONFIGURATION: @BeforeMethod init

         [testng] SKIPPED CONFIGURATION: @AfterMethod destroy

         [testng] SKIPPED CONFIGURATION: @AfterMethod end

         [testng] SKIPPED CONFIGURATION: @BeforeMethod begin

         [testng] SKIPPED CONFIGURATION: @BeforeMethod init

         [testng] SKIPPED CONFIGURATION: @AfterMethod destroy

         [testng] SKIPPED CONFIGURATION: @AfterMethod end

         [testng] SKIPPED CONFIGURATION: @BeforeMethod begin

         [testng] SKIPPED CONFIGURATION: @BeforeMethod init

         [testng] SKIPPED CONFIGURATION: @AfterMethod destroy

         [testng] SKIPPED CONFIGURATION: @AfterMethod end

         [testng] SKIPPED CONFIGURATION: @BeforeMethod begin

         [testng] SKIPPED CONFIGURATION: @BeforeMethod init

         [testng] SKIPPED CONFIGURATION: @AfterMethod destroy

         [testng] SKIPPED CONFIGURATION: @AfterMethod end

         [testng] SKIPPED CONFIGURATION: @BeforeMethod begin

         [testng] SKIPPED CONFIGURATION: @BeforeMethod init

         [testng] SKIPPED CONFIGURATION: @AfterMethod destroy

         [testng] SKIPPED CONFIGURATION: @AfterMethod end

         [testng] SKIPPED CONFIGURATION: @BeforeMethod begin

         [testng] SKIPPED CONFIGURATION: @BeforeMethod init

         [testng] SKIPPED CONFIGURATION: @AfterMethod destroy

         [testng] SKIPPED CONFIGURATION: @AfterMethod end

         [testng] SKIPPED CONFIGURATION: @BeforeMethod begin

         [testng] SKIPPED CONFIGURATION: @BeforeMethod init

         [testng] SKIPPED CONFIGURATION: @AfterMethod destroy

         [testng] SKIPPED CONFIGURATION: @AfterMethod end

         [testng] SKIPPED CONFIGURATION: @BeforeMethod begin

         [testng] SKIPPED CONFIGURATION: @BeforeMethod init

         [testng] SKIPPED CONFIGURATION: @AfterMethod destroy

         [testng] SKIPPED CONFIGURATION: @AfterMethod end

         [testng] SKIPPED CONFIGURATION: @BeforeMethod begin

         [testng] SKIPPED CONFIGURATION: @BeforeMethod init

         [testng] SKIPPED CONFIGURATION: @AfterMethod destroy

         [testng] SKIPPED CONFIGURATION: @AfterMethod end

         [testng] SKIPPED CONFIGURATION: @AfterClass cleanupClass

         [testng] SKIPPED CONFIGURATION: @BeforeClass setupClass

         [testng] SKIPPED CONFIGURATION: @BeforeMethod begin

         [testng] SKIPPED CONFIGURATION: @BeforeMethod init

         [testng] SKIPPED CONFIGURATION: @AfterMethod destroy

         [testng] SKIPPED CONFIGURATION: @AfterMethod end

         [testng] SKIPPED CONFIGURATION: @AfterClass cleanupClass

         [testng] SKIPPED CONFIGURATION: @BeforeClass setupClass

         [testng] SKIPPED CONFIGURATION: @BeforeMethod begin

         [testng] SKIPPED CONFIGURATION: @AfterMethod end

         [testng] SKIPPED CONFIGURATION: @BeforeMethod begin

         [testng] SKIPPED CONFIGURATION: @AfterMethod end

         [testng] SKIPPED CONFIGURATION: @BeforeMethod begin

         [testng] SKIPPED CONFIGURATION: @AfterMethod end

         [testng] SKIPPED CONFIGURATION: @BeforeMethod begin

         [testng] SKIPPED CONFIGURATION: @AfterMethod end

         [testng] SKIPPED CONFIGURATION: @BeforeMethod begin

         [testng] SKIPPED CONFIGURATION: @AfterMethod end

         [testng] SKIPPED CONFIGURATION: @BeforeMethod begin

         [testng] SKIPPED CONFIGURATION: @AfterMethod end

         [testng] SKIPPED CONFIGURATION: @AfterClass cleanupClass

         [testng] SKIPPED CONFIGURATION: @BeforeClass setBinaryDir

         [testng] SKIPPED CONFIGURATION: @BeforeClass setDatabase

         [testng] SKIPPED CONFIGURATION: @BeforeClass setupClass

         [testng] SKIPPED CONFIGURATION: @BeforeClass setDatasourceJndiName

         [testng] SKIPPED CONFIGURATION: @BeforeMethod begin

         [testng] SKIPPED CONFIGURATION: @BeforeMethod prepareDataBeforeTest

         [testng] SKIPPED CONFIGURATION: @BeforeMethod init

         [testng] SKIPPED CONFIGURATION: @AfterMethod cleanDataAfterTest

         [testng] SKIPPED CONFIGURATION: @AfterMethod end

         [testng] SKIPPED CONFIGURATION: @AfterClass cleanupClass

         [testng] SKIPPED: testCancellationRequest

         [testng] SKIPPED: testCancellationAvisAndCancelDemandeException

         [testng] SKIPPED: testCancellationAvis

         [testng] SKIPPED: testTypeAvis

         [testng] SKIPPED: testCreateAvis

         [testng] SKIPPED: testCancellationAvisAndCancelDemande

         [testng] SKIPPED: testExistantAvisAllowedTransition

         [testng] SKIPPED: testExistantAvisNotAllowedTransition

         [testng] SKIPPED: testRetrieveAllowedTransitionTraitementRelance

         [testng] SKIPPED: testRetrieveAllowedTransitionAnnule

         [testng] SKIPPED: testRetrieveAllowedTransitionTraitement

         [testng] SKIPPED: testIsTransitionAllowed

         [testng] SKIPPED: testSaveAvis

         [testng] SKIPPED: testFindByNoNormaliseEagerAvis

         [testng] SKIPPED: testAuthoritySearch

         [testng] SKIPPED: testCibles

         [testng] SKIPPED: testCopyNotice

         [testng] SKIPPED: testIndexAuthorities

         [testng] SKIPPED: testAuthorityDetailString

         [testng] SKIPPED: testAuthorityDetail

         [testng] SKIPPED: testCancellationNoAvis1

         [testng] SKIPPED: testDateExpiration

         [testng] SKIPPED: testCreateDemande

         [testng] SKIPPED: testUpdateDemandeThresholdReached

         [testng] SKIPPED: testCesserSuivi

         [testng] SKIPPED: testUpdateDemandeNotCommonUser

         [testng] SKIPPED: testCreateDemandeThresholdReached

         [testng] SKIPPED: testUpdateDemandePrioritaireWithThreshold

         [testng] SKIPPED: testNoticeAssociee

         [testng] SKIPPED: testUpdateDemande

         [testng] SKIPPED: testUpdateDemandePrioritaireNoThreshold

         [testng] SKIPPED: testUpdateDemandeSameUser

         [testng] SKIPPED: testCreateDemandeNotCommonUser

         [testng] SKIPPED: testAugmentationSeuil

         [testng] SKIPPED: testCreateDemandePrioritaire

         [testng] SKIPPED: testValeurParDefaut

         [testng] SKIPPED: testPoidDecimal

         [testng] SKIPPED: testUpdateDemandeSameCompany

         [testng] SKIPPED: testRetrieveAllowedTransitionDbDropDown

         [testng] SKIPPED: testRetrieveAllowedTransitionDb

         [testng] SKIPPED: testIsDemandeHasNoticePartielle

         [testng] SKIPPED: testIsContainAvisAndAvisAllCancelled

         [testng] SKIPPED: testIsContainAvisAndAvisAllCancelledSkip

         [testng] SKIPPED: testIsHandledByCompanyOfUser

         [testng] SKIPPED: testIsAtLeastOneDemandeMadeByUser

         [testng] SKIPPED: testAdditionNombreDemande

         [testng] SKIPPED: testIsDemandeHasNoticePartielle

         [testng] SKIPPED: testIsDemandeCanBeAnnulee

         [testng] SKIPPED: testFindByUser

         [testng] SKIPPED: testFTEQWithoutAnnule

         [testng] SKIPPED: testEntityQueryFilterWithLogin

         [testng] SKIPPED: testEntityQueryWithSessionCompany

         [testng] SKIPPED: testDemandeHome

         [testng] SKIPPED: testFindByUser

         [testng] SKIPPED: testGetInstitutionEmailsById

         [testng] SKIPPED: testQuebecoisFlag

         [testng] SKIPPED: testNoticeAssociee

         [testng] SKIPPED: testFindTypeDocument

         [testng] SKIPPED: testNoticePrincipalePresent

         [testng] SKIPPED: testFindNoticeReservoirs

         [testng] SKIPPED: testDownloadAutorite

         [testng] SKIPPED: testHandleGetAuthorityResult

         [testng] SKIPPED: testIsLivreNotInFrench

         [testng] SKIPPED: testPrincipalePartielle

         [testng] SKIPPED: testPersistPanier

         [testng] SKIPPED: testFindPanierWithNoticeNumeroCatalogue

         [testng] SKIPPED: testFindNoticePanierForUserInTypePanier

         [testng] SKIPPED: testFindNoticePanier

         [testng] SKIPPED: testGetNoticePanierBiblioCourantCount

         [testng] SKIPPED: testPersistNoticePanier

         [testng] SKIPPED: testFindNoticePanierBiblioCourantByNoCatalog

         [testng] SKIPPED: testFindPanierUsager

         [testng] SKIPPED: testFindNumeroNomalisesOfNoticePanier

         [testng] SKIPPED: testFindNoticeTelechargeesWithNoticeNumeroCatalogue

         [testng] SKIPPED: testFindPanierBiblioCourant

         [testng] SKIPPED: testFindNoticePanierAutoriteCourantNoFilter

         [testng] SKIPPED: testVedetteMatiereContainQueryExact

         [testng] SKIPPED: testVedetteMatiereContainQueryKeyword

         [testng] SKIPPED: testVedetteMatiereStartWithQueryKeyword

         [testng] SKIPPED: testFindNoticePanierBiblioCourantDateFilter

         [testng] SKIPPED: testFindNoticePanierBiblioCourantNoFilter

         [testng] SKIPPED: testFindNoticePanierBiblioCourantWithFilter

         [testng] SKIPPED: testIsPreferenceValueHasChangedMultiple

         [testng] SKIPPED: testCQLFacet

         [testng] SKIPPED: testFindFacetIndex

         [testng] SKIPPED: testFindTermObj

         [testng] SKIPPED: testRemoveSelectedFacet

         [testng] SKIPPED: testAddSelectedFacet

         [testng] SKIPPED: testPaginationDefaultSetting

         [testng] SKIPPED: testPagination1Page

         [testng] SKIPPED: testPagination2Page

         [testng] SKIPPED: testToCQLBox234

         [testng] SKIPPED: testClearLimits

         [testng] SKIPPED: testSort

         [testng] SKIPPED: testToCQLBox24

         [testng] SKIPPED: testToCQLDatePublication

         [testng] SKIPPED: testToCQLDateModification

         [testng] SKIPPED: testToCQLBox

         [testng] SKIPPED: testToCQLExternalSearch

         [testng] SKIPPED: testClearAll

         [testng] SKIPPED: testToCQLLimiteLangueAlone

         [testng] SKIPPED: testToCQLBox4

         [testng] SKIPPED: testToCQLBox2

         [testng] SKIPPED: testToCQLBox3

         [testng] SKIPPED: testToCQLBoxLangue

         [testng] SKIPPED: testToCQLLimiteSource

         [testng] SKIPPED: testNoAutre

         [testng] SKIPPED: testTrimNoNorm

         [testng] SKIPPED: testCreationNoNormalise

         [testng] SKIPPED: testDoublonsWrongFormatWithMaxReached

         [testng] SKIPPED: testDoublonsWithMax

         [testng] SKIPPED: testDoublonsNoMax

         [testng] SKIPPED: testAffichageEtatSelonRole

         [testng] SKIPPED: testGetAuthorityResultUnmarshall

         [testng] ===============================================

         [testng]     GUappsTestsLivraison_2

         [testng]     Tests run: 114, Failures: 0, Skips: 114

         [testng]     Configuration Failures: 0, Skips: 623

         [testng] ===============================================

         [testng] SKIPPED CONFIGURATION: @BeforeClass setDatabase

         [testng] SKIPPED CONFIGURATION: @BeforeClass setDatasourceJndiName

         [testng] SKIPPED CONFIGURATION: @BeforeClass init

         [testng] SKIPPED CONFIGURATION: @BeforeClass setBinaryDir

         [testng] SKIPPED CONFIGURATION: @BeforeClass setupClass

         [testng] SKIPPED CONFIGURATION: @BeforeMethod begin

         [testng] SKIPPED CONFIGURATION: @BeforeMethod prepareDataBeforeTest

         [testng] SKIPPED CONFIGURATION: @AfterMethod cleanDataAfterTest

         [testng] SKIPPED CONFIGURATION: @AfterMethod end

         [testng] SKIPPED CONFIGURATION: @AfterClass destroy

         [testng] SKIPPED CONFIGURATION: @AfterClass cleanupClass

         [testng] SKIPPED CONFIGURATION: @BeforeClass setDatabase

         [testng] SKIPPED CONFIGURATION: @BeforeClass setupClass

         [testng] SKIPPED CONFIGURATION: @BeforeClass setDatasourceJndiName

         [testng] SKIPPED CONFIGURATION: @BeforeClass init

         [testng] SKIPPED CONFIGURATION: @BeforeClass setBinaryDir

         [testng] SKIPPED CONFIGURATION: @BeforeMethod begin

         [testng] SKIPPED CONFIGURATION: @BeforeMethod prepareDataBeforeTest

         [testng] SKIPPED CONFIGURATION: @AfterMethod cleanDataAfterTest

         [testng] SKIPPED CONFIGURATION: @AfterMethod end

         [testng] SKIPPED CONFIGURATION: @BeforeMethod begin

         [testng] SKIPPED CONFIGURATION: @BeforeMethod prepareDataBeforeTest

         [testng] SKIPPED CONFIGURATION: @AfterMethod cleanDataAfterTest

         [testng] SKIPPED CONFIGURATION: @AfterMethod end

         [testng] SKIPPED CONFIGURATION: @BeforeMethod begin

         [testng] SKIPPED CONFIGURATION: @BeforeMethod prepareDataBeforeTest

         [testng] SKIPPED CONFIGURATION: @AfterMethod cleanDataAfterTest

         [testng] SKIPPED CONFIGURATION: @AfterMethod end

         [testng] SKIPPED CONFIGURATION: @BeforeMethod begin

         [testng] SKIPPED CONFIGURATION: @BeforeMethod prepareDataBeforeTest

         [testng] SKIPPED CONFIGURATION: @AfterMethod cleanDataAfterTest

         [testng] SKIPPED CONFIGURATION: @AfterMethod end

         [testng] SKIPPED CONFIGURATION: @BeforeMethod begin

         [testng] SKIPPED CONFIGURATION: @BeforeMethod prepareDataBeforeTest

         [testng] SKIPPED CONFIGURATION: @AfterMethod cleanDataAfterTest

         [testng] SKIPPED CONFIGURATION: @AfterMethod end

         [testng] SKIPPED CONFIGURATION: @BeforeMethod begin

         [testng] SKIPPED CONFIGURATION: @BeforeMethod prepareDataBeforeTest

         [testng] SKIPPED CONFIGURATION: @AfterMethod cleanDataAfterTest

         [testng] SKIPPED CONFIGURATION: @AfterMethod end

         [testng] SKIPPED CONFIGURATION: @BeforeMethod begin

         [testng] SKIPPED CONFIGURATION: @BeforeMethod prepareDataBeforeTest

         [testng] SKIPPED CONFIGURATION: @AfterMethod cleanDataAfterTest

         [testng] SKIPPED CONFIGURATION: @AfterMethod end

         [testng] SKIPPED CONFIGURATION: @AfterClass destroy

         [testng] SKIPPED CONFIGURATION: @AfterClass cleanupClass

         [testng] SKIPPED CONFIGURATION: @BeforeClass setBinaryDir

         [testng] SKIPPED CONFIGURATION: @BeforeClass setDatabase

         [testng] SKIPPED CONFIGURATION: @BeforeClass setupClass

         [testng] SKIPPED CONFIGURATION: @BeforeClass setDatasourceJndiName

         [testng] SKIPPED CONFIGURATION: @BeforeMethod begin

         [testng] SKIPPED CONFIGURATION: @BeforeMethod prepareDataBeforeTest

         [testng] SKIPPED CONFIGURATION: @BeforeMethod init

         [testng] SKIPPED CONFIGURATION: @AfterMethod destroy

         [testng] SKIPPED CONFIGURATION: @AfterMethod cleanDataAfterTest

         [testng] SKIPPED CONFIGURATION: @AfterMethod end

         [testng] SKIPPED CONFIGURATION: @BeforeMethod begin

         [testng] SKIPPED CONFIGURATION: @BeforeMethod prepareDataBeforeTest

         [testng] SKIPPED CONFIGURATION: @BeforeMethod init

         [testng] SKIPPED CONFIGURATION: @AfterMethod destroy

         [testng] SKIPPED CONFIGURATION: @AfterMethod cleanDataAfterTest

         [testng] SKIPPED CONFIGURATION: @AfterMethod end

         [testng] SKIPPED CONFIGURATION: @BeforeMethod begin

         [testng] SKIPPED CONFIGURATION: @BeforeMethod prepareDataBeforeTest

         [testng] SKIPPED CONFIGURATION: @BeforeMethod init

         [testng] SKIPPED CONFIGURATION: @AfterMethod destroy

         [testng] SKIPPED CONFIGURATION: @AfterMethod cleanDataAfterTest

         [testng] SKIPPED CONFIGURATION: @AfterMethod end

         [testng] SKIPPED CONFIGURATION: @BeforeMethod begin

         [testng] SKIPPED CONFIGURATION: @BeforeMethod prepareDataBeforeTest

         [testng] SKIPPED CONFIGURATION: @BeforeMethod init

         [testng] SKIPPED CONFIGURATION: @AfterMethod destroy

         [testng] SKIPPED CONFIGURATION: @AfterMethod cleanDataAfterTest

         [testng] SKIPPED CONFIGURATION: @AfterMethod end

         [testng] SKIPPED CONFIGURATION: @AfterClass cleanupClass

         [testng] SKIPPED: testProcessSameUser

         [testng] SKIPPED: testDemandeTraitementFindByNoNormaliseEagerUser

         [testng] SKIPPED: testSaveMulitipleDemandeTraitementNoUser

         [testng] SKIPPED: testSaveDemandeTraitementWithNotice

         [testng] SKIPPED: testSaveDemandeTraitementNoUser

         [testng] SKIPPED: testSaveDemandeTraitementWithUsagerDemande

         [testng] SKIPPED: testFindNbDemandeByNoNormalise

         [testng] SKIPPED: testMergeDemandeTraitementNoticeAssociee

         [testng] SKIPPED: testRemovePanierNitoce

         [testng] SKIPPED: testAddToPanierNitoce

        [testng] SKIPPED: testAddToPanierBiblioEtAutoriteCourant

         [testng] SKIPPED: testDeterminePrimaryNoNorm

         [testng] ===============================================

         [testng]     GUappsTestsLivraison_2_probleme

         [testng]     Tests run: 12, Failures: 0, Skips: 12

         [testng]     Configuration Failures: 0, Skips: 75

         [testng] ===============================================

         [testng] SKIPPED CONFIGURATION: @BeforeTest init

         [testng] SKIPPED CONFIGURATION: @BeforeClass setupClass

         [testng] SKIPPED CONFIGURATION: @BeforeMethod begin

         [testng] SKIPPED CONFIGURATION: @AfterMethod end

         [testng] SKIPPED CONFIGURATION: @BeforeMethod begin

         [testng] SKIPPED CONFIGURATION: @AfterMethod end

         [testng] SKIPPED CONFIGURATION: @AfterClass cleanupClass

         [testng] SKIPPED CONFIGURATION: @BeforeClass setDatabase

         [testng] SKIPPED CONFIGURATION: @BeforeClass setDatasourceJndiName

         [testng] SKIPPED CONFIGURATION: @BeforeClass init

         [testng] SKIPPED CONFIGURATION: @BeforeClass setBinaryDir

         [testng] SKIPPED CONFIGURATION: @BeforeClass setupClass

         [testng] SKIPPED CONFIGURATION: @BeforeMethod begin

         [testng] SKIPPED CONFIGURATION: @BeforeMethod prepareDataBeforeTest

         [testng] SKIPPED CONFIGURATION: @AfterMethod cleanDataAfterTest

         [testng] SKIPPED CONFIGURATION: @AfterMethod end

         [testng] SKIPPED CONFIGURATION: @AfterClass cleanupClass

         [testng] SKIPPED CONFIGURATION: @BeforeClass setDatabase

         [testng] SKIPPED CONFIGURATION: @BeforeClass setupClass

         [testng] SKIPPED CONFIGURATION: @BeforeClass setDatasourceJndiName

         [testng] SKIPPED CONFIGURATION: @BeforeClass init

         [testng] SKIPPED CONFIGURATION: @BeforeClass setBinaryDir

         [testng] SKIPPED CONFIGURATION: @BeforeMethod begin

         [testng] SKIPPED CONFIGURATION: @BeforeMethod prepareDataBeforeTest

         [testng] SKIPPED CONFIGURATION: @AfterMethod cleanDataAfterTest

         [testng] SKIPPED CONFIGURATION: @AfterMethod end

         [testng] SKIPPED CONFIGURATION: @BeforeMethod begin

         [testng] SKIPPED CONFIGURATION: @BeforeMethod prepareDataBeforeTest

         [testng] SKIPPED CONFIGURATION: @AfterMethod cleanDataAfterTest

         [testng] SKIPPED CONFIGURATION: @AfterMethod end

         [testng] SKIPPED CONFIGURATION: @BeforeMethod begin

         [testng] SKIPPED CONFIGURATION: @BeforeMethod prepareDataBeforeTest

         [testng] SKIPPED CONFIGURATION: @AfterMethod cleanDataAfterTest

         [testng] SKIPPED CONFIGURATION: @AfterMethod end

         [testng] SKIPPED CONFIGURATION: @BeforeMethod begin

         [testng] SKIPPED CONFIGURATION: @BeforeMethod prepareDataBeforeTest

         [testng] SKIPPED CONFIGURATION: @AfterMethod cleanDataAfterTest

         [testng] SKIPPED CONFIGURATION: @AfterMethod end

         [testng] SKIPPED CONFIGURATION: @BeforeMethod begin

         [testng] SKIPPED CONFIGURATION: @BeforeMethod prepareDataBeforeTest

         [testng] SKIPPED CONFIGURATION: @AfterMethod cleanDataAfterTest

         [testng] SKIPPED CONFIGURATION: @AfterMethod end

         [testng] SKIPPED CONFIGURATION: @AfterClass destroy

         [testng] SKIPPED CONFIGURATION: @AfterClass cleanupClass

         [testng] SKIPPED CONFIGURATION: @AfterTest destroy

         [testng] SKIPPED: testIsDocumentElectronique

         [testng] SKIPPED: testIsRequireInsertToPanier

         [testng] SKIPPED: testTraiterTraitementDemande

         [testng] SKIPPED: testRetrieveAllowedTransition

         [testng] SKIPPED: testExistantAllowedTransition

         [testng] SKIPPED: testIsDemandeHasNoticePartielle

         [testng] SKIPPED: testIsHandledByCompanyOfUser

         [testng] SKIPPED: testIsAtLeastOneDemandeMadeByUser

         [testng] SKIPPED: testIsDemandeCanBeAnnulee

         [testng] SKIPPED: testAdditionNombreDemande

         [testng] SKIPPED: testEquals

         [testng] SKIPPED: testNoNormaliseHelperAutres

         [testng] SKIPPED: testNoNormaliseHelperISSN

         [testng] SKIPPED: testNoNormaliseHelperISBN

         [testng] SKIPPED: testGetSize

         [testng] SKIPPED: testTypePanierEnum

         [testng] SKIPPED: testParseXmlRejetDocument

         [testng] SKIPPED: testSRUToUrl

         [testng] SKIPPED: testSRUToUrlAutorite

         [testng] SKIPPED: testIsExternalSearchIndex

         [testng] SKIPPED: testInternalLimitRegression

         [testng] SKIPPED: testExternalRegression

         [testng] SKIPPED: testTermIndexForSearchRegression

         [testng] SKIPPED: testTermIndexRegression

         [testng] SKIPPED: testExternalLimitRegression

         [testng] SKIPPED: testFacetRegression

         [testng] SKIPPED: testLimitRegression

         [testng] SKIPPED: testTermIndexRegression

         [testng] SKIPPED: testFacetRegression

         [testng] SKIPPED: testLimitRegression

         [testng] SKIPPED: testResponseUnmarshall

         [testng] ===============================================

         [testng]     GUappsUnitTests

         [testng]     Tests run: 31, Failures: 0, Skips: 31

         [testng]     Configuration Failures: 0, Skips: 45

         [testng] ===============================================

         [testng] FAILED CONFIGURATION: @BeforeSuite startSeam

         [testng] java.lang.RuntimeException: Unable to bootstrap:

         [testng] at org.jboss.embedded.Bootstrap.bootstrapURL(Bootstrap.java:147)

         [testng] at org.jboss.embedded.Bootstrap.bootstrap(Bootstrap.java:183)

         [testng] at org.jboss.embedded.Bootstrap.bootstrap(Bootstrap.java:195)

         [testng] at org.jboss.seam.mock.EmbeddedBootstrap.startAndDeployResources(EmbeddedBootstrap.java:11)

         [testng] at org.jboss.seam.mock.AbstractSeamTest.startJbossEmbeddedIfNecessary(AbstractSeamTest.java:1024)

         [testng] at org.jboss.seam.mock.AbstractSeamTest.startSeam(AbstractSeamTest.java:915)

         [testng] at org.jboss.seam.mock.SeamTest.startSeam(SeamTest.java:58)

         [testng] Caused by: java.lang.IllegalStateException: ServerConfig is already installed.

         [testng] at org.jboss.dependency.plugins.AbstractController.install(AbstractController.java:525)

         [testng] at org.jboss.dependency.plugins.AbstractController.install(AbstractController.java:398)

         [testng] at org.jboss.kernel.plugins.dependency.AbstractKernelController.install(AbstractKernelController.java:96)

         [testng] at org.jboss.embedded.Bootstrap.bootstrapURL(Bootstrap.java:141)

         [testng] ... 21 more

         [testng] ... Removed 15 stack frames

         [testng] SKIPPED CONFIGURATION: @BeforeClass setupClass

         [testng] SKIPPED CONFIGURATION: @BeforeClass init

         [testng] SKIPPED CONFIGURATION: @BeforeMethod begin

         [testng] SKIPPED CONFIGURATION: @BeforeMethod beforeMethod

         [testng] SKIPPED CONFIGURATION: @AfterMethod end

         [testng] SKIPPED CONFIGURATION: @AfterClass destroy

         [testng] SKIPPED CONFIGURATION: @AfterClass cleanupClass

         [testng] SKIPPED: testSearchScreen

         [testng] ===============================================

         [testng]     GUappsUnitFacesTest

         [testng]     Tests run: 1, Failures: 0, Skips: 1

         [testng]     Configuration Failures: 1, Skips: 7

         [testng] ===============================================

         [testng] ===============================================

         [testng] GUapps Continuous Integration Tests Suite

         [testng] Total tests run: 158, Failures: 0, Skips: 158

         [testng] Configuration Failures: 1, Skips: 751

         [testng] ===============================================

         [testng] Picked up JAVA_TOOL_OPTIONS: -Dfile.encoding=UTF8

       

      BUILD FAILED

      C:\Work\....\build.xml:831: The tests failed.

       

      Total time: 5 seconds