5 Replies Latest reply on Feb 13, 2013 12:19 PM by Brian Stansberry

    Build error in AS 7.2.0.Final-prerelease

    Tomaz Zupan Newbie

      I'm trying to build JBoss AS 7.2.0.Final-prerelease but I get the following test errors in module jboss-as-core-model-test-tests:

       

      Tests in error:

        testDeploymentOverlaysTransformer[0](org.jboss.as.core.model.test.deploymentoverlay.DomainDeploymentOverlayTransformersTestCase): org.sonatype.aether.resolution.ArtifactResolu

      tionException: Could not find artifact org.jboss.as:jboss-as-core-model-test-framework:jar:7.2.0.Alpha1-SNAPSHOT in jboss-developer (http://repository.jboss.org/nexus/content/gr

      oups/developer/)

        testDeploymentOverlaysNotIgnoredOnOlderVersionFails[0](org.jboss.as.core.model.test.deploymentoverlay.DomainDeploymentOverlayTransformersTestCase): org.sonatype.aether.resolut

      ion.ArtifactResolutionException: Could not find artifact org.jboss.as:jboss-as-core-model-test-framework:jar:7.2.0.Alpha1-SNAPSHOT in jboss-developer (http://repository.jboss.or

      g/nexus/content/groups/developer/)

        testDeploymentOverlaysIgnoredOnOlderVersionGetIgnoredButFailDueToServerGroupEntry[0](org.jboss.as.core.model.test.deploymentoverlay.DomainDeploymentOverlayTransformersTestCase

      ): org.sonatype.aether.resolution.ArtifactResolutionException: Could not find artifact org.jboss.as:jboss-as-core-model-test-framework:jar:7.2.0.Alpha1-SNAPSHOT in jboss-develop

      er (http://repository.jboss.org/nexus/content/groups/developer/)

        testDeploymentOverlaysIgnoredOnOlderVersionGetIgnored[0](org.jboss.as.core.model.test.deploymentoverlay.DomainDeploymentOverlayTransformersTestCase): org.sonatype.aether.resol

      ution.ArtifactResolutionException: Could not find artifact org.jboss.as:jboss-as-core-model-test-framework:jar:7.2.0.Alpha1-SNAPSHOT in jboss-developer (http://repository.jboss.

      org/nexus/content/groups/developer/)

        testDeploymentOverlaysTransformer[1](org.jboss.as.core.model.test.deploymentoverlay.DomainDeploymentOverlayTransformersTestCase): org.sonatype.aether.resolution.ArtifactResolu

      tionException: Could not find artifact org.jboss.as:jboss-as-core-model-test-framework:jar:7.2.0.Alpha1-SNAPSHOT in jboss-developer (http://repository.jboss.org/nexus/content/gr

      oups/developer/)

        testDeploymentOverlaysNotIgnoredOnOlderVersionFails[1](org.jboss.as.core.model.test.deploymentoverlay.DomainDeploymentOverlayTransformersTestCase): org.sonatype.aether.resolut

      ion.ArtifactResolutionException: Could not find artifact org.jboss.as:jboss-as-core-model-test-framework:jar:7.2.0.Alpha1-SNAPSHOT in jboss-developer (http://repository.jboss.or

      g/nexus/content/groups/developer/)

        testDeploymentOverlaysIgnoredOnOlderVersionGetIgnoredButFailDueToServerGroupEntry[1](org.jboss.as.core.model.test.deploymentoverlay.DomainDeploymentOverlayTransformersTestCase

      ): org.sonatype.aether.resolution.ArtifactResolutionException: Could not find artifact org.jboss.as:jboss-as-core-model-test-framework:jar:7.2.0.Alpha1-SNAPSHOT in jboss-develop

      er (http://repository.jboss.org/nexus/content/groups/developer/)

        testDeploymentOverlaysIgnoredOnOlderVersionGetIgnored[1](org.jboss.as.core.model.test.deploymentoverlay.DomainDeploymentOverlayTransformersTestCase): org.sonatype.aether.resol

      ution.ArtifactResolutionException: Could not find artifact org.jboss.as:jboss-as-core-model-test-framework:jar:7.2.0.Alpha1-SNAPSHOT in jboss-developer (http://repository.jboss.

      org/nexus/content/groups/developer/)

        testDeploymentOverlaysTransformer[2](org.jboss.as.core.model.test.deploymentoverlay.DomainDeploymentOverlayTransformersTestCase): org.sonatype.aether.resolution.ArtifactResolu

      tionException: Could not find artifact org.jboss.as:jboss-as-core-model-test-framework:jar:7.2.0.Alpha1-SNAPSHOT in jboss-developer (http://repository.jboss.org/nexus/content/gr

      oups/developer/)

        testInterfacesTransformer[0](org.jboss.as.core.model.test.interfaces.InterfacesTransformersTestCase): org.sonatype.aether.resolution.ArtifactResolutionException: Could not fin

      d artifact org.jboss.as:jboss-as-core-model-test-framework:jar:7.2.0.Alpha1-SNAPSHOT in jboss-developer (http://repository.jboss.org/nexus/content/groups/developer/)

        testInterfacesTransformer[1](org.jboss.as.core.model.test.interfaces.InterfacesTransformersTestCase): org.sonatype.aether.resolution.ArtifactResolutionException: Could not fin

      d artifact org.jboss.as:jboss-as-core-model-test-framework:jar:7.2.0.Alpha1-SNAPSHOT in jboss-developer (http://repository.jboss.org/nexus/content/groups/developer/)

        testInterfacesTransformer[2](org.jboss.as.core.model.test.interfaces.InterfacesTransformersTestCase): org.sonatype.aether.resolution.ArtifactResolutionException: Could not fin

      d artifact org.jboss.as:jboss-as-core-model-test-framework:jar:7.2.0.Alpha1-SNAPSHOT in jboss-developer (http://repository.jboss.org/nexus/content/groups/developer/)

        jvmResourceWithExpressions[0](org.jboss.as.core.model.test.jvm.JvmTransformersTestCase): org.sonatype.aether.resolution.ArtifactResolutionException: Could not find artifact or

      g.jboss.as:jboss-as-core-model-test-framework:jar:7.2.0.Alpha1-SNAPSHOT in jboss-developer (http://repository.jboss.org/nexus/content/groups/developer/)

        jvmResourceWithoutExpressions[0](org.jboss.as.core.model.test.jvm.JvmTransformersTestCase): org.sonatype.aether.resolution.ArtifactResolutionException: Could not find artifact

      org.jboss.as:jboss-as-core-model-test-framework:jar:7.2.0.Alpha1-SNAPSHOT in jboss-developer (http://repository.jboss.org/nexus/content/groups/developer/)

        jvmResourceWithExpressions[1](org.jboss.as.core.model.test.jvm.JvmTransformersTestCase): org.sonatype.aether.resolution.ArtifactResolutionException: Could not find artifact or

      g.jboss.as:jboss-as-core-model-test-framework:jar:7.2.0.Alpha1-SNAPSHOT in jboss-developer (http://repository.jboss.org/nexus/content/groups/developer/)

        jvmResourceWithoutExpressions[1](org.jboss.as.core.model.test.jvm.JvmTransformersTestCase): org.sonatype.aether.resolution.ArtifactResolutionException: Could not find artifact

      org.jboss.as:jboss-as-core-model-test-framework:jar:7.2.0.Alpha1-SNAPSHOT in jboss-developer (http://repository.jboss.org/nexus/content/groups/developer/)

        jvmResourceWithExpressions[2](org.jboss.as.core.model.test.jvm.JvmTransformersTestCase): org.sonatype.aether.resolution.ArtifactResolutionException: Could not find artifact or

      g.jboss.as:jboss-as-core-model-test-framework:jar:7.2.0.Alpha1-SNAPSHOT in jboss-developer (http://repository.jboss.org/nexus/content/groups/developer/)

        jvmResourceWithoutExpressions[2](org.jboss.as.core.model.test.jvm.JvmTransformersTestCase): org.sonatype.aether.resolution.ArtifactResolutionException: Could not find artifact

      org.jboss.as:jboss-as-core-model-test-framework:jar:7.2.0.Alpha1-SNAPSHOT in jboss-developer (http://repository.jboss.org/nexus/content/groups/developer/)

        testPathsTransformer[0](org.jboss.as.core.model.test.paths.PathsTransformersTestCase): org.sonatype.aether.resolution.ArtifactResolutionException: Could not find artifact org.

      jboss.as:jboss-as-core-model-test-framework:jar:7.2.0.Alpha1-SNAPSHOT in jboss-developer (http://repository.jboss.org/nexus/content/groups/developer/)

        testRejectTransformers71x[0](org.jboss.as.core.model.test.paths.PathsTransformersTestCase): org.sonatype.aether.resolution.ArtifactResolutionException: Could not find artifact

      org.jboss.as:jboss-as-core-model-test-framework:jar:7.2.0.Alpha1-SNAPSHOT in jboss-developer (http://repository.jboss.org/nexus/content/groups/developer/)

        testPathsTransformer[1](org.jboss.as.core.model.test.paths.PathsTransformersTestCase): org.sonatype.aether.resolution.ArtifactResolutionException: Could not find artifact org.

      jboss.as:jboss-as-core-model-test-framework:jar:7.2.0.Alpha1-SNAPSHOT in jboss-developer (http://repository.jboss.org/nexus/content/groups/developer/)

        testRejectTransformers71x[1](org.jboss.as.core.model.test.paths.PathsTransformersTestCase): org.sonatype.aether.resolution.ArtifactResolutionException: Could not find artifact

      org.jboss.as:jboss-as-core-model-test-framework:jar:7.2.0.Alpha1-SNAPSHOT in jboss-developer (http://repository.jboss.org/nexus/content/groups/developer/)

        testPathsTransformer[2](org.jboss.as.core.model.test.paths.PathsTransformersTestCase): org.sonatype.aether.resolution.ArtifactResolutionException: Could not find artifact org.

      jboss.as:jboss-as-core-model-test-framework:jar:7.2.0.Alpha1-SNAPSHOT in jboss-developer (http://repository.jboss.org/nexus/content/groups/developer/)

        testProfilesTransformer[0](org.jboss.as.core.model.test.profile.ProfileTransformersTestCase): org.sonatype.aether.resolution.ArtifactResolutionException: Could not find artifa

      ct org.jboss.as:jboss-as-core-model-test-framework:jar:7.2.0.Alpha1-SNAPSHOT in jboss-developer (http://repository.jboss.org/nexus/content/groups/developer/)

        testProfilesTransformer[1](org.jboss.as.core.model.test.profile.ProfileTransformersTestCase): org.sonatype.aether.resolution.ArtifactResolutionException: Could not find artifa

      ct org.jboss.as:jboss-as-core-model-test-framework:jar:7.2.0.Alpha1-SNAPSHOT in jboss-developer (http://repository.jboss.org/nexus/content/groups/developer/)

        testProfilesTransformer[2](org.jboss.as.core.model.test.profile.ProfileTransformersTestCase): org.sonatype.aether.resolution.ArtifactResolutionException: Could not find artifa

      ct org.jboss.as:jboss-as-core-model-test-framework:jar:7.2.0.Alpha1-SNAPSHOT in jboss-developer (http://repository.jboss.org/nexus/content/groups/developer/)

        testServerGroupsTransformer[0](org.jboss.as.core.model.test.servergroup.DomainServerGroupTransformersTestCase): org.sonatype.aether.resolution.ArtifactResolutionException: Cou

      ld not find artifact org.jboss.as:jboss-as-core-model-test-framework:jar:7.2.0.Alpha1-SNAPSHOT in jboss-developer (http://repository.jboss.org/nexus/content/groups/developer/)

        testRejectTransformers71x[0](org.jboss.as.core.model.test.servergroup.DomainServerGroupTransformersTestCase): org.sonatype.aether.resolution.ArtifactResolutionException: Could

      not find artifact org.jboss.as:jboss-as-core-model-test-framework:jar:7.2.0.Alpha1-SNAPSHOT in jboss-developer (http://repository.jboss.org/nexus/content/groups/developer/)

        testServerGroupsTransformer[1](org.jboss.as.core.model.test.servergroup.DomainServerGroupTransformersTestCase): org.sonatype.aether.resolution.ArtifactResolutionException: Cou

      ld not find artifact org.jboss.as:jboss-as-core-model-test-framework:jar:7.2.0.Alpha1-SNAPSHOT in jboss-developer (http://repository.jboss.org/nexus/content/groups/developer/)

        testRejectTransformers71x[1](org.jboss.as.core.model.test.servergroup.DomainServerGroupTransformersTestCase): org.sonatype.aether.resolution.ArtifactResolutionException: Could

      not find artifact org.jboss.as:jboss-as-core-model-test-framework:jar:7.2.0.Alpha1-SNAPSHOT in jboss-developer (http://repository.jboss.org/nexus/content/groups/developer/)

        testServerGroupsTransformer[2](org.jboss.as.core.model.test.servergroup.DomainServerGroupTransformersTestCase): org.sonatype.aether.resolution.ArtifactResolutionException: Cou

      ld not find artifact org.jboss.as:jboss-as-core-model-test-framework:jar:7.2.0.Alpha1-SNAPSHOT in jboss-developer (http://repository.jboss.org/nexus/content/groups/developer/)

        testSocketBindingGroupsTransformer[0](org.jboss.as.core.model.test.socketbindinggroups.SocketBindingGroupTransformersTestCase): org.sonatype.aether.resolution.ArtifactResoluti

      onException: Could not find artifact org.jboss.as:jboss-as-core-model-test-framework:jar:7.2.0.Alpha1-SNAPSHOT in jboss-developer (http://repository.jboss.org/nexus/content/grou

      ps/developer/)

        testSocketBindingGroupsTransformer[1](org.jboss.as.core.model.test.socketbindinggroups.SocketBindingGroupTransformersTestCase): org.sonatype.aether.resolution.ArtifactResoluti

      onException: Could not find artifact org.jboss.as:jboss-as-core-model-test-framework:jar:7.2.0.Alpha1-SNAPSHOT in jboss-developer (http://repository.jboss.org/nexus/content/grou

      ps/developer/)

        testSocketBindingGroupsTransformer[2](org.jboss.as.core.model.test.socketbindinggroups.SocketBindingGroupTransformersTestCase): org.sonatype.aether.resolution.ArtifactResoluti

      onException: Could not find artifact org.jboss.as:jboss-as-core-model-test-framework:jar:7.2.0.Alpha1-SNAPSHOT in jboss-developer (http://repository.jboss.org/nexus/content/grou

      ps/developer/)

        testClientMappingTransformer[0](org.jboss.as.core.model.test.socketbindinggroups.SocketBindingTransformersTestCase): org.sonatype.aether.resolution.ArtifactResolutionException

      : Could not find artifact org.jboss.as:jboss-as-core-model-test-framework:jar:7.2.0.Alpha1-SNAPSHOT in jboss-developer (http://repository.jboss.org/nexus/content/groups/develope

      r/)

        testClientMappingTransformer[1](org.jboss.as.core.model.test.socketbindinggroups.SocketBindingTransformersTestCase): org.sonatype.aether.resolution.ArtifactResolutionException

      : Could not find artifact org.jboss.as:jboss-as-core-model-test-framework:jar:7.2.0.Alpha1-SNAPSHOT in jboss-developer (http://repository.jboss.org/nexus/content/groups/develope

      r/)

        testSystemPropertyTransformer[0](org.jboss.as.core.model.test.systemproperty.DomainServerGroupSystemPropertyTransformersTestCase): org.sonatype.aether.resolution.ArtifactResol

      utionException: Could not find artifact org.jboss.as:jboss-as-core-model-test-framework:jar:7.2.0.Alpha1-SNAPSHOT in jboss-developer (http://repository.jboss.org/nexus/content/g

      roups/developer/)

        testSystemPropertiesWithExpressions[0](org.jboss.as.core.model.test.systemproperty.DomainServerGroupSystemPropertyTransformersTestCase): org.sonatype.aether.resolution.Artifac

      tResolutionException: Could not find artifact org.jboss.as:jboss-as-core-model-test-framework:jar:7.2.0.Alpha1-SNAPSHOT in jboss-developer (http://repository.jboss.org/nexus/con

      tent/groups/developer/)

        testSystemPropertyTransformer[1](org.jboss.as.core.model.test.systemproperty.DomainServerGroupSystemPropertyTransformersTestCase): org.sonatype.aether.resolution.ArtifactResol

      utionException: Could not find artifact org.jboss.as:jboss-as-core-model-test-framework:jar:7.2.0.Alpha1-SNAPSHOT in jboss-developer (http://repository.jboss.org/nexus/content/g

      roups/developer/)

        testSystemPropertiesWithExpressions[1](org.jboss.as.core.model.test.systemproperty.DomainServerGroupSystemPropertyTransformersTestCase): org.sonatype.aether.resolution.Artifac

      tResolutionException: Could not find artifact org.jboss.as:jboss-as-core-model-test-framework:jar:7.2.0.Alpha1-SNAPSHOT in jboss-developer (http://repository.jboss.org/nexus/con

      tent/groups/developer/)

        testSystemPropertyTransformer[2](org.jboss.as.core.model.test.systemproperty.DomainServerGroupSystemPropertyTransformersTestCase): org.sonatype.aether.resolution.ArtifactResol

      utionException: Could not find artifact org.jboss.as:jboss-as-core-model-test-framework:jar:7.2.0.Alpha1-SNAPSHOT in jboss-developer (http://repository.jboss.org/nexus/content/g

      roups/developer/)

        testSystemPropertiesWithExpressions[2](org.jboss.as.core.model.test.systemproperty.DomainServerGroupSystemPropertyTransformersTestCase): org.sonatype.aether.resolution.Artifac

      tResolutionException: Could not find artifact org.jboss.as:jboss-as-core-model-test-framework:jar:7.2.0.Alpha1-SNAPSHOT in jboss-developer (http://repository.jboss.org/nexus/con

      tent/groups/developer/)

        testSystemPropertyTransformer[0](org.jboss.as.core.model.test.systemproperty.DomainSystemPropertyTransformersTestCase): org.sonatype.aether.resolution.ArtifactResolutionExcept

      ion: Could not find artifact org.jboss.as:jboss-as-core-model-test-framework:jar:7.2.0.Alpha1-SNAPSHOT in jboss-developer (http://repository.jboss.org/nexus/content/groups/devel

      oper/)

        testSystemPropertiesWithExpressions[0](org.jboss.as.core.model.test.systemproperty.DomainSystemPropertyTransformersTestCase): org.sonatype.aether.resolution.ArtifactResolution

      Exception: Could not find artifact org.jboss.as:jboss-as-core-model-test-framework:jar:7.2.0.Alpha1-SNAPSHOT in jboss-developer (http://repository.jboss.org/nexus/content/groups

      /developer/)

        testSystemPropertyTransformer[1](org.jboss.as.core.model.test.systemproperty.DomainSystemPropertyTransformersTestCase): org.sonatype.aether.resolution.ArtifactResolutionExcept

      ion: Could not find artifact org.jboss.as:jboss-as-core-model-test-framework:jar:7.2.0.Alpha1-SNAPSHOT in jboss-developer (http://repository.jboss.org/nexus/content/groups/devel

      oper/)

        testSystemPropertiesWithExpressions[1](org.jboss.as.core.model.test.systemproperty.DomainSystemPropertyTransformersTestCase): org.sonatype.aether.resolution.ArtifactResolution

      Exception: Could not find artifact org.jboss.as:jboss-as-core-model-test-framework:jar:7.2.0.Alpha1-SNAPSHOT in jboss-developer (http://repository.jboss.org/nexus/content/groups

      /developer/)

        testSystemPropertyTransformer[2](org.jboss.as.core.model.test.systemproperty.DomainSystemPropertyTransformersTestCase): org.sonatype.aether.resolution.ArtifactResolutionExcept

      ion: Could not find artifact org.jboss.as:jboss-as-core-model-test-framework:jar:7.2.0.Alpha1-SNAPSHOT in jboss-developer (http://repository.jboss.org/nexus/content/groups/devel

      oper/)

        testSystemPropertiesWithExpressions[2](org.jboss.as.core.model.test.systemproperty.DomainSystemPropertyTransformersTestCase): org.sonatype.aether.resolution.ArtifactResolution

      Exception: Could not find artifact org.jboss.as:jboss-as-core-model-test-framework:jar:7.2.0.Alpha1-SNAPSHOT in jboss-developer (http://repository.jboss.org/nexus/content/groups

      /developer/)

       

       

      Tests run: 223, Failures: 0, Errors: 48, Skipped: 0

       

       

      I'm using Maven 3.0.4 and Sun Java 1.6.39. The source code was gotten from Git.Hub, tag 7.2.9.Final-prerelease1.

       

      BR

      Tomaz