8 Replies Latest reply on Mar 26, 2014 5:41 PM by Ja kub

    build with test broken, access to download.lab.bos.redhat.com required?

    Frank Langelage Master

      Build of current master from github with smoke or all tests fails with

      -------------------------------------------------------                                                                       

      T E S T S                                                                                                                    
      -------------------------------------------------------                                                                       
      Running org.jboss.as.ee.subsystem.EeSubsystemTestCase                                                                         
      Tests run: 18, Failures: 0, Errors: 3, Skipped: 7, Time elapsed: 18.531 sec <<< FAILURE!                                      
      Running org.jboss.as.ee.beanvalidation.LazyValidatorFactoryTestCase                                                           
      Tests run: 2, Failures: 0, Errors: 0, Skipped: 0, Time elapsed: 0.852 sec                                                     
      Running org.jboss.as.ee.beanvalidation.WildFlyProviderResolverTestCase                                                        
      Tests run: 2, Failures: 0, Errors: 0, Skipped: 0, Time elapsed: 0.019 sec                                                     
                                                                                                                                    
      Results :                                                                                                                     
      Tests in error:                                                                                                               

        testTransformersDiscardGlobalModulesEAP601(org.jboss.as.ee.subsystem.EeSubsystemTestCase): org.eclipse.aether.resolution.ArtifactR

      esolutionException: Could not transfer artifact org.jboss.as:jboss-as-ee:jar:7.1.3.Final-redhat-4 from/to jboss-product-repository (

      http://download.lab.bos.redhat.com/brewroot/repos/jb-eap-6-rhel-6-build/latest/maven/): download.lab.bos.redhat.com           

        testTransformersDiscardGlobalModulesEAP610(org.jboss.as.ee.subsystem.EeSubsystemTestCase): org.eclipse.aether.resolution.ArtifactR

      esolutionException: Could not transfer artifact org.jboss.as:jboss-as-ee:jar:7.2.0.Final-redhat-8 from/to jboss-product-repository (

      http://download.lab.bos.redhat.com/brewroot/repos/jb-eap-6-rhel-6-build/latest/maven/): download.lab.bos.redhat.com           

        testTransformersDiscardGlobalModulesEAP611(org.jboss.as.ee.subsystem.EeSubsystemTestCase): org.eclipse.aether.resolution.ArtifactR

      esolutionException: Could not transfer artifact org.jboss.as:jboss-as-ee:jar:7.2.1.Final-redhat-10 from/to jboss-product-repository

      (http://download.lab.bos.redhat.com/brewroot/repos/jb-eap-6-rhel-6-build/latest/maven/): download.lab.bos.redhat.com          
                                                                                                                                    
      Tests run: 22, Failures: 0, Errors: 3, Skipped: 7                                                                              

       

       

      Is this just because of work in progress or intended or unknown problem?