1 Reply Latest reply on Jan 17, 2014 12:13 AM by Reza Azizi

    Problem to compile source code of JBPM Console NG  in  netbeans 7.3

    sahar mohebi Newbie

      Hi,

      I try to compile source code of JBPM Console NG by maven in  netbeans 7.3  .all dependency downloaded on clean and build project but there is an error:

       

      Scanning for projects...

      ------------------------------------------------------------------------

      Reactor Build Order:

       

      jBPM Console NG

      jBPM Console NG - Module Archetype

      jBPM Console NG - Human Tasks Panels

      jBPM Console NG - Human Tasks API

      jBPM Console NG - Process Runtime Panels

      jBPM Console NG - Process Runtime API

      jBPM Console NG - Business Domain Panels

      jBPM Console NG - Business Domain API

      jBPM Console NG - Human Tasks Client

      jBPM Console NG - Human Tasks Backend

      jBPM Console NG - Process Runtime Client

      jBPM Console NG - Process Runtime Backend

      jBPM Console NG - Business Domain Client

      jBPM Console NG - Business Domain Backend

      jBPM Console NG - Executor Service Panels

      jBPM Console NG - Executor Service API

      jBPM Console NG - Executor Service Client

      jBPM Console NG - Executor Service Backend

      jBPM Console NG - Dashboard

      jBPM Console NG - Dashboard API

      jBPM Console NG - BPM Home Panels

      jBPM Console NG - BPM Home Client

      jBPM Console NG - Dashboard Backend

      jBPM Console NG - Dashboard Client

      jBPM Console NG - Showcase

                                                                             

      ------------------------------------------------------------------------

      Building jBPM Console NG 6.1.0-SNAPSHOT

      ------------------------------------------------------------------------

       

      [clean:clean]

      Deleting /home/mohebbi/projects/jbpm-console-ng-master/target

      Deleting /home/mohebbi/projects/jbpm-console-ng-master (includes = [.errai/**, .niogit/**], excludes = [])

       

      [enforcer:enforce]

       

      [enforcer:enforce]

       

      [enforcer:enforce]

       

      [build-helper:parse-version]

       

      [buildnumber:create-timestamp]

       

      [buildnumber:create]

      Checking for local modifications: skipped.

      Updating project files from SCM: skipped.

      Executing: /bin/sh -c cd /home/mohebbi/projects/jbpm-console-ng-master && git rev-parse --verify HEAD

      Working directory: /home/mohebbi/projects/jbpm-console-ng-master

      Storing buildNumber: UNKNOWN at timestamp: 1388307063274

      Executing: /bin/sh -c cd /home/mohebbi/projects/jbpm-console-ng-master && git rev-parse --verify HEAD

      Working directory: /home/mohebbi/projects/jbpm-console-ng-master

      Storing buildScmBranch: UNKNOWN_BRANCH

       

      [resources:copy-resources]

      Using 'UTF-8' encoding to copy filtered resources.

      skip non existing resourceDirectory /home/mohebbi/projects/jbpm-console-ng-master/target/generated-sources/annotations

       

      [jar:test-jar]

      JAR will be empty - no content was marked for inclusion!

      Building jar: /home/mohebbi/projects/jbpm-console-ng-master/target/jbpm-console-ng-6.1.0-SNAPSHOT-tests.jar

       

      >>> maven-source-plugin:2.1.2:jar (jar) @ jbpm-console-ng >>>

       

      [enforcer:enforce]

       

      [enforcer:enforce]

       

      [enforcer:enforce]

       

      [build-helper:parse-version]

       

      [buildnumber:create-timestamp]

       

      [buildnumber:create]

       

      <<< maven-source-plugin:2.1.2:jar (jar) @ jbpm-console-ng <<<

       

      [source:jar]

       

      >>> maven-source-plugin:2.1.2:test-jar (test-jar) @ jbpm-console-ng >>>

       

      [enforcer:enforce]

       

      [enforcer:enforce]

       

      [enforcer:enforce]

       

      [build-helper:parse-version]

       

      [buildnumber:create-timestamp]

       

      [buildnumber:create]

       

      <<< maven-source-plugin:2.1.2:test-jar (test-jar) @ jbpm-console-ng <<<

       

      [source:test-jar]

       

      [source:jar-no-fork]

       

      [failsafe:integration-test]

      No tests to run.

       

      [install:install]

      Installing /home/mohebbi/projects/jbpm-console-ng-master/pom.xml to /home/mohebbi/.m2/repository/org/jbpm/jbpm-console-ng/6.1.0-SNAPSHOT/jbpm-console-ng-6.1.0-SNAPSHOT.pom

      Installing /home/mohebbi/projects/jbpm-console-ng-master/target/jbpm-console-ng-6.1.0-SNAPSHOT-tests.jar to /home/mohebbi/.m2/repository/org/jbpm/jbpm-console-ng/6.1.0-SNAPSHOT/jbpm-console-ng-6.1.0-SNAPSHOT-tests.jar

                                                                             

      ------------------------------------------------------------------------

      Building jBPM Console NG - Module Archetype 6.1.0-SNAPSHOT

      ------------------------------------------------------------------------

       

      [clean:clean]

      Deleting /home/mohebbi/projects/jbpm-console-ng-master/jbpm-console-ng-module-archetype/target

      Deleting /home/mohebbi/projects/jbpm-console-ng-master/jbpm-console-ng-module-archetype (includes = [.errai/**, .niogit/**], excludes = [])

       

      [enforcer:enforce]

       

      [enforcer:enforce]

       

      [enforcer:enforce]

       

      [build-helper:parse-version]

       

      [buildnumber:create-timestamp]

       

      [buildnumber:create]

       

      [resources:resources]

      Using 'UTF-8' encoding to copy filtered resources.

      Copying 17 resources

       

      [resources:testResources]

      Using 'UTF-8' encoding to copy filtered resources.

      Copying 2 resources

       

      [resources:copy-resources]

      Using 'UTF-8' encoding to copy filtered resources.

      skip non existing resourceDirectory /home/mohebbi/projects/jbpm-console-ng-master/jbpm-console-ng-module-archetype/target/generated-sources/annotations

       

      [archetype:jar]

      Building archetype jar: /home/mohebbi/projects/jbpm-console-ng-master/jbpm-console-ng-module-archetype/target/jbpm-console-ng-module-archetype-6.1.0-SNAPSHOT

       

      [jar:test-jar]

      Building jar: /home/mohebbi/projects/jbpm-console-ng-master/jbpm-console-ng-module-archetype/target/jbpm-console-ng-module-archetype-6.1.0-SNAPSHOT-tests.jar

       

      >>> maven-source-plugin:2.1.2:jar (jar) @ jbpm-console-ng-module-archetype >>>

       

      [enforcer:enforce]

       

      [enforcer:enforce]

       

      [enforcer:enforce]

       

      [build-helper:parse-version]

       

      [buildnumber:create-timestamp]

       

      [buildnumber:create]

       

      <<< maven-source-plugin:2.1.2:jar (jar) @ jbpm-console-ng-module-archetype <<<

       

      [source:jar]

      Building jar: /home/mohebbi/projects/jbpm-console-ng-master/jbpm-console-ng-module-archetype/target/jbpm-console-ng-module-archetype-6.1.0-SNAPSHOT-sources.jar

       

      >>> maven-source-plugin:2.1.2:test-jar (test-jar) @ jbpm-console-ng-module-archetype >>>

       

      [enforcer:enforce]

       

      [enforcer:enforce]

       

      [enforcer:enforce]

       

      [build-helper:parse-version]

       

      [buildnumber:create-timestamp]

       

      [buildnumber:create]

       

      <<< maven-source-plugin:2.1.2:test-jar (test-jar) @ jbpm-console-ng-module-archetype <<<

       

      [source:test-jar]

      Building jar: /home/mohebbi/projects/jbpm-console-ng-master/jbpm-console-ng-module-archetype/target/jbpm-console-ng-module-archetype-6.1.0-SNAPSHOT-test-sources.jar

       

      [source:jar-no-fork]

      Artifact org.jbpm:jbpm-console-ng-module-archetype:java-source:sources:6.1.0-SNAPSHOT already attached to project, ignoring duplicate

       

      [archetype:integration-test]

      Processing Archetype IT project: basic

      ----------------------------------------------------------------------------

      Using following parameters for creating project from Archetype: jbpm-console-ng-module-archetype:6.1.0-SNAPSHOT

      ----------------------------------------------------------------------------

      Parameter: groupId, Value: archetype.it

      Parameter: artifactId, Value: basic

      Parameter: version, Value: 1.0.0

      Parameter: package, Value: it.pkg

      Parameter: packageInPathFormat, Value: it/pkg

      Parameter: version, Value: 1.0.0

      Parameter: package, Value: it.pkg

      Parameter: groupId, Value: archetype.it

      Parameter: artifactId, Value: basic

      Parent element not overwritten in /home/mohebbi/projects/jbpm-console-ng-master/jbpm-console-ng-module-archetype/target/test-classes/projects/basic/project/basic/basic-api/pom.xml

      Parent element not overwritten in /home/mohebbi/projects/jbpm-console-ng-master/jbpm-console-ng-module-archetype/target/test-classes/projects/basic/project/basic/basic-client/pom.xml

      Parent element not overwritten in /home/mohebbi/projects/jbpm-console-ng-master/jbpm-console-ng-module-archetype/target/test-classes/projects/basic/project/basic/basic-backend/pom.xml

      project created from Archetype in dir: /home/mohebbi/projects/jbpm-console-ng-master/jbpm-console-ng-module-archetype/target/test-classes/projects/basic/project/basic

      No post-archetype-generation goals to invoke.

       

      [failsafe:integration-test]

       

      [install:install]

      Installing /home/mohebbi/projects/jbpm-console-ng-master/jbpm-console-ng-module-archetype/target/jbpm-console-ng-module-archetype-6.1.0-SNAPSHOT.jar to /home/mohebbi/.m2/repository/org/jbpm/jbpm-console-ng-module-archetype/6.1.0-SNAPSHOT/jbpm-console-ng-module-archetype-6.1.0-SNAPSHOT.jar

      Installing /home/mohebbi/projects/jbpm-console-ng-master/jbpm-console-ng-module-archetype/pom.xml to /home/mohebbi/.m2/repository/org/jbpm/jbpm-console-ng-module-archetype/6.1.0-SNAPSHOT/jbpm-console-ng-module-archetype-6.1.0-SNAPSHOT.pom

      Installing /home/mohebbi/projects/jbpm-console-ng-master/jbpm-console-ng-module-archetype/target/jbpm-console-ng-module-archetype-6.1.0-SNAPSHOT-tests.jar to /home/mohebbi/.m2/repository/org/jbpm/jbpm-console-ng-module-archetype/6.1.0-SNAPSHOT/jbpm-console-ng-module-archetype-6.1.0-SNAPSHOT-tests.jar

      Installing /home/mohebbi/projects/jbpm-console-ng-master/jbpm-console-ng-module-archetype/target/jbpm-console-ng-module-archetype-6.1.0-SNAPSHOT-sources.jar to /home/mohebbi/.m2/repository/org/jbpm/jbpm-console-ng-module-archetype/6.1.0-SNAPSHOT/jbpm-console-ng-module-archetype-6.1.0-SNAPSHOT-sources.jar

      Installing /home/mohebbi/projects/jbpm-console-ng-master/jbpm-console-ng-module-archetype/target/jbpm-console-ng-module-archetype-6.1.0-SNAPSHOT-test-sources.jar to /home/mohebbi/.m2/repository/org/jbpm/jbpm-console-ng-module-archetype/6.1.0-SNAPSHOT/jbpm-console-ng-module-archetype-6.1.0-SNAPSHOT-test-sources.jar

       

      [archetype:update-local-catalog]

                                                                             

      ------------------------------------------------------------------------

      Building jBPM Console NG - Human Tasks Panels 6.1.0-SNAPSHOT

      ------------------------------------------------------------------------

       

      [clean:clean]

      Deleting /home/mohebbi/projects/jbpm-console-ng-master/jbpm-console-ng-human-tasks/target

      Deleting /home/mohebbi/projects/jbpm-console-ng-master/jbpm-console-ng-human-tasks (includes = [.errai/**, .niogit/**], excludes = [])

       

      [enforcer:enforce]

       

      [enforcer:enforce]

       

      [enforcer:enforce]

       

      [build-helper:parse-version]

       

      [buildnumber:create-timestamp]

       

      [buildnumber:create]

       

      [resources:copy-resources]

      Using 'UTF-8' encoding to copy filtered resources.

      skip non existing resourceDirectory /home/mohebbi/projects/jbpm-console-ng-master/jbpm-console-ng-human-tasks/target/generated-sources/annotations

       

      [jar:test-jar]

      JAR will be empty - no content was marked for inclusion!

      Building jar: /home/mohebbi/projects/jbpm-console-ng-master/jbpm-console-ng-human-tasks/target/jbpm-console-ng-human-tasks-6.1.0-SNAPSHOT-tests.jar

       

      >>> maven-source-plugin:2.1.2:jar (jar) @ jbpm-console-ng-human-tasks >>>

       

      [enforcer:enforce]

       

      [enforcer:enforce]

       

      [enforcer:enforce]

       

      [build-helper:parse-version]

       

      [buildnumber:create-timestamp]

       

      [buildnumber:create]

       

      <<< maven-source-plugin:2.1.2:jar (jar) @ jbpm-console-ng-human-tasks <<<

       

      [source:jar]

       

      >>> maven-source-plugin:2.1.2:test-jar (test-jar) @ jbpm-console-ng-human-tasks >>>

       

      [enforcer:enforce]

       

      [enforcer:enforce]

       

      [enforcer:enforce]

       

      [build-helper:parse-version]

       

      [buildnumber:create-timestamp]

       

      [buildnumber:create]

       

      <<< maven-source-plugin:2.1.2:test-jar (test-jar) @ jbpm-console-ng-human-tasks <<<

       

      [source:test-jar]

       

      [source:jar-no-fork]

       

      [failsafe:integration-test]

      No tests to run.

       

      [install:install]

      Installing /home/mohebbi/projects/jbpm-console-ng-master/jbpm-console-ng-human-tasks/pom.xml to /home/mohebbi/.m2/repository/org/jbpm/jbpm-console-ng-human-tasks/6.1.0-SNAPSHOT/jbpm-console-ng-human-tasks-6.1.0-SNAPSHOT.pom

      Installing /home/mohebbi/projects/jbpm-console-ng-master/jbpm-console-ng-human-tasks/target/jbpm-console-ng-human-tasks-6.1.0-SNAPSHOT-tests.jar to /home/mohebbi/.m2/repository/org/jbpm/jbpm-console-ng-human-tasks/6.1.0-SNAPSHOT/jbpm-console-ng-human-tasks-6.1.0-SNAPSHOT-tests.jar

                                                                             

      ------------------------------------------------------------------------

      Building jBPM Console NG - Human Tasks API 6.1.0-SNAPSHOT

      ------------------------------------------------------------------------

       

      [clean:clean]

      Deleting /home/mohebbi/projects/jbpm-console-ng-master/jbpm-console-ng-human-tasks/jbpm-console-ng-human-tasks-api/target

      Deleting /home/mohebbi/projects/jbpm-console-ng-master/jbpm-console-ng-human-tasks/jbpm-console-ng-human-tasks-api (includes = [.errai/**, .niogit/**], excludes = [])

       

      [enforcer:enforce]

       

      [enforcer:enforce]

       

      [enforcer:enforce]

       

      [build-helper:parse-version]

       

      [buildnumber:create-timestamp]

       

      [buildnumber:create]

       

      [resources:resources]

      Using 'UTF-8' encoding to copy filtered resources.

      Copying 28 resources

      Copying 2 resources

       

      [compiler:compile]

      Compiling 28 source files to /home/mohebbi/projects/jbpm-console-ng-master/jbpm-console-ng-human-tasks/jbpm-console-ng-human-tasks-api/target/classes

       

      [resources:testResources]

      Using 'UTF-8' encoding to copy filtered resources.

      skip non existing resourceDirectory /home/mohebbi/projects/jbpm-console-ng-master/jbpm-console-ng-human-tasks/jbpm-console-ng-human-tasks-api/src/test/resources

       

      [compiler:testCompile]

      No sources to compile

       

      [surefire:test]

      No tests to run.

       

      [resources:copy-resources]

      Using 'UTF-8' encoding to copy filtered resources.

      Copying 0 resource

       

      [jar:jar]

      Building jar: /home/mohebbi/projects/jbpm-console-ng-master/jbpm-console-ng-human-tasks/jbpm-console-ng-human-tasks-api/target/jbpm-console-ng-human-tasks-api-6.1.0-SNAPSHOT.jar

       

      [jar:test-jar]

      JAR will be empty - no content was marked for inclusion!

      Building jar: /home/mohebbi/projects/jbpm-console-ng-master/jbpm-console-ng-human-tasks/jbpm-console-ng-human-tasks-api/target/jbpm-console-ng-human-tasks-api-6.1.0-SNAPSHOT-tests.jar

       

      >>> maven-source-plugin:2.1.2:jar (jar) @ jbpm-console-ng-human-tasks-api >>>

       

      [enforcer:enforce]

       

      [enforcer:enforce]

       

      [enforcer:enforce]

       

      [build-helper:parse-version]

       

      [buildnumber:create-timestamp]

       

      [buildnumber:create]

       

      <<< maven-source-plugin:2.1.2:jar (jar) @ jbpm-console-ng-human-tasks-api <<<

       

      [source:jar]

      org already added, skipping

      org/jbpm already added, skipping

      org/jbpm/console already added, skipping

      org/jbpm/console/ng already added, skipping

      org/jbpm/console/ng/ht already added, skipping

      org/jbpm/console/ng/ht/service already added, skipping

      org/jbpm/console/ng/ht/model already added, skipping

      org/jbpm/console/ng/ht/model/fb already added, skipping

      org/jbpm/console/ng/ht/model/fb/events already added, skipping

      org/jbpm/console/ng/ht/model/events already added, skipping

      org/jbpm/console/ng/ht/service/IdentityService.java already added, skipping

      org/jbpm/console/ng/ht/service/TaskServiceEntryPoint.java already added, skipping

      org/jbpm/console/ng/ht/service/FormModelerProcessStarterEntryPoint.java already added, skipping

      org/jbpm/console/ng/ht/service/TypeRoleServiceEntryPoint.java already added, skipping

      org/jbpm/console/ng/ht/service/GroupServiceEntryPoint.java already added, skipping

      org/jbpm/console/ng/ht/service/IdentityServiceMock.java already added, skipping

      org/jbpm/console/ng/ht/service/FormServiceEntryPoint.java already added, skipping

      org/jbpm/console/ng/ht/service/UserServiceEntryPoint.java already added, skipping

      org/jbpm/console/ng/ht/model/Group.java already added, skipping

      org/jbpm/console/ng/ht/model/CalendarListContainer.java already added, skipping

      org/jbpm/console/ng/ht/model/IdentitySummary.java already added, skipping

      org/jbpm/console/ng/ht/model/TaskEventSummary.java already added, skipping

      org/jbpm/console/ng/ht/model/fb/events/FormLoadedEvent.java already added, skipping

      org/jbpm/console/ng/ht/model/fb/events/FormRenderedEvent.java already added, skipping

      org/jbpm/console/ng/ht/model/fb/events/PaletteItemAddedEvent.java already added, skipping

      org/jbpm/console/ng/ht/model/CommentSummary.java already added, skipping

      org/jbpm/console/ng/ht/model/TaskSummary.java already added, skipping

      org/jbpm/console/ng/ht/model/TypeRole.java already added, skipping

      org/jbpm/console/ng/ht/model/Day.java already added, skipping

      org/jbpm/console/ng/ht/model/User.java already added, skipping

      org/jbpm/console/ng/ht/model/events/NewTaskEvent.java already added, skipping

      org/jbpm/console/ng/ht/model/events/TaskSearchEvent.java already added, skipping

      org/jbpm/console/ng/ht/model/events/TaskSelectionEvent.java already added, skipping

      org/jbpm/console/ng/ht/model/events/TaskRefreshedEvent.java already added, skipping

      org/jbpm/console/ng/ht/model/events/EditPanelEvent.java already added, skipping

      org/jbpm/console/ng/ht/model/events/TaskCalendarEvent.java already added, skipping

      org/jbpm/console/ng/ht/model/events/TaskStyleEvent.java already added, skipping

      org/jbpm/console/ng/ht/model/TaskDefSummary.java already added, skipping

      org already added, skipping

      org/jbpm already added, skipping

      org/jbpm/console already added, skipping

      org/jbpm/console/ng already added, skipping

      org/jbpm/console/ng/ht already added, skipping

      Building jar: /home/mohebbi/projects/jbpm-console-ng-master/jbpm-console-ng-human-tasks/jbpm-console-ng-human-tasks-api/target/jbpm-console-ng-human-tasks-api-6.1.0-SNAPSHOT-sources.jar

      org already added, skipping

      org/jbpm already added, skipping

      org/jbpm/console already added, skipping

      org/jbpm/console/ng already added, skipping

      org/jbpm/console/ng/ht already added, skipping

      org/jbpm/console/ng/ht/service already added, skipping

      org/jbpm/console/ng/ht/model already added, skipping

      org/jbpm/console/ng/ht/model/fb already added, skipping

      org/jbpm/console/ng/ht/model/fb/events already added, skipping

      org/jbpm/console/ng/ht/model/events already added, skipping

      org/jbpm/console/ng/ht/service/IdentityService.java already added, skipping

      org/jbpm/console/ng/ht/service/TaskServiceEntryPoint.java already added, skipping

      org/jbpm/console/ng/ht/service/FormModelerProcessStarterEntryPoint.java already added, skipping

      org/jbpm/console/ng/ht/service/TypeRoleServiceEntryPoint.java already added, skipping

      org/jbpm/console/ng/ht/service/GroupServiceEntryPoint.java already added, skipping

      org/jbpm/console/ng/ht/service/IdentityServiceMock.java already added, skipping

      org/jbpm/console/ng/ht/service/FormServiceEntryPoint.java already added, skipping

      org/jbpm/console/ng/ht/service/UserServiceEntryPoint.java already added, skipping

      org/jbpm/console/ng/ht/model/Group.java already added, skipping

      org/jbpm/console/ng/ht/model/CalendarListContainer.java already added, skipping

      org/jbpm/console/ng/ht/model/IdentitySummary.java already added, skipping

      org/jbpm/console/ng/ht/model/TaskEventSummary.java already added, skipping

      org/jbpm/console/ng/ht/model/fb/events/FormLoadedEvent.java already added, skipping

      org/jbpm/console/ng/ht/model/fb/events/FormRenderedEvent.java already added, skipping

      org/jbpm/console/ng/ht/model/fb/events/PaletteItemAddedEvent.java already added, skipping

      org/jbpm/console/ng/ht/model/CommentSummary.java already added, skipping

      org/jbpm/console/ng/ht/model/TaskSummary.java already added, skipping

      org/jbpm/console/ng/ht/model/TypeRole.java already added, skipping

      org/jbpm/console/ng/ht/model/Day.java already added, skipping

      org/jbpm/console/ng/ht/model/User.java already added, skipping

      org/jbpm/console/ng/ht/model/events/NewTaskEvent.java already added, skipping

      org/jbpm/console/ng/ht/model/events/TaskSearchEvent.java already added, skipping

      org/jbpm/console/ng/ht/model/events/TaskSelectionEvent.java already added, skipping

      org/jbpm/console/ng/ht/model/events/TaskRefreshedEvent.java already added, skipping

      org/jbpm/console/ng/ht/model/events/EditPanelEvent.java already added, skipping

      org/jbpm/console/ng/ht/model/events/TaskCalendarEvent.java already added, skipping

      org/jbpm/console/ng/ht/model/events/TaskStyleEvent.java already added, skipping

      org/jbpm/console/ng/ht/model/TaskDefSummary.java already added, skipping

      org already added, skipping

      org/jbpm already added, skipping

      org/jbpm/console already added, skipping

      org/jbpm/console/ng already added, skipping

      org/jbpm/console/ng/ht already added, skipping

       

      >>> maven-source-plugin:2.1.2:test-jar (test-jar) @ jbpm-console-ng-human-tasks-api >>>

       

      [enforcer:enforce]

       

      [enforcer:enforce]

       

      [enforcer:enforce]

       

      [build-helper:parse-version]

       

      [buildnumber:create-timestamp]

       

      [buildnumber:create]

       

      <<< maven-source-plugin:2.1.2:test-jar (test-jar) @ jbpm-console-ng-human-tasks-api <<<

       

      [source:test-jar]

      No sources in project. Archive not created.

       

      [source:jar-no-fork]

      org already added, skipping

      org/jbpm already added, skipping

      org/jbpm/console already added, skipping

      org/jbpm/console/ng already added, skipping

      org/jbpm/console/ng/ht already added, skipping

      org/jbpm/console/ng/ht/service already added, skipping

      org/jbpm/console/ng/ht/model already added, skipping

      org/jbpm/console/ng/ht/model/fb already added, skipping

      org/jbpm/console/ng/ht/model/fb/events already added, skipping

      org/jbpm/console/ng/ht/model/events already added, skipping

      org/jbpm/console/ng/ht/service/IdentityService.java already added, skipping

      org/jbpm/console/ng/ht/service/TaskServiceEntryPoint.java already added, skipping

      org/jbpm/console/ng/ht/service/FormModelerProcessStarterEntryPoint.java already added, skipping

      org/jbpm/console/ng/ht/service/TypeRoleServiceEntryPoint.java already added, skipping

      org/jbpm/console/ng/ht/service/GroupServiceEntryPoint.java already added, skipping

      org/jbpm/console/ng/ht/service/IdentityServiceMock.java already added, skipping

      org/jbpm/console/ng/ht/service/FormServiceEntryPoint.java already added, skipping

      org/jbpm/console/ng/ht/service/UserServiceEntryPoint.java already added, skipping

      org/jbpm/console/ng/ht/model/Group.java already added, skipping

      org/jbpm/console/ng/ht/model/CalendarListContainer.java already added, skipping

      org/jbpm/console/ng/ht/model/IdentitySummary.java already added, skipping

      org/jbpm/console/ng/ht/model/TaskEventSummary.java already added, skipping

      org/jbpm/console/ng/ht/model/fb/events/FormLoadedEvent.java already added, skipping

      org/jbpm/console/ng/ht/model/fb/events/FormRenderedEvent.java already added, skipping

      org/jbpm/console/ng/ht/model/fb/events/PaletteItemAddedEvent.java already added, skipping

      org/jbpm/console/ng/ht/model/CommentSummary.java already added, skipping

      org/jbpm/console/ng/ht/model/TaskSummary.java already added, skipping

      org/jbpm/console/ng/ht/model/TypeRole.java already added, skipping

      org/jbpm/console/ng/ht/model/Day.java already added, skipping

      org/jbpm/console/ng/ht/model/User.java already added, skipping

      org/jbpm/console/ng/ht/model/events/NewTaskEvent.java already added, skipping

      org/jbpm/console/ng/ht/model/events/TaskSearchEvent.java already added, skipping

      org/jbpm/console/ng/ht/model/events/TaskSelectionEvent.java already added, skipping

      org/jbpm/console/ng/ht/model/events/TaskRefreshedEvent.java already added, skipping

      org/jbpm/console/ng/ht/model/events/EditPanelEvent.java already added, skipping

      org/jbpm/console/ng/ht/model/events/TaskCalendarEvent.java already added, skipping

      org/jbpm/console/ng/ht/model/events/TaskStyleEvent.java already added, skipping

      org/jbpm/console/ng/ht/model/TaskDefSummary.java already added, skipping

      org already added, skipping

      org/jbpm already added, skipping

      org/jbpm/console already added, skipping

      org/jbpm/console/ng already added, skipping

      org/jbpm/console/ng/ht already added, skipping

      Artifact org.jbpm:jbpm-console-ng-human-tasks-api:java-source:sources:6.1.0-SNAPSHOT already attached to project, ignoring duplicate

       

      [failsafe:integration-test]

      No tests to run.

       

      [install:install]

      Installing /home/mohebbi/projects/jbpm-console-ng-master/jbpm-console-ng-human-tasks/jbpm-console-ng-human-tasks-api/target/jbpm-console-ng-human-tasks-api-6.1.0-SNAPSHOT.jar to /home/mohebbi/.m2/repository/org/jbpm/jbpm-console-ng-human-tasks-api/6.1.0-SNAPSHOT/jbpm-console-ng-human-tasks-api-6.1.0-SNAPSHOT.jar

      Installing /home/mohebbi/projects/jbpm-console-ng-master/jbpm-console-ng-human-tasks/jbpm-console-ng-human-tasks-api/pom.xml to /home/mohebbi/.m2/repository/org/jbpm/jbpm-console-ng-human-tasks-api/6.1.0-SNAPSHOT/jbpm-console-ng-human-tasks-api-6.1.0-SNAPSHOT.pom

      Installing /home/mohebbi/projects/jbpm-console-ng-master/jbpm-console-ng-human-tasks/jbpm-console-ng-human-tasks-api/target/jbpm-console-ng-human-tasks-api-6.1.0-SNAPSHOT-tests.jar to /home/mohebbi/.m2/repository/org/jbpm/jbpm-console-ng-human-tasks-api/6.1.0-SNAPSHOT/jbpm-console-ng-human-tasks-api-6.1.0-SNAPSHOT-tests.jar

      Installing /home/mohebbi/projects/jbpm-console-ng-master/jbpm-console-ng-human-tasks/jbpm-console-ng-human-tasks-api/target/jbpm-console-ng-human-tasks-api-6.1.0-SNAPSHOT-sources.jar to /home/mohebbi/.m2/repository/org/jbpm/jbpm-console-ng-human-tasks-api/6.1.0-SNAPSHOT/jbpm-console-ng-human-tasks-api-6.1.0-SNAPSHOT-sources.jar

                                                                             

      ------------------------------------------------------------------------

      Building jBPM Console NG - Process Runtime Panels 6.1.0-SNAPSHOT

      ------------------------------------------------------------------------

       

      [clean:clean]

      Deleting /home/mohebbi/projects/jbpm-console-ng-master/jbpm-console-ng-process-runtime/target

      Deleting /home/mohebbi/projects/jbpm-console-ng-master/jbpm-console-ng-process-runtime (includes = [.errai/**, .niogit/**], excludes = [])

       

      [enforcer:enforce]

       

      [enforcer:enforce]

       

      [enforcer:enforce]

       

      [build-helper:parse-version]

       

      [buildnumber:create-timestamp]

       

      [buildnumber:create]

       

      [resources:copy-resources]

      Using 'UTF-8' encoding to copy filtered resources.

      skip non existing resourceDirectory /home/mohebbi/projects/jbpm-console-ng-master/jbpm-console-ng-process-runtime/target/generated-sources/annotations

       

      [jar:test-jar]

      JAR will be empty - no content was marked for inclusion!

      Building jar: /home/mohebbi/projects/jbpm-console-ng-master/jbpm-console-ng-process-runtime/target/jbpm-console-ng-process-runtime-6.1.0-SNAPSHOT-tests.jar

       

      >>> maven-source-plugin:2.1.2:jar (jar) @ jbpm-console-ng-process-runtime >>>

       

      [enforcer:enforce]

       

      [enforcer:enforce]

       

      [enforcer:enforce]

       

      [build-helper:parse-version]

       

      [buildnumber:create-timestamp]

       

      [buildnumber:create]

       

      <<< maven-source-plugin:2.1.2:jar (jar) @ jbpm-console-ng-process-runtime <<<

       

      [source:jar]

       

      >>> maven-source-plugin:2.1.2:test-jar (test-jar) @ jbpm-console-ng-process-runtime >>>

       

      [enforcer:enforce]

       

      [enforcer:enforce]

       

      [enforcer:enforce]

       

      [build-helper:parse-version]

       

      [buildnumber:create-timestamp]

       

      [buildnumber:create]

       

      <<< maven-source-plugin:2.1.2:test-jar (test-jar) @ jbpm-console-ng-process-runtime <<<

       

      [source:test-jar]

       

      [source:jar-no-fork]

       

      [failsafe:integration-test]

      No tests to run.

       

      [install:install]

      Installing /home/mohebbi/projects/jbpm-console-ng-master/jbpm-console-ng-process-runtime/pom.xml to /home/mohebbi/.m2/repository/org/jbpm/jbpm-console-ng-process-runtime/6.1.0-SNAPSHOT/jbpm-console-ng-process-runtime-6.1.0-SNAPSHOT.pom

      Installing /home/mohebbi/projects/jbpm-console-ng-master/jbpm-console-ng-process-runtime/target/jbpm-console-ng-process-runtime-6.1.0-SNAPSHOT-tests.jar to /home/mohebbi/.m2/repository/org/jbpm/jbpm-console-ng-process-runtime/6.1.0-SNAPSHOT/jbpm-console-ng-process-runtime-6.1.0-SNAPSHOT-tests.jar

                                                                             

      ------------------------------------------------------------------------

      Building jBPM Console NG - Process Runtime API 6.1.0-SNAPSHOT

      ------------------------------------------------------------------------

       

      [clean:clean]

      Deleting /home/mohebbi/projects/jbpm-console-ng-master/jbpm-console-ng-process-runtime/jbpm-console-ng-process-runtime-api/target

      Deleting /home/mohebbi/projects/jbpm-console-ng-master/jbpm-console-ng-process-runtime/jbpm-console-ng-process-runtime-api (includes = [.errai/**, .niogit/**], excludes = [])

       

      [enforcer:enforce]

       

      [enforcer:enforce]

       

      [enforcer:enforce]

       

      [build-helper:parse-version]

       

      [buildnumber:create-timestamp]

       

      [buildnumber:create]

       

      [resources:resources]

      Using 'UTF-8' encoding to copy filtered resources.

      Copying 13 resources

      Copying 2 resources

       

      [compiler:compile]

      Compiling 13 source files to /home/mohebbi/projects/jbpm-console-ng-master/jbpm-console-ng-process-runtime/jbpm-console-ng-process-runtime-api/target/classes

       

      [resources:testResources]

      Using 'UTF-8' encoding to copy filtered resources.

      skip non existing resourceDirectory /home/mohebbi/projects/jbpm-console-ng-master/jbpm-console-ng-process-runtime/jbpm-console-ng-process-runtime-api/src/test/resources

       

      [compiler:testCompile]

      No sources to compile

       

      [surefire:test]

      No tests to run.

       

      [resources:copy-resources]

      Using 'UTF-8' encoding to copy filtered resources.

      Copying 0 resource

       

      [jar:jar]

      Building jar: /home/mohebbi/projects/jbpm-console-ng-master/jbpm-console-ng-process-runtime/jbpm-console-ng-process-runtime-api/target/jbpm-console-ng-process-runtime-api-6.1.0-SNAPSHOT.jar

       

      [jar:test-jar]

      JAR will be empty - no content was marked for inclusion!

      Building jar: /home/mohebbi/projects/jbpm-console-ng-master/jbpm-console-ng-process-runtime/jbpm-console-ng-process-runtime-api/target/jbpm-console-ng-process-runtime-api-6.1.0-SNAPSHOT-tests.jar

       

      >>> maven-source-plugin:2.1.2:jar (jar) @ jbpm-console-ng-process-runtime-api >>>

       

      [enforcer:enforce]

       

      [enforcer:enforce]

       

      [enforcer:enforce]

       

      [build-helper:parse-version]

       

      [buildnumber:create-timestamp]

       

      [buildnumber:create]

       

      <<< maven-source-plugin:2.1.2:jar (jar) @ jbpm-console-ng-process-runtime-api <<<

       

      [source:jar]

      org already added, skipping

      org/jbpm already added, skipping

      org/jbpm/console already added, skipping

      org/jbpm/console/ng already added, skipping

      org/jbpm/console/ng/pr already added, skipping

      org/jbpm/console/ng/pr/model already added, skipping

      org/jbpm/console/ng/pr/model/events already added, skipping

      org/jbpm/console/ng/pr/model/VariableSummary.java already added, skipping

      org/jbpm/console/ng/pr/model/ProcessSummary.java already added, skipping

      org/jbpm/console/ng/pr/model/DummyProcessPath.java already added, skipping

      org/jbpm/console/ng/pr/model/NodeInstanceSummary.java already added, skipping

      org/jbpm/console/ng/pr/model/events/ProcessInstancesSearchEvent.java already added, skipping

      org/jbpm/console/ng/pr/model/events/ProcessInstanceStyleEvent.java already added, skipping

      org/jbpm/console/ng/pr/model/events/ProcessInstancesWithDetailsRequestEvent.java already added, skipping

      org/jbpm/console/ng/pr/model/events/ProcessDefStyleEvent.java already added, skipping

      org/jbpm/console/ng/pr/model/events/NewProcessInstanceEvent.java already added, skipping

      org/jbpm/console/ng/pr/model/events/ProcessInstanceSelectionEvent.java already added, skipping

      org/jbpm/console/ng/pr/model/events/ProcessDefinitionsSearchEvent.java already added, skipping

      org/jbpm/console/ng/pr/model/events/ProcessDefSelectionEvent.java already added, skipping

      org/jbpm/console/ng/pr/model/ProcessInstanceSummary.java already added, skipping

      org already added, skipping

      org/jbpm already added, skipping

      org/jbpm/console already added, skipping

      org/jbpm/console/ng already added, skipping

      org/jbpm/console/ng/pr already added, skipping

      Building jar: /home/mohebbi/projects/jbpm-console-ng-master/jbpm-console-ng-process-runtime/jbpm-console-ng-process-runtime-api/target/jbpm-console-ng-process-runtime-api-6.1.0-SNAPSHOT-sources.jar

      org already added, skipping

      org/jbpm already added, skipping

      org/jbpm/console already added, skipping

      org/jbpm/console/ng already added, skipping

      org/jbpm/console/ng/pr already added, skipping

      org/jbpm/console/ng/pr/model already added, skipping

      org/jbpm/console/ng/pr/model/events already added, skipping

      org/jbpm/console/ng/pr/model/VariableSummary.java already added, skipping

      org/jbpm/console/ng/pr/model/ProcessSummary.java already added, skipping

      org/jbpm/console/ng/pr/model/DummyProcessPath.java already added, skipping

      org/jbpm/console/ng/pr/model/NodeInstanceSummary.java already added, skipping

      org/jbpm/console/ng/pr/model/events/ProcessInstancesSearchEvent.java already added, skipping

      org/jbpm/console/ng/pr/model/events/ProcessInstanceStyleEvent.java already added, skipping

      org/jbpm/console/ng/pr/model/events/ProcessInstancesWithDetailsRequestEvent.java already added, skipping

      org/jbpm/console/ng/pr/model/events/ProcessDefStyleEvent.java already added, skipping

      org/jbpm/console/ng/pr/model/events/NewProcessInstanceEvent.java already added, skipping

      org/jbpm/console/ng/pr/model/events/ProcessInstanceSelectionEvent.java already added, skipping

      org/jbpm/console/ng/pr/model/events/ProcessDefinitionsSearchEvent.java already added, skipping

      org/jbpm/console/ng/pr/model/events/ProcessDefSelectionEvent.java already added, skipping

      org/jbpm/console/ng/pr/model/ProcessInstanceSummary.java already added, skipping

      org already added, skipping

      org/jbpm already added, skipping

      org/jbpm/console already added, skipping

      org/jbpm/console/ng already added, skipping

      org/jbpm/console/ng/pr already added, skipping

       

      >>> maven-source-plugin:2.1.2:test-jar (test-jar) @ jbpm-console-ng-process-runtime-api >>>

       

      [enforcer:enforce]

       

      [enforcer:enforce]

       

      [enforcer:enforce]

       

      [build-helper:parse-version]

       

      [buildnumber:create-timestamp]

       

      [buildnumber:create]

       

      <<< maven-source-plugin:2.1.2:test-jar (test-jar) @ jbpm-console-ng-process-runtime-api <<<

       

      [source:test-jar]

      No sources in project. Archive not created.

       

      [source:jar-no-fork]

      org already added, skipping

      org/jbpm already added, skipping

      org/jbpm/console already added, skipping

      org/jbpm/console/ng already added, skipping

      org/jbpm/console/ng/pr already added, skipping

      org/jbpm/console/ng/pr/model already added, skipping

      org/jbpm/console/ng/pr/model/events already added, skipping

      org/jbpm/console/ng/pr/model/VariableSummary.java already added, skipping

      org/jbpm/console/ng/pr/model/ProcessSummary.java already added, skipping

      org/jbpm/console/ng/pr/model/DummyProcessPath.java already added, skipping

      org/jbpm/console/ng/pr/model/NodeInstanceSummary.java already added, skipping

      org/jbpm/console/ng/pr/model/events/ProcessInstancesSearchEvent.java already added, skipping

      org/jbpm/console/ng/pr/model/events/ProcessInstanceStyleEvent.java already added, skipping

      org/jbpm/console/ng/pr/model/events/ProcessInstancesWithDetailsRequestEvent.java already added, skipping

      org/jbpm/console/ng/pr/model/events/ProcessDefStyleEvent.java already added, skipping

      org/jbpm/console/ng/pr/model/events/NewProcessInstanceEvent.java already added, skipping

      org/jbpm/console/ng/pr/model/events/ProcessInstanceSelectionEvent.java already added, skipping

      org/jbpm/console/ng/pr/model/events/ProcessDefinitionsSearchEvent.java already added, skipping

      org/jbpm/console/ng/pr/model/events/ProcessDefSelectionEvent.java already added, skipping

      org/jbpm/console/ng/pr/model/ProcessInstanceSummary.java already added, skipping

      org already added, skipping

      org/jbpm already added, skipping

      org/jbpm/console already added, skipping

      org/jbpm/console/ng already added, skipping

      org/jbpm/console/ng/pr already added, skipping

      Artifact org.jbpm:jbpm-console-ng-process-runtime-api:java-source:sources:6.1.0-SNAPSHOT already attached to project, ignoring duplicate

       

      [failsafe:integration-test]

      No tests to run.

       

      [install:install]

      Installing /home/mohebbi/projects/jbpm-console-ng-master/jbpm-console-ng-process-runtime/jbpm-console-ng-process-runtime-api/target/jbpm-console-ng-process-runtime-api-6.1.0-SNAPSHOT.jar to /home/mohebbi/.m2/repository/org/jbpm/jbpm-console-ng-process-runtime-api/6.1.0-SNAPSHOT/jbpm-console-ng-process-runtime-api-6.1.0-SNAPSHOT.jar

      Installing /home/mohebbi/projects/jbpm-console-ng-master/jbpm-console-ng-process-runtime/jbpm-console-ng-process-runtime-api/pom.xml to /home/mohebbi/.m2/repository/org/jbpm/jbpm-console-ng-process-runtime-api/6.1.0-SNAPSHOT/jbpm-console-ng-process-runtime-api-6.1.0-SNAPSHOT.pom

      Installing /home/mohebbi/projects/jbpm-console-ng-master/jbpm-console-ng-process-runtime/jbpm-console-ng-process-runtime-api/target/jbpm-console-ng-process-runtime-api-6.1.0-SNAPSHOT-tests.jar to /home/mohebbi/.m2/repository/org/jbpm/jbpm-console-ng-process-runtime-api/6.1.0-SNAPSHOT/jbpm-console-ng-process-runtime-api-6.1.0-SNAPSHOT-tests.jar

      Installing /home/mohebbi/projects/jbpm-console-ng-master/jbpm-console-ng-process-runtime/jbpm-console-ng-process-runtime-api/target/jbpm-console-ng-process-runtime-api-6.1.0-SNAPSHOT-sources.jar to /home/mohebbi/.m2/repository/org/jbpm/jbpm-console-ng-process-runtime-api/6.1.0-SNAPSHOT/jbpm-console-ng-process-runtime-api-6.1.0-SNAPSHOT-sources.jar

                                                                             

      ------------------------------------------------------------------------

      Building jBPM Console NG - Business Domain Panels 6.1.0-SNAPSHOT

      ------------------------------------------------------------------------

       

      [clean:clean]

      Deleting /home/mohebbi/projects/jbpm-console-ng-master/jbpm-console-ng-business-domain/target

      Deleting /home/mohebbi/projects/jbpm-console-ng-master/jbpm-console-ng-business-domain (includes = [.errai/**, .niogit/**], excludes = [])

       

      [enforcer:enforce]

       

      [enforcer:enforce]

       

      [enforcer:enforce]

       

      [build-helper:parse-version]

       

      [buildnumber:create-timestamp]

       

      [buildnumber:create]

       

      [resources:copy-resources]

      Using 'UTF-8' encoding to copy filtered resources.

      skip non existing resourceDirectory /home/mohebbi/projects/jbpm-console-ng-master/jbpm-console-ng-business-domain/target/generated-sources/annotations

       

      [jar:test-jar]

      JAR will be empty - no content was marked for inclusion!

      Building jar: /home/mohebbi/projects/jbpm-console-ng-master/jbpm-console-ng-business-domain/target/jbpm-console-ng-business-domain-6.1.0-SNAPSHOT-tests.jar

       

      >>> maven-source-plugin:2.1.2:jar (jar) @ jbpm-console-ng-business-domain >>>

       

      [enforcer:enforce]

       

      [enforcer:enforce]

       

      [enforcer:enforce]

       

      [build-helper:parse-version]

       

      [buildnumber:create-timestamp]

       

      [buildnumber:create]

       

      <<< maven-source-plugin:2.1.2:jar (jar) @ jbpm-console-ng-business-domain <<<

       

      [source:jar]

       

      >>> maven-source-plugin:2.1.2:test-jar (test-jar) @ jbpm-console-ng-business-domain >>>

       

      [enforcer:enforce]

       

      [enforcer:enforce]

       

      [enforcer:enforce]

       

      [build-helper:parse-version]

       

      [buildnumber:create-timestamp]

       

      [buildnumber:create]

       

      <<< maven-source-plugin:2.1.2:test-jar (test-jar) @ jbpm-console-ng-business-domain <<<

       

      [source:test-jar]

       

      [source:jar-no-fork]

       

      [failsafe:integration-test]

      No tests to run.

       

      [install:install]

      Installing /home/mohebbi/projects/jbpm-console-ng-master/jbpm-console-ng-business-domain/pom.xml to /home/mohebbi/.m2/repository/org/jbpm/jbpm-console-ng-business-domain/6.1.0-SNAPSHOT/jbpm-console-ng-business-domain-6.1.0-SNAPSHOT.pom

      Installing /home/mohebbi/projects/jbpm-console-ng-master/jbpm-console-ng-business-domain/target/jbpm-console-ng-business-domain-6.1.0-SNAPSHOT-tests.jar to /home/mohebbi/.m2/repository/org/jbpm/jbpm-console-ng-business-domain/6.1.0-SNAPSHOT/jbpm-console-ng-business-domain-6.1.0-SNAPSHOT-tests.jar

                                                                             

      ------------------------------------------------------------------------

      Building jBPM Console NG - Business Domain API 6.1.0-SNAPSHOT

      ------------------------------------------------------------------------

       

      [clean:clean]

      Deleting /home/mohebbi/projects/jbpm-console-ng-master/jbpm-console-ng-business-domain/jbpm-console-ng-business-domain-api/target

      Deleting /home/mohebbi/projects/jbpm-console-ng-master/jbpm-console-ng-business-domain/jbpm-console-ng-business-domain-api (includes = [.errai/**, .niogit/**], excludes = [])

       

      [enforcer:enforce]

       

      [enforcer:enforce]

       

      [enforcer:enforce]

       

      [build-helper:parse-version]

       

      [buildnumber:create-timestamp]

       

      [buildnumber:create]

       

      [resources:resources]

      Using 'UTF-8' encoding to copy filtered resources.

      Copying 15 resources

      Copying 2 resources

       

      [compiler:compile]

      Compiling 15 source files to /home/mohebbi/projects/jbpm-console-ng-master/jbpm-console-ng-business-domain/jbpm-console-ng-business-domain-api/target/classes

       

      [resources:testResources]

      Using 'UTF-8' encoding to copy filtered resources.

      skip non existing resourceDirectory /home/mohebbi/projects/jbpm-console-ng-master/jbpm-console-ng-business-domain/jbpm-console-ng-business-domain-api/src/test/resources

       

      [compiler:testCompile]

      No sources to compile

       

      [surefire:test]

      No tests to run.

       

      [resources:copy-resources]

      Using 'UTF-8' encoding to copy filtered resources.

      Copying 0 resource

       

      [jar:jar]

      Building jar: /home/mohebbi/projects/jbpm-console-ng-master/jbpm-console-ng-business-domain/jbpm-console-ng-business-domain-api/target/jbpm-console-ng-business-domain-api-6.1.0-SNAPSHOT.jar

       

      [jar:test-jar]

      JAR will be empty - no content was marked for inclusion!

      Building jar: /home/mohebbi/projects/jbpm-console-ng-master/jbpm-console-ng-business-domain/jbpm-console-ng-business-domain-api/target/jbpm-console-ng-business-domain-api-6.1.0-SNAPSHOT-tests.jar

       

      >>> maven-source-plugin:2.1.2:jar (jar) @ jbpm-console-ng-business-domain-api >>>

       

      [enforcer:enforce]

       

      [enforcer:enforce]

       

      [enforcer:enforce]

       

      [build-helper:parse-version]

       

      [buildnumber:create-timestamp]

       

      [buildnumber:create]

       

      <<< maven-source-plugin:2.1.2:jar (jar) @ jbpm-console-ng-business-domain-api <<<

       

      [source:jar]

      org already added, skipping

      org/jbpm already added, skipping

      org/jbpm/console already added, skipping

      org/jbpm/console/ng already added, skipping

      org/jbpm/console/ng/bd already added, skipping

      org/jbpm/console/ng/bd/service already added, skipping

      org/jbpm/console/ng/bd/exception already added, skipping

      org/jbpm/console/ng/bd/model already added, skipping

      org/jbpm/console/ng/bd/model/events already added, skipping

      org/jbpm/console/ng/bd/service/Initializable.java already added, skipping

      org/jbpm/console/ng/bd/service/DataServiceEntryPoint.java already added, skipping

      org/jbpm/console/ng/bd/service/DeploymentUnitProvider.java already added, skipping

      org/jbpm/console/ng/bd/service/KieSessionEntryPoint.java already added, skipping

      org/jbpm/console/ng/bd/service/DeploymentManagerEntryPoint.java already added, skipping

      org/jbpm/console/ng/bd/exception/DeploymentException.java already added, skipping

      org/jbpm/console/ng/bd/model/DomainSummary.java already added, skipping

      org/jbpm/console/ng/bd/model/OrganizationSummary.java already added, skipping

      org/jbpm/console/ng/bd/model/RuleNotificationSummary.java already added, skipping

      org/jbpm/console/ng/bd/model/KieSessionSummary.java already added, skipping

      org/jbpm/console/ng/bd/model/RuntimeSummary.java already added, skipping

      org/jbpm/console/ng/bd/model/events/DeployedUnitChangedEvent.java already added, skipping

      org/jbpm/console/ng/bd/model/events/DeploymentsSearchEvent.java already added, skipping

      org/jbpm/console/ng/bd/model/KModuleDeploymentUnitSummary.java already added, skipping

      org/jbpm/console/ng/bd/model/DeploymentUnitSummary.java already added, skipping

      org already added, skipping

      org/jbpm already added, skipping

      org/jbpm/console already added, skipping

      org/jbpm/console/ng already added, skipping

      org/jbpm/console/ng/bd already added, skipping

      Building jar: /home/mohebbi/projects/jbpm-console-ng-master/jbpm-console-ng-business-domain/jbpm-console-ng-business-domain-api/target/jbpm-console-ng-business-domain-api-6.1.0-SNAPSHOT-sources.jar

      org already added, skipping

      org/jbpm already added, skipping

      org/jbpm/console already added, skipping

      org/jbpm/console/ng already added, skipping

      org/jbpm/console/ng/bd already added, skipping

      org/jbpm/console/ng/bd/service already added, skipping

      org/jbpm/console/ng/bd/exception already added, skipping

      org/jbpm/console/ng/bd/model already added, skipping

      org/jbpm/console/ng/bd/model/events already added, skipping

      org/jbpm/console/ng/bd/service/Initializable.java already added, skipping

      org/jbpm/console/ng/bd/service/DataServiceEntryPoint.java already added, skipping

      org/jbpm/console/ng/bd/service/DeploymentUnitProvider.java already added, skipping

      org/jbpm/console/ng/bd/service/KieSessionEntryPoint.java already added, skipping

      org/jbpm/console/ng/bd/service/DeploymentManagerEntryPoint.java already added, skipping

      org/jbpm/console/ng/bd/exception/DeploymentException.java already added, skipping

      org/jbpm/console/ng/bd/model/DomainSummary.java already added, skipping

      org/jbpm/console/ng/bd/model/OrganizationSummary.java already added, skipping

      org/jbpm/console/ng/bd/model/RuleNotificationSummary.java already added, skipping

      org/jbpm/console/ng/bd/model/KieSessionSummary.java already added, skipping

      org/jbpm/console/ng/bd/model/RuntimeSummary.java already added, skipping

      org/jbpm/console/ng/bd/model/events/DeployedUnitChangedEvent.java already added, skipping

      org/jbpm/console/ng/bd/model/events/DeploymentsSearchEvent.java already added, skipping

      org/jbpm/console/ng/bd/model/KModuleDeploymentUnitSummary.java already added, skipping

      org/jbpm/console/ng/bd/model/DeploymentUnitSummary.java already added, skipping

      org already added, skipping

      org/jbpm already added, skipping

      org/jbpm/console already added, skipping

      org/jbpm/console/ng already added, skipping

      org/jbpm/console/ng/bd already added, skipping

       

      >>> maven-source-plugin:2.1.2:test-jar (test-jar) @ jbpm-console-ng-business-domain-api >>>

       

      [enforcer:enforce]

       

      [enforcer:enforce]

       

      [enforcer:enforce]

       

      [build-helper:parse-version]

       

      [buildnumber:create-timestamp]

       

      [buildnumber:create]

       

      <<< maven-source-plugin:2.1.2:test-jar (test-jar) @ jbpm-console-ng-business-domain-api <<<

       

      [source:test-jar]

      No sources in project. Archive not created.

       

      [source:jar-no-fork]

      org already added, skipping

      org/jbpm already added, skipping

      org/jbpm/console already added, skipping

      org/jbpm/console/ng already added, skipping

      org/jbpm/console/ng/bd already added, skipping

      org/jbpm/console/ng/bd/service already added, skipping

      org/jbpm/console/ng/bd/exception already added, skipping

      org/jbpm/console/ng/bd/model already added, skipping

      org/jbpm/console/ng/bd/model/events already added, skipping

      org/jbpm/console/ng/bd/service/Initializable.java already added, skipping

      org/jbpm/console/ng/bd/service/DataServiceEntryPoint.java already added, skipping

      org/jbpm/console/ng/bd/service/DeploymentUnitProvider.java already added, skipping

      org/jbpm/console/ng/bd/service/KieSessionEntryPoint.java already added, skipping

      org/jbpm/console/ng/bd/service/DeploymentManagerEntryPoint.java already added, skipping

      org/jbpm/console/ng/bd/exception/DeploymentException.java already added, skipping

      org/jbpm/console/ng/bd/model/DomainSummary.java already added, skipping

      org/jbpm/console/ng/bd/model/OrganizationSummary.java already added, skipping

      org/jbpm/console/ng/bd/model/RuleNotificationSummary.java already added, skipping

      org/jbpm/console/ng/bd/model/KieSessionSummary.java already added, skipping

      org/jbpm/console/ng/bd/model/RuntimeSummary.java already added, skipping

      org/jbpm/console/ng/bd/model/events/DeployedUnitChangedEvent.java already added, skipping

      org/jbpm/console/ng/bd/model/events/DeploymentsSearchEvent.java already added, skipping

      org/jbpm/console/ng/bd/model/KModuleDeploymentUnitSummary.java already added, skipping

      org/jbpm/console/ng/bd/model/DeploymentUnitSummary.java already added, skipping

      org already added, skipping

      org/jbpm already added, skipping

      org/jbpm/console already added, skipping

      org/jbpm/console/ng already added, skipping

      org/jbpm/console/ng/bd already added, skipping

      Artifact org.jbpm:jbpm-console-ng-business-domain-api:java-source:sources:6.1.0-SNAPSHOT already attached to project, ignoring duplicate

       

      [failsafe:integration-test]

      No tests to run.

       

      [install:install]

      Installing /home/mohebbi/projects/jbpm-console-ng-master/jbpm-console-ng-business-domain/jbpm-console-ng-business-domain-api/target/jbpm-console-ng-business-domain-api-6.1.0-SNAPSHOT.jar to /home/mohebbi/.m2/repository/org/jbpm/jbpm-console-ng-business-domain-api/6.1.0-SNAPSHOT/jbpm-console-ng-business-domain-api-6.1.0-SNAPSHOT.jar

      Installing /home/mohebbi/projects/jbpm-console-ng-master/jbpm-console-ng-business-domain/jbpm-console-ng-business-domain-api/pom.xml to /home/mohebbi/.m2/repository/org/jbpm/jbpm-console-ng-business-domain-api/6.1.0-SNAPSHOT/jbpm-console-ng-business-domain-api-6.1.0-SNAPSHOT.pom

      Installing /home/mohebbi/projects/jbpm-console-ng-master/jbpm-console-ng-business-domain/jbpm-console-ng-business-domain-api/target/jbpm-console-ng-business-domain-api-6.1.0-SNAPSHOT-tests.jar to /home/mohebbi/.m2/repository/org/jbpm/jbpm-console-ng-business-domain-api/6.1.0-SNAPSHOT/jbpm-console-ng-business-domain-api-6.1.0-SNAPSHOT-tests.jar

      Installing /home/mohebbi/projects/jbpm-console-ng-master/jbpm-console-ng-business-domain/jbpm-console-ng-business-domain-api/target/jbpm-console-ng-business-domain-api-6.1.0-SNAPSHOT-sources.jar to /home/mohebbi/.m2/repository/org/jbpm/jbpm-console-ng-business-domain-api/6.1.0-SNAPSHOT/jbpm-console-ng-business-domain-api-6.1.0-SNAPSHOT-sources.jar

                                                                             

      ------------------------------------------------------------------------

      Building jBPM Console NG - Human Tasks Client 6.1.0-SNAPSHOT

      ------------------------------------------------------------------------

       

      [clean:clean]

      Deleting /home/mohebbi/projects/jbpm-console-ng-master/jbpm-console-ng-human-tasks/jbpm-console-ng-human-tasks-client/target

      Deleting /home/mohebbi/projects/jbpm-console-ng-master/jbpm-console-ng-human-tasks/jbpm-console-ng-human-tasks-client (includes = [.errai/**, .niogit/**], excludes = [])

       

      [enforcer:enforce]

       

      [enforcer:enforce]

       

      [enforcer:enforce]

       

      [build-helper:parse-version]

       

      [buildnumber:create-timestamp]

       

      [buildnumber:create]

       

      [resources:resources]

      Using 'UTF-8' encoding to copy filtered resources.

      Copying 72 resources

      Copying 36 resources

       

      [compiler:compile]

      Compiling 57 source files to /home/mohebbi/projects/jbpm-console-ng-master/jbpm-console-ng-human-tasks/jbpm-console-ng-human-tasks-client/target/classes

       

      [resources:testResources]

      Using 'UTF-8' encoding to copy filtered resources.

      skip non existing resourceDirectory /home/mohebbi/projects/jbpm-console-ng-master/jbpm-console-ng-human-tasks/jbpm-console-ng-human-tasks-client/src/test/resources

       

      [compiler:testCompile]

      Compiling 1 source file to /home/mohebbi/projects/jbpm-console-ng-master/jbpm-console-ng-human-tasks/jbpm-console-ng-human-tasks-client/target/test-classes

       

      [surefire:test]

       

      [resources:copy-resources]

      Using 'UTF-8' encoding to copy filtered resources.

      Copying 18 resources

       

      [jar:jar]

      Building jar: /home/mohebbi/projects/jbpm-console-ng-master/jbpm-console-ng-human-tasks/jbpm-console-ng-human-tasks-client/target/jbpm-console-ng-human-tasks-client-6.1.0-SNAPSHOT.jar

       

      [jar:test-jar]

      Building jar: /home/mohebbi/projects/jbpm-console-ng-master/jbpm-console-ng-human-tasks/jbpm-console-ng-human-tasks-client/target/jbpm-console-ng-human-tasks-client-6.1.0-SNAPSHOT-tests.jar

       

      >>> maven-source-plugin:2.1.2:jar (jar) @ jbpm-console-ng-human-tasks-client >>>

       

      [enforcer:enforce]

       

      [enforcer:enforce]

       

      [enforcer:enforce]

       

      [build-helper:parse-version]

       

      [buildnumber:create-timestamp]

       

      [buildnumber:create]

       

      <<< maven-source-plugin:2.1.2:jar (jar) @ jbpm-console-ng-human-tasks-client <<<

       

      [source:jar]

      org already added, skipping

      org/jbpm already added, skipping

      org/jbpm/console already added, skipping

      org/jbpm/console/ng already added, skipping

      org/jbpm/console/ng/ht already added, skipping

      org/jbpm/console/ng/ht/client already added, skipping

      org/jbpm/console/ng/ht/client/resources already added, skipping

      org/jbpm/console/ng/ht/client/i18n already added, skipping

      org/jbpm/console/ng/ht/client/perspectives already added, skipping

      org/jbpm/console/ng/ht/client/editors already added, skipping

      org/jbpm/console/ng/ht/client/editors/taskform already added, skipping

      org/jbpm/console/ng/ht/client/editors/taskform/popup already added, skipping

      org/jbpm/console/ng/ht/client/editors/quicknewgroup already added, skipping

      org/jbpm/console/ng/ht/client/editors/quicknewtask already added, skipping

      org/jbpm/console/ng/ht/client/editors/quicknewuser already added, skipping

      org/jbpm/console/ng/ht/client/editors/taskcomments already added, skipping

      org/jbpm/console/ng/ht/client/editors/taskcomments/popup already added, skipping

      org/jbpm/console/ng/ht/client/editors/taskdetailsmulti already added, skipping

      org/jbpm/console/ng/ht/client/editors/quicknewtyperole already added, skipping

      org/jbpm/console/ng/ht/client/editors/taskslist already added, skipping

      org/jbpm/console/ng/ht/client/editors/taskassignments already added, skipping

      org/jbpm/console/ng/ht/client/editors/taskassignments/popup already added, skipping

      org/jbpm/console/ng/ht/client/editors/taskdetails already added, skipping

      org/jbpm/console/ng/ht/client/editors/taskdetails/popup already added, skipping

      org/jbpm/console/ng/ht/client/editors/identity already added, skipping

      org/jbpm/console/ng/ht/client/util already added, skipping

      org/jbpm/console/ng/ht/client/resources/HumanTasksImages.java already added, skipping

      org/jbpm/console/ng/ht/client/resources/HumanTasksResources.java already added, skipping

      org/jbpm/console/ng/ht/client/i18n/Constants.java already added, skipping

      org/jbpm/console/ng/ht/client/perspectives/TasksListWithDetailsPerspective.java already added, skipping

      org/jbpm/console/ng/ht/client/perspectives/TasksListPerspective.java already added, skipping

      org/jbpm/console/ng/ht/client/perspectives/IdentityPerspective.java already added, skipping

      org/jbpm/console/ng/ht/client/editors/taskform/popup/FormDisplayPopupViewImpl.html already added, skipping

      org/jbpm/console/ng/ht/client/editors/taskform/popup/FormDisplayPopupPresenter.java already added, skipping

      org/jbpm/console/ng/ht/client/editors/taskform/popup/FormDisplayPopupViewImpl.java already added, skipping

      org/jbpm/console/ng/ht/client/editors/taskform/FormDisplayPresenter.java already added, skipping

      org/jbpm/console/ng/ht/client/editors/taskform/FormDisplayViewImpl.java already added, skipping

      org/jbpm/console/ng/ht/client/editors/taskform/FormDisplayViewImpl.html already added, skipping

      org/jbpm/console/ng/ht/client/editors/quicknewgroup/QuickNewGroupViewImpl.html already added, skipping

      org/jbpm/console/ng/ht/client/editors/quicknewgroup/QuickNewGroupPresenter.java already added, skipping

      org/jbpm/console/ng/ht/client/editors/quicknewgroup/QuickNewGroupViewImpl.java already added, skipping

      org/jbpm/console/ng/ht/client/editors/quicknewtask/QuickNewTaskViewImpl.html already added, skipping

      org/jbpm/console/ng/ht/client/editors/quicknewtask/QuickNewTaskPresenter.java already added, skipping

      org/jbpm/console/ng/ht/client/editors/quicknewtask/QuickNewTaskViewImpl.java already added, skipping

      org/jbpm/console/ng/ht/client/editors/quicknewuser/QuickNewUserViewImpl.html already added, skipping

      org/jbpm/console/ng/ht/client/editors/quicknewuser/QuickNewUserPresenter.java already added, skipping

      org/jbpm/console/ng/ht/client/editors/quicknewuser/QuickNewUserViewImpl.java already added, skipping

      org/jbpm/console/ng/ht/client/editors/taskcomments/popup/TaskCommentsPopupViewImpl.java already added, skipping

      org/jbpm/console/ng/ht/client/editors/taskcomments/popup/TaskCommentsPopupViewImpl.html already added, skipping

      org/jbpm/console/ng/ht/client/editors/taskcomments/popup/TaskCommentsPopupPresenter.java already added, skipping

      org/jbpm/console/ng/ht/client/editors/taskcomments/TaskCommentsViewImpl.java already added, skipping

      org/jbpm/console/ng/ht/client/editors/taskcomments/TaskCommentsViewImpl.html already added, skipping

      org/jbpm/console/ng/ht/client/editors/taskcomments/TaskCommentsPresenter.java already added, skipping

      org/jbpm/console/ng/ht/client/editors/taskdetailsmulti/TaskDetailsMultiViewImpl.java already added, skipping

      org/jbpm/console/ng/ht/client/editors/taskdetailsmulti/TaskDetailsMultiViewImpl.html already added, skipping

      org/jbpm/console/ng/ht/client/editors/taskdetailsmulti/TaskDetailsMultiPresenter.java already added, skipping

      org/jbpm/console/ng/ht/client/editors/quicknewtyperole/QuickNewTypeRoleViewImpl.java already added, skipping

      org/jbpm/console/ng/ht/client/editors/quicknewtyperole/QuickNewTypeRoleViewImpl.html already added, skipping

      org/jbpm/console/ng/ht/client/editors/quicknewtyperole/QuickNewTypeRolePresenter.java already added, skipping

      org/jbpm/console/ng/ht/client/editors/taskslist/TasksListViewImpl.html already added, skipping

      org/jbpm/console/ng/ht/client/editors/taskslist/TaskBox.java already added, skipping

      org/jbpm/console/ng/ht/client/editors/taskslist/TasksListPresenter.java already added, skipping

      org/jbpm/console/ng/ht/client/editors/taskslist/TaskListMultiDayBox.java already added, skipping

      org/jbpm/console/ng/ht/client/editors/taskslist/TasksListViewImpl.java already added, skipping

      org/jbpm/console/ng/ht/client/editors/taskslist/TaskListDayBox.java already added, skipping

      org/jbpm/console/ng/ht/client/editors/taskassignments/TaskAssignmentsViewImpl.java already added, skipping

      org/jbpm/console/ng/ht/client/editors/taskassignments/popup/TaskAssignmentsPopupViewImpl.html already added, skipping

      org/jbpm/console/ng/ht/client/editors/taskassignments/popup/TaskAssignmentsPopupViewImpl.java already added, skipping

      org/jbpm/console/ng/ht/client/editors/taskassignments/popup/TaskAssignmentsPopupPresenter.java already added, skipping

      org/jbpm/console/ng/ht/client/editors/taskassignments/TaskAssignmentsPresenter.java already added, skipping

      org/jbpm/console/ng/ht/client/editors/taskassignments/TaskAssignmentsViewImpl.html already added, skipping

      org/jbpm/console/ng/ht/client/editors/taskdetails/popup/TaskDetailsPopupPresenter.java already added, skipping

      org/jbpm/console/ng/ht/client/editors/taskdetails/popup/TaskDetailsPopupViewImpl.html already added, skipping

      org/jbpm/console/ng/ht/client/editors/taskdetails/popup/TaskDetailsPopupViewImpl.java already added, skipping

      org/jbpm/console/ng/ht/client/editors/taskdetails/TaskDetailsViewImpl.html already added, skipping

      org/jbpm/console/ng/ht/client/editors/taskdetails/TaskDetailsPresenter.java already added, skipping

      org/jbpm/console/ng/ht/client/editors/taskdetails/TaskDetailsViewImpl.java already added, skipping

      org/jbpm/console/ng/ht/client/editors/identity/IdentityListViewImpl.java already added, skipping

      org/jbpm/console/ng/ht/client/editors/identity/IdentityListViewImpl.html already added, skipping

      org/jbpm/console/ng/ht/client/editors/identity/IdentityListPresenter.java already added, skipping

      org/jbpm/console/ng/ht/client/util/UTCDateBoxImpl.java already added, skipping

      org/jbpm/console/ng/ht/client/util/UTCTimeBoxImplHtml4.java already added, skipping

      org/jbpm/console/ng/ht/client/util/UTCTimeBoxImpl.java already added, skipping

      org/jbpm/console/ng/ht/client/util/UTCDateBoxImplHtml4.java already added, skipping

      org/jbpm/console/ng/ht/client/util/UTCTimeBoxImplHtml5.java already added, skipping

      org/jbpm/console/ng/ht/client/util/InputWidget.java already added, skipping

      org/jbpm/console/ng/ht/client/util/UTCTimeBoxImplShared.java already added, skipping

      org/jbpm/console/ng/ht/client/util/DateRange.java already added, skipping

      org/jbpm/console/ng/ht/client/util/DataGridUtils.java already added, skipping

      org/jbpm/console/ng/ht/client/util/UTCDateBox.java already added, skipping

      org/jbpm/console/ng/ht/client/util/UTCTimeBox.java already added, skipping

      org/jbpm/console/ng/ht/client/util/LiCalendarPicker.java already added, skipping

      org/jbpm/console/ng/ht/client/util/DomUtils.java already added, skipping

      org/jbpm/console/ng/ht/client/util/UTCDateBoxImplShared.java already added, skipping

      org/jbpm/console/ng/ht/client/util/CalendarPicker.java already added, skipping

      org/jbpm/console/ng/ht/client/util/DateUtils.java already added, skipping

      org/jbpm/console/ng/ht/client/util/UTCDateBoxImplHtml5.java already added, skipping

      org/jbpm/console/ng/ht/client/util/ResizableHeader.java already added, skipping

      org already added, skipping

      org/jbpm already added, skipping

      org/jbpm/console already added, skipping

      org/jbpm/console/ng already added, skipping

      org/jbpm/console/ng/ht already added, skipping

      org/jbpm/console/ng/ht/client already added, skipping

      org/jbpm/console/ng/ht/client/i18n already added, skipping

      Building jar: /home/mohebbi/projects/jbpm-console-ng-master/jbpm-console-ng-human-tasks/jbpm-console-ng-human-tasks-client/target/jbpm-console-ng-human-tasks-client-6.1.0-SNAPSHOT-sources.jar

      org already added, skipping

      org/jbpm already added, skipping

      org/jbpm/console already added, skipping

      org/jbpm/console/ng already added, skipping

      org/jbpm/console/ng/ht already added, skipping

      org/jbpm/console/ng/ht/client already added, skipping

      org/jbpm/console/ng/ht/client/resources already added, skipping

      org/jbpm/console/ng/ht/client/i18n already added, skipping

      org/jbpm/console/ng/ht/client/perspectives already added, skipping

      org/jbpm/console/ng/ht/client/editors already added, skipping

      org/jbpm/console/ng/ht/client/editors/taskform already added, skipping

      org/jbpm/console/ng/ht/client/editors/taskform/popup already added, skipping

      org/jbpm/console/ng/ht/client/editors/quicknewgroup already added, skipping

      org/jbpm/console/ng/ht/client/editors/quicknewtask already added, skipping

      org/jbpm/console/ng/ht/client/editors/quicknewuser already added, skipping

      org/jbpm/console/ng/ht/client/editors/taskcomments already added, skipping

      org/jbpm/console/ng/ht/client/editors/taskcomments/popup already added, skipping

      org/jbpm/console/ng/ht/client/editors/taskdetailsmulti already added, skipping

      org/jbpm/console/ng/ht/client/editors/quicknewtyperole already added, skipping

      org/jbpm/console/ng/ht/client/editors/taskslist already added, skipping

      org/jbpm/console/ng/ht/client/editors/taskassignments already added, skipping

      org/jbpm/console/ng/ht/client/editors/taskassignments/popup already added, skipping

      org/jbpm/console/ng/ht/client/editors/taskdetails already added, skipping

      org/jbpm/console/ng/ht/client/editors/taskdetails/popup already added, skipping

      org/jbpm/console/ng/ht/client/editors/identity already added, skipping

      org/jbpm/console/ng/ht/client/util already added, skipping

      org/jbpm/console/ng/ht/client/resources/HumanTasksImages.java already added, skipping

      org/jbpm/console/ng/ht/client/resources/HumanTasksResources.java already added, skipping

      org/jbpm/console/ng/ht/client/i18n/Constants.java already added, skipping

      org/jbpm/console/ng/ht/client/perspectives/TasksListWithDetailsPerspective.java already added, skipping

      org/jbpm/console/ng/ht/client/perspectives/TasksListPerspective.java already added, skipping

      org/jbpm/console/ng/ht/client/perspectives/IdentityPerspective.java already added, skipping

      org/jbpm/console/ng/ht/client/editors/taskform/popup/FormDisplayPopupViewImpl.html already added, skipping

      org/jbpm/console/ng/ht/client/editors/taskform/popup/FormDisplayPopupPresenter.java already added, skipping

      org/jbpm/console/ng/ht/client/editors/taskform/popup/FormDisplayPopupViewImpl.java already added, skipping

      org/jbpm/console/ng/ht/client/editors/taskform/FormDisplayPresenter.java already added, skipping

      org/jbpm/console/ng/ht/client/editors/taskform/FormDisplayViewImpl.java already added, skipping

      org/jbpm/console/ng/ht/client/editors/taskform/FormDisplayViewImpl.html already added, skipping

      org/jbpm/console/ng/ht/client/editors/quicknewgroup/QuickNewGroupViewImpl.html already added, skipping

      org/jbpm/console/ng/ht/client/editors/quicknewgroup/QuickNewGroupPresenter.java already added, skipping

      org/jbpm/console/ng/ht/client/editors/quicknewgroup/QuickNewGroupViewImpl.java already added, skipping

      org/jbpm/console/ng/ht/client/editors/quicknewtask/QuickNewTaskViewImpl.html already added, skipping

      org/jbpm/console/ng/ht/client/editors/quicknewtask/QuickNewTaskPresenter.java already added, skipping

      org/jbpm/console/ng/ht/client/editors/quicknewtask/QuickNewTaskViewImpl.java already added, skipping

      org/jbpm/console/ng/ht/client/editors/quicknewuser/QuickNewUserViewImpl.html already added, skipping

      org/jbpm/console/ng/ht/client/editors/quicknewuser/QuickNewUserPresenter.java already added, skipping

      org/jbpm/console/ng/ht/client/editors/quicknewuser/QuickNewUserViewImpl.java already added, skipping

      org/jbpm/console/ng/ht/client/editors/taskcomments/popup/TaskCommentsPopupViewImpl.java already added, skipping

      org/jbpm/console/ng/ht/client/editors/taskcomments/popup/TaskCommentsPopupViewImpl.html already added, skipping

      org/jbpm/console/ng/ht/client/editors/taskcomments/popup/TaskCommentsPopupPresenter.java already added, skipping

      org/jbpm/console/ng/ht/client/editors/taskcomments/TaskCommentsViewImpl.java already added, skipping

      org/jbpm/console/ng/ht/client/editors/taskcomments/TaskCommentsViewImpl.html already added, skipping

      org/jbpm/console/ng/ht/client/editors/taskcomments/TaskCommentsPresenter.java already added, skipping

      org/jbpm/console/ng/ht/client/editors/taskdetailsmulti/TaskDetailsMultiViewImpl.java already added, skipping

      org/jbpm/console/ng/ht/client/editors/taskdetailsmulti/TaskDetailsMultiViewImpl.html already added, skipping

      org/jbpm/console/ng/ht/client/editors/taskdetailsmulti/TaskDetailsMultiPresenter.java already added, skipping

      org/jbpm/console/ng/ht/client/editors/quicknewtyperole/QuickNewTypeRoleViewImpl.java already added, skipping

      org/jbpm/console/ng/ht/client/editors/quicknewtyperole/QuickNewTypeRoleViewImpl.html already added, skipping

      org/jbpm/console/ng/ht/client/editors/quicknewtyperole/QuickNewTypeRolePresenter.java already added, skipping

      org/jbpm/console/ng/ht/client/editors/taskslist/TasksListViewImpl.html already added, skipping

      org/jbpm/console/ng/ht/client/editors/taskslist/TaskBox.java already added, skipping

      org/jbpm/console/ng/ht/client/editors/taskslist/TasksListPresenter.java already added, skipping

      org/jbpm/console/ng/ht/client/editors/taskslist/TaskListMultiDayBox.java already added, skipping

      org/jbpm/console/ng/ht/client/editors/taskslist/TasksListViewImpl.java already added, skipping

      org/jbpm/console/ng/ht/client/editors/taskslist/TaskListDayBox.java already added, skipping

      org/jbpm/console/ng/ht/client/editors/taskassignments/TaskAssignmentsViewImpl.java already added, skipping

      org/jbpm/console/ng/ht/client/editors/taskassignments/popup/TaskAssignmentsPopupViewImpl.html already added, skipping

      org/jbpm/console/ng/ht/client/editors/taskassignments/popup/TaskAssignmentsPopupViewImpl.java already added, skipping

      org/jbpm/console/ng/ht/client/editors/taskassignments/popup/TaskAssignmentsPopupPresenter.java already added, skipping

      org/jbpm/console/ng/ht/client/editors/taskassignments/TaskAssignmentsPresenter.java already added, skipping

      org/jbpm/console/ng/ht/client/editors/taskassignments/TaskAssignmentsViewImpl.html already added, skipping

      org/jbpm/console/ng/ht/client/editors/taskdetails/popup/TaskDetailsPopupPresenter.java already added, skipping

      org/jbpm/console/ng/ht/client/editors/taskdetails/popup/TaskDetailsPopupViewImpl.html already added, skipping

      org/jbpm/console/ng/ht/client/editors/taskdetails/popup/TaskDetailsPopupViewImpl.java already added, skipping

      org/jbpm/console/ng/ht/client/editors/taskdetails/TaskDetailsViewImpl.html already added, skipping

      org/jbpm/console/ng/ht/client/editors/taskdetails/TaskDetailsPresenter.java already added, skipping

      org/jbpm/console/ng/ht/client/editors/taskdetails/TaskDetailsViewImpl.java already added, skipping

      org/jbpm/console/ng/ht/client/editors/identity/IdentityListViewImpl.java already added, skipping

      org/jbpm/console/ng/ht/client/editors/identity/IdentityListViewImpl.html already added, skipping

      org/jbpm/console/ng/ht/client/editors/identity/IdentityListPresenter.java already added, skipping

      org/jbpm/console/ng/ht/client/util/UTCDateBoxImpl.java already added, skipping

      org/jbpm/console/ng/ht/client/util/UTCTimeBoxImplHtml4.java already added, skipping

      org/jbpm/console/ng/ht/client/util/UTCTimeBoxImpl.java already added, skipping

      org/jbpm/console/ng/ht/client/util/UTCDateBoxImplHtml4.java already added, skipping

      org/jbpm/console/ng/ht/client/util/UTCTimeBoxImplHtml5.java already added, skipping

      org/jbpm/console/ng/ht/client/util/InputWidget.java already added, skipping

      org/jbpm/console/ng/ht/client/util/UTCTimeBoxImplShared.java already added, skipping

      org/jbpm/console/ng/ht/client/util/DateRange.java already added, skipping

      org/jbpm/console/ng/ht/client/util/DataGridUtils.java already added, skipping

      org/jbpm/console/ng/ht/client/util/UTCDateBox.java already added, skipping

      org/jbpm/console/ng/ht/client/util/UTCTimeBox.java already added, skipping

      org/jbpm/console/ng/ht/client/util/LiCalendarPicker.java already added, skipping

      org/jbpm/console/ng/ht/client/util/DomUtils.java already added, skipping

      org/jbpm/console/ng/ht/client/util/UTCDateBoxImplShared.java already added, skipping

      org/jbpm/console/ng/ht/client/util/CalendarPicker.java already added, skipping

      org/jbpm/console/ng/ht/client/util/DateUtils.java already added, skipping

      org/jbpm/console/ng/ht/client/util/UTCDateBoxImplHtml5.java already added, skipping

      org/jbpm/console/ng/ht/client/util/ResizableHeader.java already added, skipping

      org already added, skipping

      org/jbpm already added, skipping

      org/jbpm/console already added, skipping

      org/jbpm/console/ng already added, skipping

      org/jbpm/console/ng/ht already added, skipping

      org/jbpm/console/ng/ht/client already added, skipping

      org/jbpm/console/ng/ht/client/i18n already added, skipping

       

      >>> maven-source-plugin:2.1.2:test-jar (test-jar) @ jbpm-console-ng-human-tasks-client >>>

       

      [enforcer:enforce]

       

      [enforcer:enforce]

       

      [enforcer:enforce]

       

      [build-helper:parse-version]

       

      [buildnumber:create-timestamp]

       

      [buildnumber:create]

       

      <<< maven-source-plugin:2.1.2:test-jar (test-jar) @ jbpm-console-ng-human-tasks-client <<<

       

      [source:test-jar]

      Building jar: /home/mohebbi/projects/jbpm-console-ng-master/jbpm-console-ng-human-tasks/jbpm-console-ng-human-tasks-client/target/jbpm-console-ng-human-tasks-client-6.1.0-SNAPSHOT-test-sources.jar

       

      [source:jar-no-fork]

      org already added, skipping

      org/jbpm already added, skipping

      org/jbpm/console already added, skipping

      org/jbpm/console/ng already added, skipping

      org/jbpm/console/ng/ht already added, skipping

      org/jbpm/console/ng/ht/client already added, skipping

      org/jbpm/console/ng/ht/client/resources already added, skipping

      org/jbpm/console/ng/ht/client/i18n already added, skipping

      org/jbpm/console/ng/ht/client/perspectives already added, skipping

      org/jbpm/console/ng/ht/client/editors already added, skipping

      org/jbpm/console/ng/ht/client/editors/taskform already added, skipping

      org/jbpm/console/ng/ht/client/editors/taskform/popup already added, skipping

      org/jbpm/console/ng/ht/client/editors/quicknewgroup already added, skipping

      org/jbpm/console/ng/ht/client/editors/quicknewtask already added, skipping

      org/jbpm/console/ng/ht/client/editors/quicknewuser already added, skipping

      org/jbpm/console/ng/ht/client/editors/taskcomments already added, skipping

      org/jbpm/console/ng/ht/client/editors/taskcomments/popup already added, skipping

      org/jbpm/console/ng/ht/client/editors/taskdetailsmulti already added, skipping

      org/jbpm/console/ng/ht/client/editors/quicknewtyperole already added, skipping

      org/jbpm/console/ng/ht/client/editors/taskslist already added, skipping

      org/jbpm/console/ng/ht/client/editors/taskassignments already added, skipping

      org/jbpm/console/ng/ht/client/editors/taskassignments/popup already added, skipping

      org/jbpm/console/ng/ht/client/editors/taskdetails already added, skipping

      org/jbpm/console/ng/ht/client/editors/taskdetails/popup already added, skipping

      org/jbpm/console/ng/ht/client/editors/identity already added, skipping

      org/jbpm/console/ng/ht/client/util already added, skipping

      org/jbpm/console/ng/ht/client/resources/HumanTasksImages.java already added, skipping

      org/jbpm/console/ng/ht/client/resources/HumanTasksResources.java already added, skipping

      org/jbpm/console/ng/ht/client/i18n/Constants.java already added, skipping

      org/jbpm/console/ng/ht/client/perspectives/TasksListWithDetailsPerspective.java already added, skipping

      org/jbpm/console/ng/ht/client/perspectives/TasksListPerspective.java already added, skipping

      org/jbpm/console/ng/ht/client/perspectives/IdentityPerspective.java already added, skipping

      org/jbpm/console/ng/ht/client/editors/taskform/popup/FormDisplayPopupViewImpl.html already added, skipping

      org/jbpm/console/ng/ht/client/editors/taskform/popup/FormDisplayPopupPresenter.java already added, skipping

      org/jbpm/console/ng/ht/client/editors/taskform/popup/FormDisplayPopupViewImpl.java already added, skipping

      org/jbpm/console/ng/ht/client/editors/taskform/FormDisplayPresenter.java already added, skipping

      org/jbpm/console/ng/ht/client/editors/taskform/FormDisplayViewImpl.java already added, skipping

      org/jbpm/console/ng/ht/client/editors/taskform/FormDisplayViewImpl.html already added, skipping

      org/jbpm/console/ng/ht/client/editors/quicknewgroup/QuickNewGroupViewImpl.html already added, skipping

      org/jbpm/console/ng/ht/client/editors/quicknewgroup/QuickNewGroupPresenter.java already added, skipping

      org/jbpm/console/ng/ht/client/editors/quicknewgroup/QuickNewGroupViewImpl.java already added, skipping

      org/jbpm/console/ng/ht/client/editors/quicknewtask/QuickNewTaskViewImpl.html already added, skipping

      org/jbpm/console/ng/ht/client/editors/quicknewtask/QuickNewTaskPresenter.java already added, skipping

      org/jbpm/console/ng/ht/client/editors/quicknewtask/QuickNewTaskViewImpl.java already added, skipping

      org/jbpm/console/ng/ht/client/editors/quicknewuser/QuickNewUserViewImpl.html already added, skipping

      org/jbpm/console/ng/ht/client/editors/quicknewuser/QuickNewUserPresenter.java already added, skipping

      org/jbpm/console/ng/ht/client/editors/quicknewuser/QuickNewUserViewImpl.java already added, skipping

      org/jbpm/console/ng/ht/client/editors/taskcomments/popup/TaskCommentsPopupViewImpl.java already added, skipping

      org/jbpm/console/ng/ht/client/editors/taskcomments/popup/TaskCommentsPopupViewImpl.html already added, skipping

      org/jbpm/console/ng/ht/client/editors/taskcomments/popup/TaskCommentsPopupPresenter.java already added, skipping

      org/jbpm/console/ng/ht/client/editors/taskcomments/TaskCommentsViewImpl.java already added, skipping

      org/jbpm/console/ng/ht/client/editors/taskcomments/TaskCommentsViewImpl.html already added, skipping

      org/jbpm/console/ng/ht/client/editors/taskcomments/TaskCommentsPresenter.java already added, skipping

      org/jbpm/console/ng/ht/client/editors/taskdetailsmulti/TaskDetailsMultiViewImpl.java already added, skipping

      org/jbpm/console/ng/ht/client/editors/taskdetailsmulti/TaskDetailsMultiViewImpl.html already added, skipping

      org/jbpm/console/ng/ht/client/editors/taskdetailsmulti/TaskDetailsMultiPresenter.java already added, skipping

      org/jbpm/console/ng/ht/client/editors/quicknewtyperole/QuickNewTypeRoleViewImpl.java already added, skipping

      org/jbpm/console/ng/ht/client/editors/quicknewtyperole/QuickNewTypeRoleViewImpl.html already added, skipping

      org/jbpm/console/ng/ht/client/editors/quicknewtyperole/QuickNewTypeRolePresenter.java already added, skipping

      org/jbpm/console/ng/ht/client/editors/taskslist/TasksListViewImpl.html already added, skipping

      org/jbpm/console/ng/ht/client/editors/taskslist/TaskBox.java already added, skipping

      org/jbpm/console/ng/ht/client/editors/taskslist/TasksListPresenter.java already added, skipping

      org/jbpm/console/ng/ht/client/editors/taskslist/TaskListMultiDayBox.java already added, skipping

      org/jbpm/console/ng/ht/client/editors/taskslist/TasksListViewImpl.java already added, skipping

      org/jbpm/console/ng/ht/client/editors/taskslist/TaskListDayBox.java already added, skipping

      org/jbpm/console/ng/ht/client/editors/taskassignments/TaskAssignmentsViewImpl.java already added, skipping

      org/jbpm/console/ng/ht/client/editors/taskassignments/popup/TaskAssignmentsPopupViewImpl.html already added, skipping

      org/jbpm/console/ng/ht/client/editors/taskassignments/popup/TaskAssignmentsPopupViewImpl.java already added, skipping

      org/jbpm/console/ng/ht/client/editors/taskassignments/popup/TaskAssignmentsPopupPresenter.java already added, skipping

      org/jbpm/console/ng/ht/client/editors/taskassignments/TaskAssignmentsPresenter.java already added, skipping

      org/jbpm/console/ng/ht/client/editors/taskassignments/TaskAssignmentsViewImpl.html already added, skipping

      org/jbpm/console/ng/ht/client/editors/taskdetails/popup/TaskDetailsPopupPresenter.java already added, skipping

      org/jbpm/console/ng/ht/client/editors/taskdetails/popup/TaskDetailsPopupViewImpl.html already added, skipping

      org/jbpm/console/ng/ht/client/editors/taskdetails/popup/TaskDetailsPopupViewImpl.java already added, skipping

      org/jbpm/console/ng/ht/client/editors/taskdetails/TaskDetailsViewImpl.html already added, skipping

      org/jbpm/console/ng/ht/client/editors/taskdetails/TaskDetailsPresenter.java already added, skipping

      org/jbpm/console/ng/ht/client/editors/taskdetails/TaskDetailsViewImpl.java already added, skipping

      org/jbpm/console/ng/ht/client/editors/identity/IdentityListViewImpl.java already added, skipping

      org/jbpm/console/ng/ht/client/editors/identity/IdentityListViewImpl.html already added, skipping

      org/jbpm/console/ng/ht/client/editors/identity/IdentityListPresenter.java already added, skipping

      org/jbpm/console/ng/ht/client/util/UTCDateBoxImpl.java already added, skipping

      org/jbpm/console/ng/ht/client/util/UTCTimeBoxImplHtml4.java already added, skipping

      org/jbpm/console/ng/ht/client/util/UTCTimeBoxImpl.java already added, skipping

      org/jbpm/console/ng/ht/client/util/UTCDateBoxImplHtml4.java already added, skipping

      org/jbpm/console/ng/ht/client/util/UTCTimeBoxImplHtml5.java already added, skipping

      org/jbpm/console/ng/ht/client/util/InputWidget.java already added, skipping

      org/jbpm/console/ng/ht/client/util/UTCTimeBoxImplShared.java already added, skipping

      org/jbpm/console/ng/ht/client/util/DateRange.java already added, skipping

      org/jbpm/console/ng/ht/client/util/DataGridUtils.java already added, skipping

      org/jbpm/console/ng/ht/client/util/UTCDateBox.java already added, skipping

      org/jbpm/console/ng/ht/client/util/UTCTimeBox.java already added, skipping

      org/jbpm/console/ng/ht/client/util/LiCalendarPicker.java already added, skipping

      org/jbpm/console/ng/ht/client/util/DomUtils.java already added, skipping

      org/jbpm/console/ng/ht/client/util/UTCDateBoxImplShared.java already added, skipping

      org/jbpm/console/ng/ht/client/util/CalendarPicker.java already added, skipping

      org/jbpm/console/ng/ht/client/util/DateUtils.java already added, skipping

      org/jbpm/console/ng/ht/client/util/UTCDateBoxImplHtml5.java already added, skipping

      org/jbpm/console/ng/ht/client/util/ResizableHeader.java already added, skipping

      org already added, skipping

      org/jbpm already added, skipping

      org/jbpm/console already added, skipping

      org/jbpm/console/ng already added, skipping

      org/jbpm/console/ng/ht already added, skipping

      org/jbpm/console/ng/ht/client already added, skipping

      org/jbpm/console/ng/ht/client/i18n already added, skipping

      Artifact org.jbpm:jbpm-console-ng-human-tasks-client:java-source:sources:6.1.0-SNAPSHOT already attached to project, ignoring duplicate

       

      [failsafe:integration-test]

       

      [install:install]

      Installing /home/mohebbi/projects/jbpm-console-ng-master/jbpm-console-ng-human-tasks/jbpm-console-ng-human-tasks-client/target/jbpm-console-ng-human-tasks-client-6.1.0-SNAPSHOT.jar to /home/mohebbi/.m2/repository/org/jbpm/jbpm-console-ng-human-tasks-client/6.1.0-SNAPSHOT/jbpm-console-ng-human-tasks-client-6.1.0-SNAPSHOT.jar

      Installing /home/mohebbi/projects/jbpm-console-ng-master/jbpm-console-ng-human-tasks/jbpm-console-ng-human-tasks-client/pom.xml to /home/mohebbi/.m2/repository/org/jbpm/jbpm-console-ng-human-tasks-client/6.1.0-SNAPSHOT/jbpm-console-ng-human-tasks-client-6.1.0-SNAPSHOT.pom

      Installing /home/mohebbi/projects/jbpm-console-ng-master/jbpm-console-ng-human-tasks/jbpm-console-ng-human-tasks-client/target/jbpm-console-ng-human-tasks-client-6.1.0-SNAPSHOT-tests.jar to /home/mohebbi/.m2/repository/org/jbpm/jbpm-console-ng-human-tasks-client/6.1.0-SNAPSHOT/jbpm-console-ng-human-tasks-client-6.1.0-SNAPSHOT-tests.jar

      Installing /home/mohebbi/projects/jbpm-console-ng-master/jbpm-console-ng-human-tasks/jbpm-console-ng-human-tasks-client/target/jbpm-console-ng-human-tasks-client-6.1.0-SNAPSHOT-sources.jar to /home/mohebbi/.m2/repository/org/jbpm/jbpm-console-ng-human-tasks-client/6.1.0-SNAPSHOT/jbpm-console-ng-human-tasks-client-6.1.0-SNAPSHOT-sources.jar

      Installing /home/mohebbi/projects/jbpm-console-ng-master/jbpm-console-ng-human-tasks/jbpm-console-ng-human-tasks-client/target/jbpm-console-ng-human-tasks-client-6.1.0-SNAPSHOT-test-sources.jar to /home/mohebbi/.m2/repository/org/jbpm/jbpm-console-ng-human-tasks-client/6.1.0-SNAPSHOT/jbpm-console-ng-human-tasks-client-6.1.0-SNAPSHOT-test-sources.jar

                                                                             

      ------------------------------------------------------------------------

      Building jBPM Console NG - Human Tasks Backend 6.1.0-SNAPSHOT

      ------------------------------------------------------------------------

       

      [clean:clean]

      Deleting /home/mohebbi/projects/jbpm-console-ng-master/jbpm-console-ng-human-tasks/jbpm-console-ng-human-tasks-backend/target

      Deleting /home/mohebbi/projects/jbpm-console-ng-master/jbpm-console-ng-human-tasks/jbpm-console-ng-human-tasks-backend (includes = [.errai/**, .niogit/**], excludes = [])

       

      [enforcer:enforce]

       

      [enforcer:enforce]

       

      [enforcer:enforce]

       

      [build-helper:parse-version]

       

      [buildnumber:create-timestamp]

       

      [buildnumber:create]

       

      [resources:resources]

      Using 'UTF-8' encoding to copy filtered resources.

      Copying 2 resources

       

      [compiler:compile]

      Compiling 13 source files to /home/mohebbi/projects/jbpm-console-ng-master/jbpm-console-ng-human-tasks/jbpm-console-ng-human-tasks-backend/target/classes

       

      [resources:testResources]

      Using 'UTF-8' encoding to copy filtered resources.

      Copying 7 resources

       

      [compiler:testCompile]

      Compiling 5 source files to /home/mohebbi/projects/jbpm-console-ng-master/jbpm-console-ng-human-tasks/jbpm-console-ng-human-tasks-backend/target/test-classes

       

      [surefire:test]

      Surefire report directory: /home/mohebbi/projects/jbpm-console-ng-master/jbpm-console-ng-human-tasks/jbpm-console-ng-human-tasks-backend/target/surefire-reports

       

      -------------------------------------------------------

      T E S T S

      -------------------------------------------------------

      Running org.jbpm.console.ng.ht.backend.server.TaskServiceEntryPointLocalTest

      Dec 29, 2013 12:21:44 PM org.jboss.weld.util.ServiceLoader loadClass

      WARNING: Could not load service class org.uberfire.security.server.cdi.SecurityExtension

      0    [main] WARN  org.jboss.solder.config.xml.model.ModelBuilder  - Solder Config could not resolve XML namspace for: {}

      6327 [main] WARN  org.hibernate.service.jta.platform.internal.JtaPlatformInitiator  - HHH000427: Using deprecated org.hibernate.transaction.TransactionManagerLookup strategy [hibernate.transaction.manager_lookup_class], use newer org.hibernate.service.jta.platform.spi.JtaPlatform strategy instead [hibernate.transaction.jta.platform]

      7338 [main] ERROR org.hibernate.tool.hbm2ddl.SchemaExport  - HHH000389: Unsuccessful: alter table Attachment drop constraint FK_7ndpfa311i50bq7hy18q05va3

      7338 [main] ERROR org.hibernate.tool.hbm2ddl.SchemaExport  - Table "ATTACHMENT" not found; SQL statement:

      alter table Attachment drop constraint FK_7ndpfa311i50bq7hy18q05va3 [42102-168]

      7346 [main] ERROR org.hibernate.tool.hbm2ddl.SchemaExport  - HHH000389: Unsuccessful: alter table Attachment drop constraint FK_hqupx569krp0f0sgu9kh87513

      7346 [main] ERROR org.hibernate.tool.hbm2ddl.SchemaExport  - Table "ATTACHMENT" not found; SQL statement:

      alter table Attachment drop constraint FK_hqupx569krp0f0sgu9kh87513 [42102-168]

      7346 [main] ERROR org.hibernate.tool.hbm2ddl.SchemaExport  - HHH000389: Unsuccessful: alter table BooleanExpression drop constraint FK_394nf2qoc0k9ok6omgd6jtpso

      7346 [main] ERROR org.hibernate.tool.hbm2ddl.SchemaExport  - Table "BOOLEANEXPRESSION" not found; SQL statement:

      alter table BooleanExpression drop constraint FK_394nf2qoc0k9ok6omgd6jtpso [42102-168]

      7347 [main] ERROR org.hibernate.tool.hbm2ddl.SchemaExport  - HHH000389: Unsuccessful: alter table Deadline drop constraint FK_68w742sge00vco2cq3jhbvmgx

      7347 [main] ERROR org.hibernate.tool.hbm2ddl.SchemaExport  - Table "DEADLINE" not found; SQL statement:

      alter table Deadline drop constraint FK_68w742sge00vco2cq3jhbvmgx [42102-168]

      7347 [main] ERROR org.hibernate.tool.hbm2ddl.SchemaExport  - HHH000389: Unsuccessful: alter table Deadline drop constraint FK_euoohoelbqvv94d8a8rcg8s5n

      7347 [main] ERROR org.hibernate.tool.hbm2ddl.SchemaExport  - Table "DEADLINE" not found; SQL statement:

      alter table Deadline drop constraint FK_euoohoelbqvv94d8a8rcg8s5n [42102-168]

      7348 [main] ERROR org.hibernate.tool.hbm2ddl.SchemaExport  - HHH000389: Unsuccessful: alter table Delegation_delegates drop constraint FK_gn7ula51sk55wj1o1m57guqxb

      7348 [main] ERROR org.hibernate.tool.hbm2ddl.SchemaExport  - Table "DELEGATION_DELEGATES" not found; SQL statement:

      alter table Delegation_delegates drop constraint FK_gn7ula51sk55wj1o1m57guqxb [42102-168]

      7349 [main] ERROR org.hibernate.tool.hbm2ddl.SchemaExport  - HHH000389: Unsuccessful: alter table Delegation_delegates drop constraint FK_fajq6kossbsqwr3opkrctxei3

      7349 [main] ERROR org.hibernate.tool.hbm2ddl.SchemaExport  - Table "DELEGATION_DELEGATES" not found; SQL statement:

      alter table Delegation_delegates drop constraint FK_fajq6kossbsqwr3opkrctxei3 [42102-168]

      7349 [main] ERROR org.hibernate.tool.hbm2ddl.SchemaExport  - HHH000389: Unsuccessful: alter table Escalation drop constraint FK_ay2gd4fvl9yaapviyxudwuvfg

      7349 [main] ERROR org.hibernate.tool.hbm2ddl.SchemaExport  - Table "ESCALATION" not found; SQL statement:

      alter table Escalation drop constraint FK_ay2gd4fvl9yaapviyxudwuvfg [42102-168]

      7350 [main] ERROR org.hibernate.tool.hbm2ddl.SchemaExport  - HHH000389: Unsuccessful: alter table I18NText drop constraint FK_k16jpgrh67ti9uedf6konsu1p

      7350 [main] ERROR org.hibernate.tool.hbm2ddl.SchemaExport  - Table "I18NTEXT" not found; SQL statement:

      alter table I18NText drop constraint FK_k16jpgrh67ti9uedf6konsu1p [42102-168]

      7350 [main] ERROR org.hibernate.tool.hbm2ddl.SchemaExport  - HHH000389: Unsuccessful: alter table I18NText drop constraint FK_fd9uk6hemv2dx1ojovo7ms3vp

      7350 [main] ERROR org.hibernate.tool.hbm2ddl.SchemaExport  - Table "I18NTEXT" not found; SQL statement:

      alter table I18NText drop constraint FK_fd9uk6hemv2dx1ojovo7ms3vp [42102-168]

      7351 [main] ERROR org.hibernate.tool.hbm2ddl.SchemaExport  - HHH000389: Unsuccessful: alter table I18NText drop constraint FK_4eyfp69ucrron2hr7qx4np2fp

      7351 [main] ERROR org.hibernate.tool.hbm2ddl.SchemaExport  - Table "I18NTEXT" not found; SQL statement:

      alter table I18NText drop constraint FK_4eyfp69ucrron2hr7qx4np2fp [42102-168]

      7352 [main] ERROR org.hibernate.tool.hbm2ddl.SchemaExport  - HHH000389: Unsuccessful: alter table I18NText drop constraint FK_pqarjvvnwfjpeyb87yd7m0bfi

      7355 [main] ERROR org.hibernate.tool.hbm2ddl.SchemaExport  - Table "I18NTEXT" not found; SQL statement:

      alter table I18NText drop constraint FK_pqarjvvnwfjpeyb87yd7m0bfi [42102-168]

      7355 [main] ERROR org.hibernate.tool.hbm2ddl.SchemaExport  - HHH000389: Unsuccessful: alter table I18NText drop constraint FK_o84rkh69r47ti8uv4eyj7bmo2

      7356 [main] ERROR org.hibernate.tool.hbm2ddl.SchemaExport  - Table "I18NTEXT" not found; SQL statement:

      alter table I18NText drop constraint FK_o84rkh69r47ti8uv4eyj7bmo2 [42102-168]

      7358 [main] ERROR org.hibernate.tool.hbm2ddl.SchemaExport  - HHH000389: Unsuccessful: alter table I18NText drop constraint FK_g1trxri8w64enudw2t1qahhk5

      7358 [main] ERROR org.hibernate.tool.hbm2ddl.SchemaExport  - Table "I18NTEXT" not found; SQL statement:

      alter table I18NText drop constraint FK_g1trxri8w64enudw2t1qahhk5 [42102-168]

      7359 [main] ERROR org.hibernate.tool.hbm2ddl.SchemaExport  - HHH000389: Unsuccessful: alter table I18NText drop constraint FK_qoce92c70adem3ccb3i7lec8x

      7359 [main] ERROR org.hibernate.tool.hbm2ddl.SchemaExport  - Table "I18NTEXT" not found; SQL statement:

      alter table I18NText drop constraint FK_qoce92c70adem3ccb3i7lec8x [42102-168]

      7360 [main] ERROR org.hibernate.tool.hbm2ddl.SchemaExport  - HHH000389: Unsuccessful: alter table I18NText drop constraint FK_bw8vmpekejxt1ei2ge26gdsry

      7360 [main] ERROR org.hibernate.tool.hbm2ddl.SchemaExport  - Table "I18NTEXT" not found; SQL statement:

      alter table I18NText drop constraint FK_bw8vmpekejxt1ei2ge26gdsry [42102-168]

      7361 [main] ERROR org.hibernate.tool.hbm2ddl.SchemaExport  - HHH000389: Unsuccessful: alter table I18NText drop constraint FK_21qvifarxsvuxeaw5sxwh473w

      7361 [main] ERROR org.hibernate.tool.hbm2ddl.SchemaExport  - Table "I18NTEXT" not found; SQL statement:

      alter table I18NText drop constraint FK_21qvifarxsvuxeaw5sxwh473w [42102-168]

      7362 [main] ERROR org.hibernate.tool.hbm2ddl.SchemaExport  - HHH000389: Unsuccessful: alter table Notification drop constraint FK_bdbeml3768go5im41cgfpyso9

      7362 [main] ERROR org.hibernate.tool.hbm2ddl.SchemaExport  - Table "NOTIFICATION" not found; SQL statement:

      alter table Notification drop constraint FK_bdbeml3768go5im41cgfpyso9 [42102-168]

      7362 [main] ERROR org.hibernate.tool.hbm2ddl.SchemaExport  - HHH000389: Unsuccessful: alter table Notification_BAs drop constraint FK_mfbsnbrhth4rjhqc2ud338s4i

      7362 [main] ERROR org.hibernate.tool.hbm2ddl.SchemaExport  - Table "NOTIFICATION_BAS" not found; SQL statement:

      alter table Notification_BAs drop constraint FK_mfbsnbrhth4rjhqc2ud338s4i [42102-168]

      7363 [main] ERROR org.hibernate.tool.hbm2ddl.SchemaExport  - HHH000389: Unsuccessful: alter table Notification_BAs drop constraint FK_fc0uuy76t2bvxaxqysoo8xts7

      7363 [main] ERROR org.hibernate.tool.hbm2ddl.SchemaExport  - Table "NOTIFICATION_BAS" not found; SQL statement:

      alter table Notification_BAs drop constraint FK_fc0uuy76t2bvxaxqysoo8xts7 [42102-168]

      7364 [main] ERROR org.hibernate.tool.hbm2ddl.SchemaExport  - HHH000389: Unsuccessful: alter table Notification_Recipients drop constraint FK_blf9jsrumtrthdaqnpwxt25eu

      7364 [main] ERROR org.hibernate.tool.hbm2ddl.SchemaExport  - Table "NOTIFICATION_RECIPIENTS" not found; SQL statement:

      alter table Notification_Recipients drop constraint FK_blf9jsrumtrthdaqnpwxt25eu [42102-168]

      7364 [main] ERROR org.hibernate.tool.hbm2ddl.SchemaExport  - HHH000389: Unsuccessful: alter table Notification_Recipients drop constraint FK_3l244pj8sh78vtn9imaymrg47

      7365 [main] ERROR org.hibernate.tool.hbm2ddl.SchemaExport  - Table "NOTIFICATION_RECIPIENTS" not found; SQL statement:

      alter table Notification_Recipients drop constraint FK_3l244pj8sh78vtn9imaymrg47 [42102-168]

      7365 [main] ERROR org.hibernate.tool.hbm2ddl.SchemaExport  - HHH000389: Unsuccessful: alter table Notification_email_header drop constraint FK_ptaka5kost68h7l3wflv7w6y8

      7366 [main] ERROR org.hibernate.tool.hbm2ddl.SchemaExport  - Table "NOTIFICATION_EMAIL_HEADER" not found; SQL statement:

      alter table Notification_email_header drop constraint FK_ptaka5kost68h7l3wflv7w6y8 [42102-168]

      7366 [main] ERROR org.hibernate.tool.hbm2ddl.SchemaExport  - HHH000389: Unsuccessful: alter table Notification_email_header drop constraint FK_eth4nvxn21fk1vnju85vkjrai

      7367 [main] ERROR org.hibernate.tool.hbm2ddl.SchemaExport  - Table "NOTIFICATION_EMAIL_HEADER" not found; SQL statement:

      alter table Notification_email_header drop constraint FK_eth4nvxn21fk1vnju85vkjrai [42102-168]

      7368 [main] ERROR org.hibernate.tool.hbm2ddl.SchemaExport  - HHH000389: Unsuccessful: alter table PeopleAssignments_BAs drop constraint FK_t38xbkrq6cppifnxequhvjsl2

      7368 [main] ERROR org.hibernate.tool.hbm2ddl.SchemaExport  - Table "PEOPLEASSIGNMENTS_BAS" not found; SQL statement:

      alter table PeopleAssignments_BAs drop constraint FK_t38xbkrq6cppifnxequhvjsl2 [42102-168]

      7370 [main] ERROR org.hibernate.tool.hbm2ddl.SchemaExport  - HHH000389: Unsuccessful: alter table PeopleAssignments_BAs drop constraint FK_omjg5qh7uv8e9bolbaq7hv6oh

      7370 [main] ERROR org.hibernate.tool.hbm2ddl.SchemaExport  - Table "PEOPLEASSIGNMENTS_BAS" not found; SQL statement:

      alter table PeopleAssignments_BAs drop constraint FK_omjg5qh7uv8e9bolbaq7hv6oh [42102-168]

      7371 [main] ERROR org.hibernate.tool.hbm2ddl.SchemaExport  - HHH000389: Unsuccessful: alter table PeopleAssignments_ExclOwners drop constraint FK_pth28a73rj6bxtlfc69kmqo0a

      7371 [main] ERROR org.hibernate.tool.hbm2ddl.SchemaExport  - Table "PEOPLEASSIGNMENTS_EXCLOWNERS" not found; SQL statement:

      alter table PeopleAssignments_ExclOwners drop constraint FK_pth28a73rj6bxtlfc69kmqo0a [42102-168]

      7378 [main] ERROR org.hibernate.tool.hbm2ddl.SchemaExport  - HHH000389: Unsuccessful: alter table PeopleAssignments_ExclOwners drop constraint FK_b8owuxfrdng050ugpk0pdowa7

      7385 [main] ERROR org.hibernate.tool.hbm2ddl.SchemaExport  - Table "PEOPLEASSIGNMENTS_EXCLOWNERS" not found; SQL statement:

      alter table PeopleAssignments_ExclOwners drop constraint FK_b8owuxfrdng050ugpk0pdowa7 [42102-168]

      7396 [main] ERROR org.hibernate.tool.hbm2ddl.SchemaExport  - HHH000389: Unsuccessful: alter table PeopleAssignments_PotOwners drop constraint FK_tee3ftir7xs6eo3fdvi3xw026

      7397 [main] ERROR org.hibernate.tool.hbm2ddl.SchemaExport  - Table "PEOPLEASSIGNMENTS_POTOWNERS" not found; SQL statement:

      alter table PeopleAssignments_PotOwners drop constraint FK_tee3ftir7xs6eo3fdvi3xw026 [42102-168]

      7398 [main] ERROR org.hibernate.tool.hbm2ddl.SchemaExport  - HHH000389: Unsuccessful: alter table PeopleAssignments_PotOwners drop constraint FK_4dv2oji7pr35ru0w45trix02x

      7398 [main] ERROR org.hibernate.tool.hbm2ddl.SchemaExport  - Table "PEOPLEASSIGNMENTS_POTOWNERS" not found; SQL statement:

      alter table PeopleAssignments_PotOwners drop constraint FK_4dv2oji7pr35ru0w45trix02x [42102-168]

      7399 [main] ERROR org.hibernate.tool.hbm2ddl.SchemaExport  - HHH000389: Unsuccessful: alter table PeopleAssignments_Recipients drop constraint FK_4g7y3wx6gnokf6vycgpxs83d6

      7400 [main] ERROR org.hibernate.tool.hbm2ddl.SchemaExport  - Table "PEOPLEASSIGNMENTS_RECIPIENTS" not found; SQL statement:

      alter table PeopleAssignments_Recipients drop constraint FK_4g7y3wx6gnokf6vycgpxs83d6 [42102-168]

      7401 [main] ERROR org.hibernate.tool.hbm2ddl.SchemaExport  - HHH000389: Unsuccessful: alter table PeopleAssignments_Recipients drop constraint FK_enhk831fghf6akjilfn58okl4

      7401 [main] ERROR org.hibernate.tool.hbm2ddl.SchemaExport  - Table "PEOPLEASSIGNMENTS_RECIPIENTS" not found; SQL statement:

      alter table PeopleAssignments_Recipients drop constraint FK_enhk831fghf6akjilfn58okl4 [42102-168]

      7402 [main] ERROR org.hibernate.tool.hbm2ddl.SchemaExport  - HHH000389: Unsuccessful: alter table PeopleAssignments_Stakeholders drop constraint FK_met63inaep6cq4ofb3nnxi4tm

      7402 [main] ERROR org.hibernate.tool.hbm2ddl.SchemaExport  - Table "PEOPLEASSIGNMENTS_STAKEHOLDERS" not found; SQL statement:

      alter table PeopleAssignments_Stakeholders drop constraint FK_met63inaep6cq4ofb3nnxi4tm [42102-168]

      7403 [main] ERROR org.hibernate.tool.hbm2ddl.SchemaExport  - HHH000389: Unsuccessful: alter table PeopleAssignments_Stakeholders drop constraint FK_4bh3ay74x6ql9usunubttfdf1

      7403 [main] ERROR org.hibernate.tool.hbm2ddl.SchemaExport  - Table "PEOPLEASSIGNMENTS_STAKEHOLDERS" not found; SQL statement:

      alter table PeopleAssignments_Stakeholders drop constraint FK_4bh3ay74x6ql9usunubttfdf1 [42102-168]

      7408 [main] ERROR org.hibernate.tool.hbm2ddl.SchemaExport  - HHH000389: Unsuccessful: alter table Reassignment drop constraint FK_pnpeue9hs6kx2ep0sp16b6kfd

      7409 [main] ERROR org.hibernate.tool.hbm2ddl.SchemaExport  - Table "REASSIGNMENT" not found; SQL statement:

      alter table Reassignment drop constraint FK_pnpeue9hs6kx2ep0sp16b6kfd [42102-168]

      7410 [main] ERROR org.hibernate.tool.hbm2ddl.SchemaExport  - HHH000389: Unsuccessful: alter table Reassignment_potentialOwners drop constraint FK_8frl6la7tgparlnukhp8xmody

      7410 [main] ERROR org.hibernate.tool.hbm2ddl.SchemaExport  - Table "REASSIGNMENT_POTENTIALOWNERS" not found; SQL statement:

      alter table Reassignment_potentialOwners drop constraint FK_8frl6la7tgparlnukhp8xmody [42102-168]

      7411 [main] ERROR org.hibernate.tool.hbm2ddl.SchemaExport  - HHH000389: Unsuccessful: alter table Reassignment_potentialOwners drop constraint FK_qbega5ncu6b9yigwlw55aeijn

      7412 [main] ERROR org.hibernate.tool.hbm2ddl.SchemaExport  - Table "REASSIGNMENT_POTENTIALOWNERS" not found; SQL statement:

      alter table Reassignment_potentialOwners drop constraint FK_qbega5ncu6b9yigwlw55aeijn [42102-168]

      7412 [main] ERROR org.hibernate.tool.hbm2ddl.SchemaExport  - HHH000389: Unsuccessful: alter table Task drop constraint FK_dpk0f9ucm14c78bsxthh7h8yh

      7413 [main] ERROR org.hibernate.tool.hbm2ddl.SchemaExport  - Table "TASK" not found; SQL statement:

      alter table Task drop constraint FK_dpk0f9ucm14c78bsxthh7h8yh [42102-168]

      7414 [main] ERROR org.hibernate.tool.hbm2ddl.SchemaExport  - HHH000389: Unsuccessful: alter table Task drop constraint FK_nh9nnt47f3l61qjlyedqt05rf

      7414 [main] ERROR org.hibernate.tool.hbm2ddl.SchemaExport  - Table "TASK" not found; SQL statement:

      alter table Task drop constraint FK_nh9nnt47f3l61qjlyedqt05rf [42102-168]

      7415 [main] ERROR org.hibernate.tool.hbm2ddl.SchemaExport  - HHH000389: Unsuccessful: alter table Task drop constraint FK_k02og0u71obf1uxgcdjx9rcjc

      7415 [main] ERROR org.hibernate.tool.hbm2ddl.SchemaExport  - Table "TASK" not found; SQL statement:

      alter table Task drop constraint FK_k02og0u71obf1uxgcdjx9rcjc [42102-168]

      7416 [main] ERROR org.hibernate.tool.hbm2ddl.SchemaExport  - HHH000389: Unsuccessful: alter table task_comment drop constraint FK_aax378yjnsmw9kb9vsu994jjv

      7417 [main] ERROR org.hibernate.tool.hbm2ddl.SchemaExport  - Table "TASK_COMMENT" not found; SQL statement:

      alter table task_comment drop constraint FK_aax378yjnsmw9kb9vsu994jjv [42102-168]

      7418 [main] ERROR org.hibernate.tool.hbm2ddl.SchemaExport  - HHH000389: Unsuccessful: alter table task_comment drop constraint FK_1ws9jdmhtey6mxu7jb0r0ufvs

      7418 [main] ERROR org.hibernate.tool.hbm2ddl.SchemaExport  - Table "TASK_COMMENT" not found; SQL statement:

      alter table task_comment drop constraint FK_1ws9jdmhtey6mxu7jb0r0ufvs [42102-168]

      Tests run: 11, Failures: 0, Errors: 1, Skipped: 0, Time elapsed: 48.981 sec <<< FAILURE! - in org.jbpm.console.ng.ht.backend.server.TaskServiceEntryPointLocalTest

      testGetTasksForLongPeriod(org.jbpm.console.ng.ht.backend.server.TaskServiceEntryPointLocalTest)  Time elapsed: 0.082 sec  <<< ERROR!

      java.lang.IllegalArgumentException: Illegal instant due to time zone offset transition: 2014-03-21T20:30:00.000

          at org.joda.time.chrono.ZonedChronology.localToUTC(ZonedChronology.java:143)

          at org.joda.time.chrono.ZonedChronology.getDateTimeMillis(ZonedChronology.java:119)

          at org.joda.time.chrono.AssembledChronology.getDateTimeMillis(AssembledChronology.java:133)

          at org.joda.time.base.BaseDateTime.<init>(BaseDateTime.java:254)

          at org.joda.time.DateMidnight.<init>(DateMidnight.java:268)

          at org.joda.time.LocalDate.toDateMidnight(LocalDate.java:750)

          at org.joda.time.LocalDate.toDateMidnight(LocalDate.java:727)

          at org.jbpm.console.ng.ht.backend.server.TaskServiceEntryPointImpl.transformLocalDatesToDays(TaskServiceEntryPointImpl.java:195)

          at org.jbpm.console.ng.ht.backend.server.TaskServiceEntryPointImpl.getTasksOwnedFromDateToDateByDays(TaskServiceEntryPointImpl.java:147)

          at org.jbpm.console.ng.ht.backend.server.TaskServiceEntryPointImpl.getTasksOwnedFromDateToDateByDays(TaskServiceEntryPointImpl.java:231)

          at org.jbpm.console.ng.ht.backend.server.TaskServiceEntryPointImpl$Proxy$_$$_WeldClientProxy.getTasksOwnedFromDateToDateByDays(TaskServiceEntryPointImpl$Proxy$_$$_WeldClientProxy.java)

          at org.jbpm.console.ng.ht.backend.server.TaskServiceEntryPointBaseTest.testGetTasksForLongPeriod(TaskServiceEntryPointBaseTest.java:28)

          at sun.reflect.NativeMethodAccessorImpl.invoke0(Native Method)

          at sun.reflect.NativeMethodAccessorImpl.invoke(NativeMethodAccessorImpl.java:39)

          at sun.reflect.DelegatingMethodAccessorImpl.invoke(DelegatingMethodAccessorImpl.java:25)

          at java.lang.reflect.Method.invoke(Method.java:597)

          at org.junit.runners.model.FrameworkMethod$1.runReflectiveCall(FrameworkMethod.java:47)

          at org.junit.internal.runners.model.ReflectiveCallable.run(ReflectiveCallable.java:12)

          at org.junit.runners.model.FrameworkMethod.invokeExplosively(FrameworkMethod.java:44)

          at org.jboss.arquillian.junit.Arquillian$6$1.invoke(Arquillian.java:270)

          at org.jboss.arquillian.container.test.impl.execution.LocalTestExecuter.execute(LocalTestExecuter.java:60)

          at sun.reflect.NativeMethodAccessorImpl.invoke0(Native Method)

          at sun.reflect.NativeMethodAccessorImpl.invoke(NativeMethodAccessorImpl.java:39)

          at sun.reflect.DelegatingMethodAccessorImpl.invoke(DelegatingMethodAccessorImpl.java:25)

          at java.lang.reflect.Method.invoke(Method.java:597)

          at org.jboss.arquillian.core.impl.ObserverImpl.invoke(ObserverImpl.java:94)

          at org.jboss.arquillian.core.impl.EventContextImpl.invokeObservers(EventContextImpl.java:99)

          at org.jboss.arquillian.core.impl.EventContextImpl.proceed(EventContextImpl.java:81)

          at org.jboss.arquillian.core.impl.ManagerImpl.fire(ManagerImpl.java:135)

          at org.jboss.arquillian.core.impl.ManagerImpl.fire(ManagerImpl.java:115)

          at org.jboss.arquillian.core.impl.EventImpl.fire(EventImpl.java:67)

          at org.jboss.arquillian.container.test.impl.client.protocol.local.LocalContainerMethodExecutor.invoke(LocalContainerMethodExecutor.java:50)

          at org.jboss.arquillian.container.test.impl.execution.RemoteTestExecuter.execute(RemoteTestExecuter.java:120)

          at sun.reflect.NativeMethodAccessorImpl.invoke0(Native Method)

          at sun.reflect.NativeMethodAccessorImpl.invoke(NativeMethodAccessorImpl.java:39)

          at sun.reflect.DelegatingMethodAccessorImpl.invoke(DelegatingMethodAccessorImpl.java:25)

          at java.lang.reflect.Method.invoke(Method.java:597)

          at org.jboss.arquillian.core.impl.ObserverImpl.invoke(ObserverImpl.java:94)

          at org.jboss.arquillian.core.impl.EventContextImpl.invokeObservers(EventContextImpl.java:99)

          at org.jboss.arquillian.core.impl.EventContextImpl.proceed(EventContextImpl.java:81)

          at org.jboss.arquillian.core.impl.ManagerImpl.fire(ManagerImpl.java:135)

          at org.jboss.arquillian.core.impl.ManagerImpl.fire(ManagerImpl.java:115)

          at org.jboss.arquillian.core.impl.EventImpl.fire(EventImpl.java:67)

          at org.jboss.arquillian.container.test.impl.execution.ClientTestExecuter.execute(ClientTestExecuter.java:57)

          at sun.reflect.NativeMethodAccessorImpl.invoke0(Native Method)

          at sun.reflect.NativeMethodAccessorImpl.invoke(NativeMethodAccessorImpl.java:39)

          at sun.reflect.DelegatingMethodAccessorImpl.invoke(DelegatingMethodAccessorImpl.java:25)

          at java.lang.reflect.Method.invoke(Method.java:597)

          at org.jboss.arquillian.core.impl.ObserverImpl.invoke(ObserverImpl.java:94)

          at org.jboss.arquillian.core.impl.EventContextImpl.invokeObservers(EventContextImpl.java:99)

          at org.jboss.arquillian.core.impl.EventContextImpl.proceed(EventContextImpl.java:81)

          at org.jboss.arquillian.container.test.impl.client.ContainerEventController.createContext(ContainerEventController.java:142)

          at org.jboss.arquillian.container.test.impl.client.ContainerEventController.createTestContext(ContainerEventController.java:129)

          at sun.reflect.NativeMethodAccessorImpl.invoke0(Native Method)

          at sun.reflect.NativeMethodAccessorImpl.invoke(NativeMethodAccessorImpl.java:39)

          at sun.reflect.DelegatingMethodAccessorImpl.invoke(DelegatingMethodAccessorImpl.java:25)

          at java.lang.reflect.Method.invoke(Method.java:597)

          at org.jboss.arquillian.core.impl.ObserverImpl.invoke(ObserverImpl.java:94)

          at org.jboss.arquillian.core.impl.EventContextImpl.proceed(EventContextImpl.java:88)

          at org.jboss.arquillian.test.impl.TestContextHandler.createTestContext(TestContextHandler.java:89)

          at sun.reflect.GeneratedMethodAccessor99.invoke(Unknown Source)

          at sun.reflect.DelegatingMethodAccessorImpl.invoke(DelegatingMethodAccessorImpl.java:25)

          at java.lang.reflect.Method.invoke(Method.java:597)

          at org.jboss.arquillian.core.impl.ObserverImpl.invoke(ObserverImpl.java:94)

          at org.jboss.arquillian.core.impl.EventContextImpl.proceed(EventContextImpl.java:88)

          at org.jboss.arquillian.test.impl.TestContextHandler.createClassContext(TestContextHandler.java:75)

          at sun.reflect.GeneratedMethodAccessor98.invoke(Unknown Source)

          at sun.reflect.DelegatingMethodAccessorImpl.invoke(DelegatingMethodAccessorImpl.java:25)

          at java.lang.reflect.Method.invoke(Method.java:597)

          at org.jboss.arquillian.core.impl.ObserverImpl.invoke(ObserverImpl.java:94)

          at org.jboss.arquillian.core.impl.EventContextImpl.proceed(EventContextImpl.java:88)

          at org.jboss.arquillian.test.impl.TestContextHandler.createSuiteContext(TestContextHandler.java:60)

          at sun.reflect.GeneratedMethodAccessor97.invoke(Unknown Source)

          at sun.reflect.DelegatingMethodAccessorImpl.invoke(DelegatingMethodAccessorImpl.java:25)

          at java.lang.reflect.Method.invoke(Method.java:597)

          at org.jboss.arquillian.core.impl.ObserverImpl.invoke(ObserverImpl.java:94)

          at org.jboss.arquillian.core.impl.EventContextImpl.proceed(EventContextImpl.java:88)

          at org.jboss.arquillian.core.impl.ManagerImpl.fire(ManagerImpl.java:135)

          at org.jboss.arquillian.test.impl.EventTestRunnerAdaptor.test(EventTestRunnerAdaptor.java:111)

          at org.jboss.arquillian.junit.Arquillian$6.evaluate(Arquillian.java:263)

          at org.jboss.arquillian.junit.Arquillian$4.evaluate(Arquillian.java:226)

          at org.jboss.arquillian.junit.Arquillian.multiExecute(Arquillian.java:314)

          at org.jboss.arquillian.junit.Arquillian.access$100(Arquillian.java:46)

          at org.jboss.arquillian.junit.Arquillian$5.evaluate(Arquillian.java:240)

          at org.junit.runners.ParentRunner.runLeaf(ParentRunner.java:271)

          at org.junit.runners.BlockJUnit4ClassRunner.runChild(BlockJUnit4ClassRunner.java:70)

          at org.junit.runners.BlockJUnit4ClassRunner.runChild(BlockJUnit4ClassRunner.java:50)

          at org.junit.runners.ParentRunner$3.run(ParentRunner.java:238)

          at org.junit.runners.ParentRunner$1.schedule(ParentRunner.java:63)

          at org.junit.runners.ParentRunner.runChildren(ParentRunner.java:236)

          at org.junit.runners.ParentRunner.access$000(ParentRunner.java:53)

          at org.junit.runners.ParentRunner$2.evaluate(ParentRunner.java:229)

          at org.jboss.arquillian.junit.Arquillian$2.evaluate(Arquillian.java:185)

          at org.jboss.arquillian.junit.Arquillian.multiExecute(Arquillian.java:314)

          at org.jboss.arquillian.junit.Arquillian.access$100(Arquillian.java:46)

          at org.jboss.arquillian.junit.Arquillian$3.evaluate(Arquillian.java:199)

          at org.junit.runners.ParentRunner.run(ParentRunner.java:309)

          at org.jboss.arquillian.junit.Arquillian.run(Arquillian.java:147)

          at org.apache.maven.surefire.junit4.JUnit4Provider.execute(JUnit4Provider.java:264)

          at org.apache.maven.surefire.junit4.JUnit4Provider.executeTestSet(JUnit4Provider.java:153)

          at org.apache.maven.surefire.junit4.JUnit4Provider.invoke(JUnit4Provider.java:124)

          at org.apache.maven.surefire.booter.ForkedBooter.invokeProviderInSameClassLoader(ForkedBooter.java:200)

          at org.apache.maven.surefire.booter.ForkedBooter.runSuitesInProcess(ForkedBooter.java:153)

          at org.apache.maven.surefire.booter.ForkedBooter.main(ForkedBooter.java:103)

       

       

      Results :

       

      Tests in error:

        TaskServiceEntryPointLocalTest>TaskServiceEntryPointBaseTest.testGetTasksForLongPeriod:28 » IllegalArgument

       

      Tests run: 11, Failures: 0, Errors: 1, Skipped: 0

       

      ------------------------------------------------------------------------

      Reactor Summary:

       

      jBPM Console NG ................................... SUCCESS [4.059s]

      jBPM Console NG - Module Archetype ................ SUCCESS [4.430s]

      jBPM Console NG - Human Tasks Panels .............. SUCCESS [0.470s]

      jBPM Console NG - Human Tasks API ................. SUCCESS [3.986s]

      jBPM Console NG - Process Runtime Panels .......... SUCCESS [0.265s]

      jBPM Console NG - Process Runtime API ............. SUCCESS [5.816s]

      jBPM Console NG - Business Domain Panels .......... SUCCESS [0.474s]

      jBPM Console NG - Business Domain API ............. SUCCESS [4.253s]

      jBPM Console NG - Human Tasks Client .............. SUCCESS [12.032s]

      jBPM Console NG - Human Tasks Backend ............. FAILURE [53.926s]

      jBPM Console NG - Process Runtime Client .......... SKIPPED

      jBPM Console NG - Process Runtime Backend ......... SKIPPED

      jBPM Console NG - Business Domain Client .......... SKIPPED

      jBPM Console NG - Business Domain Backend ......... SKIPPED

      jBPM Console NG - Executor Service Panels ......... SKIPPED

      jBPM Console NG - Executor Service API ............ SKIPPED

      jBPM Console NG - Executor Service Client ......... SKIPPED

      jBPM Console NG - Executor Service Backend ........ SKIPPED

      jBPM Console NG - Dashboard ....................... SKIPPED

      jBPM Console NG - Dashboard API ................... SKIPPED

      jBPM Console NG - BPM Home Panels ................. SKIPPED

      jBPM Console NG - BPM Home Client ................. SKIPPED

      jBPM Console NG - Dashboard Backend ............... SKIPPED

      jBPM Console NG - Dashboard Client ................ SKIPPED

      jBPM Console NG - Showcase ........................ SKIPPED

      ------------------------------------------------------------------------

      BUILD FAILURE

      ------------------------------------------------------------------------

      Total time: 1:36.975s

      Finished at: Sun Dec 29 12:22:31 IRST 2013

      Final Memory: 62M/363M

      ------------------------------------------------------------------------

      Failed to execute goal org.apache.maven.plugins:maven-surefire-plugin:2.15:test (default-test) on project jbpm-console-ng-human-tasks-backend: There are test failures.

       

      Please refer to /home/mohebbi/projects/jbpm-console-ng-master/jbpm-console-ng-human-tasks/jbpm-console-ng-human-tasks-backend/target/surefire-reports for the individual test results.

      -> [Help 1]

       

      To see the full stack trace of the errors, re-run Maven with the -e switch.

      Re-run Maven using the -X switch to enable full debug logging.

       

      For more information about the errors and possible solutions, please read the following articles:

      [Help 1] http://cwiki.apache.org/confluence/display/MAVEN/MojoFailureException

       

      After correcting the problems, you can resume the build with the command

        mvn <goals> -rf :jbpm-console-ng-human-tasks-backend

       

       

      May you help me to solve it.
      thanks.