2 Replies Latest reply on Oct 4, 2016 3:32 PM by Eric J. Van der Velden

    INFO] WildFly Test Suite: Integration - Web .............. FAILURE [ 25.292 s]

    Eric J. Van der Velden Newbie

      I tried to build wildfly-10.1.0.Final. But I get an error:

       

      -------------------------------------------------------

      T E S T S

      -------------------------------------------------------

      Running org.jboss.as.test.integration.deployment.deploymentoverlay.DeploymentOverlayTestCase

      Tests run: 1, Failures: 0, Errors: 1, Skipped: 0, Time elapsed: 0.202 sec <<< FAILURE! - in org.jboss.as.test.integration.deployment.deploymentoverlay.DeploymentOverlayTestCase

      org.jboss.as.test.integration.deployment.deploymentoverlay.DeploymentOverlayTestCase  Time elapsed: 0.007 sec  <<< ERROR!

      java.lang.NullPointerException: null

              at org.jboss.as.arquillian.container.ManagementClient.getProtocolMetaData(ManagementClient.java:187)

              at org.jboss.as.arquillian.container.CommonDeployableContainer.deploy(CommonDeployableContainer.java:145)

              at org.jboss.arquillian.container.impl.client.container.ContainerDeployController$3.call(ContainerDeployController.java:161)

              at org.jboss.arquillian.container.impl.client.container.ContainerDeployController$3.call(ContainerDeployController.java:128)

              ....