1 Reply Latest reply on May 9, 2017 4:56 PM by James Perkins

    quickstart-11.x Exception in thread "Remoting "management-client" task-11" java.lang.NoClassDefFoundError: org/xnio/XnioWorker$2

    albert kao Newbie

      $ mvn -version

      Apache Maven 3.3.9 (bb52d8502b132ec0a5a3f4c09453c07478323dc5; 2015-11-10T11:41:47-05:00)

      Maven home: /home/ak/maven/apache-maven-3.3.9

      Java version: 1.8.0_131, vendor: Oracle Corporation

      Java home: /home/ak/jdk/jdk1.8.0_131/jre

      Default locale: en_CA, platform encoding: UTF-8

      OS name: "linux", version: "4.4.0-21-generic", arch: "i386", family: "unix"

       

      $ cd ~/wildflyTutorial/quickstart-11.x-new/helloworld

      $ mvn clean install wildfly:deploy

      [INFO] Scanning for projects...

      Downloading: https://maven.repository.redhat.com/ga/org/jboss/jboss-parent/22/jboss-parent-22.pom

      Downloading: https://maven.repository.redhat.com/earlyaccess/all/org/jboss/jboss-parent/22/jboss-parent-22.pom

      Downloading: https://repository.jboss.org/nexus/content/groups/public/org/jboss/jboss-parent/22/jboss-parent-22.pom

      Downloaded: https://repository.jboss.org/nexus/content/groups/public/org/jboss/jboss-parent/22/jboss-parent-22.pom (36 KB at 40.3 KB/sec)

      Downloading: https://maven.repository.redhat.com/ga/org/wildfly/bom/wildfly-javaee7-with-tools/11.0.0.Alpha2/wildfly-javaee7-with-tools-11.0.0.Alpha2.pom

      Downloading: https://maven.repository.redhat.com/earlyaccess/all/org/wildfly/bom/wildfly-javaee7-with-tools/11.0.0.Alpha2/wildfly-javaee7-with-tools-11.0.0.Alpha2.pom

      Downloading: https://repository.jboss.org/nexus/content/groups/public/org/wildfly/bom/wildfly-javaee7-with-tools/11.0.0.Alpha2/wildfly-javaee7-with-tools-11.0.0.Alpha2.pom

      Downloaded: https://repository.jboss.org/nexus/content/groups/public/org/wildfly/bom/wildfly-javaee7-with-tools/11.0.0.Alpha2/wildfly-javaee7-with-tools-11.0.0.Alpha2.pom (7 KB at 23.7 KB/sec)

      Downloading: https://maven.repository.redhat.com/ga/org/wildfly/bom/wildfly/11.0.0.Alpha2/wildfly-11.0.0.Alpha2.pom

      Downloading: https://maven.repository.redhat.com/earlyaccess/all/org/wildfly/bom/wildfly/11.0.0.Alpha2/wildfly-11.0.0.Alpha2.pom

      Downloading: https://repository.jboss.org/nexus/content/groups/public/org/wildfly/bom/wildfly/11.0.0.Alpha2/wildfly-11.0.0.Alpha2.pom

      Downloaded: https://repository.jboss.org/nexus/content/groups/public/org/wildfly/bom/wildfly/11.0.0.Alpha2/wildfly-11.0.0.Alpha2.pom (30 KB at 99.1 KB/sec)

      Downloading: https://maven.repository.redhat.com/ga/org/wildfly/bom/wildfly-javaee7/11.0.0.Alpha2/wildfly-javaee7-11.0.0.Alpha2.pom

      Downloading: https://maven.repository.redhat.com/earlyaccess/all/org/wildfly/bom/wildfly-javaee7/11.0.0.Alpha2/wildfly-javaee7-11.0.0.Alpha2.pom

      Downloading: https://repository.jboss.org/nexus/content/groups/public/org/wildfly/bom/wildfly-javaee7/11.0.0.Alpha2/wildfly-javaee7-11.0.0.Alpha2.pom

      Downloaded: https://repository.jboss.org/nexus/content/groups/public/org/wildfly/bom/wildfly-javaee7/11.0.0.Alpha2/wildfly-javaee7-11.0.0.Alpha2.pom (3 KB at 7.5 KB/sec)

      Downloading: https://maven.repository.redhat.com/ga/org/jboss/spec/jboss-javaee-7.0/1.1.0.Final/jboss-javaee-7.0-1.1.0.Final.pom

      Downloading: https://maven.repository.redhat.com/earlyaccess/all/org/jboss/spec/jboss-javaee-7.0/1.1.0.Final/jboss-javaee-7.0-1.1.0.Final.pom

      Downloading: https://repository.jboss.org/nexus/content/groups/public/org/jboss/spec/jboss-javaee-7.0/1.1.0.Final/jboss-javaee-7.0-1.1.0.Final.pom

      Downloaded: https://repository.jboss.org/nexus/content/groups/public/org/jboss/spec/jboss-javaee-7.0/1.1.0.Final/jboss-javaee-7.0-1.1.0.Final.pom (17 KB at 54.7 KB/sec)

      Downloading: https://maven.repository.redhat.com/ga/org/jboss/shrinkwrap/resolver/shrinkwrap-resolver-bom/2.2.4/shrinkwrap-resolver-bom-2.2.4.pom

      Downloading: https://maven.repository.redhat.com/earlyaccess/all/org/jboss/shrinkwrap/resolver/shrinkwrap-resolver-bom/2.2.4/shrinkwrap-resolver-bom-2.2.4.pom

      Downloading: https://repository.jboss.org/nexus/content/groups/public/org/jboss/shrinkwrap/resolver/shrinkwrap-resolver-bom/2.2.4/shrinkwrap-resolver-bom-2.2.4.pom

      Downloaded: https://repository.jboss.org/nexus/content/groups/public/org/jboss/shrinkwrap/resolver/shrinkwrap-resolver-bom/2.2.4/shrinkwrap-resolver-bom-2.2.4.pom (6 KB at 14.0 KB/sec)

      Downloading: https://maven.repository.redhat.com/ga/org/jboss/arquillian/extension/arquillian-drone-bom/2.0.1.Final/arquillian-drone-bom-2.0.1.Final.pom

      Downloading: https://maven.repository.redhat.com/earlyaccess/all/org/jboss/arquillian/extension/arquillian-drone-bom/2.0.1.Final/arquillian-drone-bom-2.0.1.Final.pom

      Downloading: https://repository.jboss.org/nexus/content/groups/public/org/jboss/arquillian/extension/arquillian-drone-bom/2.0.1.Final/arquillian-drone-bom-2.0.1.Final.pom

      Downloaded: https://repository.jboss.org/nexus/content/groups/public/org/jboss/arquillian/extension/arquillian-drone-bom/2.0.1.Final/arquillian-drone-bom-2.0.1.Final.pom (7 KB at 18.1 KB/sec)

      Downloading: https://maven.repository.redhat.com/ga/org/jboss/arquillian/selenium/selenium-bom/2.53.1/selenium-bom-2.53.1.pom

      Downloading: https://maven.repository.redhat.com/earlyaccess/all/org/jboss/arquillian/selenium/selenium-bom/2.53.1/selenium-bom-2.53.1.pom

      Downloading: https://repository.jboss.org/nexus/content/groups/public/org/jboss/arquillian/selenium/selenium-bom/2.53.1/selenium-bom-2.53.1.pom

      Downloaded: https://repository.jboss.org/nexus/content/groups/public/org/jboss/arquillian/selenium/selenium-bom/2.53.1/selenium-bom-2.53.1.pom (6 KB at 14.2 KB/sec)

      Downloading: https://maven.repository.redhat.com/ga/org/apache/maven/plugins/maven-enforcer-plugin/1.4.1/maven-enforcer-plugin-1.4.1.pom

      Downloaded: https://maven.repository.redhat.com/ga/org/apache/maven/plugins/maven-enforcer-plugin/1.4.1/maven-enforcer-plugin-1.4.1.pom (8 KB at 29.7 KB/sec)

      Downloading: https://maven.repository.redhat.com/ga/org/apache/maven/enforcer/enforcer/1.4.1/enforcer-1.4.1.pom

      Downloaded: https://maven.repository.redhat.com/ga/org/apache/maven/enforcer/enforcer/1.4.1/enforcer-1.4.1.pom (8 KB at 97.8 KB/sec)

      Downloading: https://maven.repository.redhat.com/ga/org/apache/maven/maven-parent/26/maven-parent-26.pom

      Downloaded: https://maven.repository.redhat.com/ga/org/apache/maven/maven-parent/26/maven-parent-26.pom (39 KB at 252.3 KB/sec)

      Downloading: https://maven.repository.redhat.com/ga/org/apache/maven/plugins/maven-enforcer-plugin/1.4.1/maven-enforcer-plugin-1.4.1.jar

      Downloaded: https://maven.repository.redhat.com/ga/org/apache/maven/plugins/maven-enforcer-plugin/1.4.1/maven-enforcer-plugin-1.4.1.jar (27 KB at 253.5 KB/sec)

      Downloading: https://maven.repository.redhat.com/ga/org/codehaus/mojo/buildnumber-maven-plugin/1.4/buildnumber-maven-plugin-1.4.pom

      Downloading: https://maven.repository.redhat.com/earlyaccess/all/org/codehaus/mojo/buildnumber-maven-plugin/1.4/buildnumber-maven-plugin-1.4.pom

      Downloading: https://repository.jboss.org/nexus/content/groups/public/org/codehaus/mojo/buildnumber-maven-plugin/1.4/buildnumber-maven-plugin-1.4.pom

      Downloading: https://repo.maven.apache.org/maven2/org/codehaus/mojo/buildnumber-maven-plugin/1.4/buildnumber-maven-plugin-1.4.pom

      Downloaded: https://repo.maven.apache.org/maven2/org/codehaus/mojo/buildnumber-maven-plugin/1.4/buildnumber-maven-plugin-1.4.pom (14 KB at 51.4 KB/sec)

      Downloading: https://maven.repository.redhat.com/ga/org/codehaus/mojo/mojo-parent/38/mojo-parent-38.pom

      Downloaded: https://maven.repository.redhat.com/ga/org/codehaus/mojo/mojo-parent/38/mojo-parent-38.pom (33 KB at 187.8 KB/sec)

      Downloading: https://maven.repository.redhat.com/ga/org/codehaus/mojo/buildnumber-maven-plugin/1.4/buildnumber-maven-plugin-1.4.jar

      Downloading: https://maven.repository.redhat.com/earlyaccess/all/org/codehaus/mojo/buildnumber-maven-plugin/1.4/buildnumber-maven-plugin-1.4.jar

      Downloading: https://repository.jboss.org/nexus/content/groups/public/org/codehaus/mojo/buildnumber-maven-plugin/1.4/buildnumber-maven-plugin-1.4.jar

      Downloading: https://repo.maven.apache.org/maven2/org/codehaus/mojo/buildnumber-maven-plugin/1.4/buildnumber-maven-plugin-1.4.jar

      Downloaded: https://repo.maven.apache.org/maven2/org/codehaus/mojo/buildnumber-maven-plugin/1.4/buildnumber-maven-plugin-1.4.jar (40 KB at 463.4 KB/sec)

      Downloading: https://maven.repository.redhat.com/ga/org/apache/maven/plugins/maven-source-plugin/3.0.1/maven-source-plugin-3.0.1.pom

      Downloading: https://maven.repository.redhat.com/earlyaccess/all/org/apache/maven/plugins/maven-source-plugin/3.0.1/maven-source-plugin-3.0.1.pom

      Downloading: https://repository.jboss.org/nexus/content/groups/public/org/apache/maven/plugins/maven-source-plugin/3.0.1/maven-source-plugin-3.0.1.pom

      Downloading: https://repo.maven.apache.org/maven2/org/apache/maven/plugins/maven-source-plugin/3.0.1/maven-source-plugin-3.0.1.pom

      Downloaded: https://repo.maven.apache.org/maven2/org/apache/maven/plugins/maven-source-plugin/3.0.1/maven-source-plugin-3.0.1.pom (6 KB at 101.0 KB/sec)

      Downloading: https://maven.repository.redhat.com/ga/org/apache/maven/plugins/maven-source-plugin/3.0.1/maven-source-plugin-3.0.1.jar

      Downloading: https://maven.repository.redhat.com/earlyaccess/all/org/apache/maven/plugins/maven-source-plugin/3.0.1/maven-source-plugin-3.0.1.jar

      Downloading: https://repository.jboss.org/nexus/content/groups/public/org/apache/maven/plugins/maven-source-plugin/3.0.1/maven-source-plugin-3.0.1.jar

      Downloading: https://repo.maven.apache.org/maven2/org/apache/maven/plugins/maven-source-plugin/3.0.1/maven-source-plugin-3.0.1.jar

      Downloaded: https://repo.maven.apache.org/maven2/org/apache/maven/plugins/maven-source-plugin/3.0.1/maven-source-plugin-3.0.1.jar (31 KB at 511.7 KB/sec)

      Downloading: https://maven.repository.redhat.com/ga/com/mycila/license-maven-plugin/3.0/license-maven-plugin-3.0.pom

      Downloading: https://maven.repository.redhat.com/earlyaccess/all/com/mycila/license-maven-plugin/3.0/license-maven-plugin-3.0.pom

      Downloading: https://repository.jboss.org/nexus/content/groups/public/com/mycila/license-maven-plugin/3.0/license-maven-plugin-3.0.pom

      Downloading: https://repo.maven.apache.org/maven2/com/mycila/license-maven-plugin/3.0/license-maven-plugin-3.0.pom

      Downloaded: https://repo.maven.apache.org/maven2/com/mycila/license-maven-plugin/3.0/license-maven-plugin-3.0.pom (5 KB at 45.6 KB/sec)

      Downloading: https://maven.repository.redhat.com/ga/com/mycila/license-maven-plugin-parent/3.0/license-maven-plugin-parent-3.0.pom

      Downloading: https://maven.repository.redhat.com/earlyaccess/all/com/mycila/license-maven-plugin-parent/3.0/license-maven-plugin-parent-3.0.pom

      Downloading: https://repository.jboss.org/nexus/content/groups/public/com/mycila/license-maven-plugin-parent/3.0/license-maven-plugin-parent-3.0.pom

      Downloading: https://repo.maven.apache.org/maven2/com/mycila/license-maven-plugin-parent/3.0/license-maven-plugin-parent-3.0.pom

      Downloaded: https://repo.maven.apache.org/maven2/com/mycila/license-maven-plugin-parent/3.0/license-maven-plugin-parent-3.0.pom (6 KB at 56.8 KB/sec)

      Downloading: https://maven.repository.redhat.com/ga/com/mycila/mycila-pom/3/mycila-pom-3.pom

      Downloading: https://maven.repository.redhat.com/earlyaccess/all/com/mycila/mycila-pom/3/mycila-pom-3.pom

      Downloading: https://repository.jboss.org/nexus/content/groups/public/com/mycila/mycila-pom/3/mycila-pom-3.pom

      Downloading: https://repo.maven.apache.org/maven2/com/mycila/mycila-pom/3/mycila-pom-3.pom

      Downloaded: https://repo.maven.apache.org/maven2/com/mycila/mycila-pom/3/mycila-pom-3.pom (20 KB at 191.6 KB/sec)

      Downloading: https://maven.repository.redhat.com/ga/com/mycila/license-maven-plugin/3.0/license-maven-plugin-3.0.jar

      Downloading: https://maven.repository.redhat.com/earlyaccess/all/com/mycila/license-maven-plugin/3.0/license-maven-plugin-3.0.jar

      Downloading: https://repository.jboss.org/nexus/content/groups/public/com/mycila/license-maven-plugin/3.0/license-maven-plugin-3.0.jar

      Downloading: https://repo.maven.apache.org/maven2/com/mycila/license-maven-plugin/3.0/license-maven-plugin-3.0.jar

      Downloaded: https://repo.maven.apache.org/maven2/com/mycila/license-maven-plugin/3.0/license-maven-plugin-3.0.jar (87 KB at 757.2 KB/sec)

      Downloading: https://maven.repository.redhat.com/ga/org/apache/maven/plugins/maven-clean-plugin/3.0.0/maven-clean-plugin-3.0.0.pom

      Downloading: https://maven.repository.redhat.com/earlyaccess/all/org/apache/maven/plugins/maven-clean-plugin/3.0.0/maven-clean-plugin-3.0.0.pom

      Downloading: https://repository.jboss.org/nexus/content/groups/public/org/apache/maven/plugins/maven-clean-plugin/3.0.0/maven-clean-plugin-3.0.0.pom

      Downloading: https://repo.maven.apache.org/maven2/org/apache/maven/plugins/maven-clean-plugin/3.0.0/maven-clean-plugin-3.0.0.pom

      Downloaded: https://repo.maven.apache.org/maven2/org/apache/maven/plugins/maven-clean-plugin/3.0.0/maven-clean-plugin-3.0.0.pom (5 KB at 49.6 KB/sec)

      Downloading: https://maven.repository.redhat.com/ga/org/apache/maven/plugins/maven-plugins/28/maven-plugins-28.pom

      Downloaded: https://maven.repository.redhat.com/ga/org/apache/maven/plugins/maven-plugins/28/maven-plugins-28.pom (12 KB at 86.4 KB/sec)

      Downloading: https://maven.repository.redhat.com/ga/org/apache/maven/plugins/maven-clean-plugin/3.0.0/maven-clean-plugin-3.0.0.jar

      Downloading: https://maven.repository.redhat.com/earlyaccess/all/org/apache/maven/plugins/maven-clean-plugin/3.0.0/maven-clean-plugin-3.0.0.jar

      Downloading: https://repository.jboss.org/nexus/content/groups/public/org/apache/maven/plugins/maven-clean-plugin/3.0.0/maven-clean-plugin-3.0.0.jar

      Downloading: https://repo.maven.apache.org/maven2/org/apache/maven/plugins/maven-clean-plugin/3.0.0/maven-clean-plugin-3.0.0.jar

      Downloaded: https://repo.maven.apache.org/maven2/org/apache/maven/plugins/maven-clean-plugin/3.0.0/maven-clean-plugin-3.0.0.jar (30 KB at 356.3 KB/sec)

      Downloading: https://maven.repository.redhat.com/ga/org/apache/maven/plugins/maven-resources-plugin/3.0.1/maven-resources-plugin-3.0.1.pom

      Downloading: https://maven.repository.redhat.com/earlyaccess/all/org/apache/maven/plugins/maven-resources-plugin/3.0.1/maven-resources-plugin-3.0.1.pom

      Downloading: https://repository.jboss.org/nexus/content/groups/public/org/apache/maven/plugins/maven-resources-plugin/3.0.1/maven-resources-plugin-3.0.1.pom

      Downloading: https://repo.maven.apache.org/maven2/org/apache/maven/plugins/maven-resources-plugin/3.0.1/maven-resources-plugin-3.0.1.pom

      Downloaded: https://repo.maven.apache.org/maven2/org/apache/maven/plugins/maven-resources-plugin/3.0.1/maven-resources-plugin-3.0.1.pom (7 KB at 132.0 KB/sec)

      Downloading: https://maven.repository.redhat.com/ga/org/apache/maven/plugins/maven-resources-plugin/3.0.1/maven-resources-plugin-3.0.1.jar

      Downloading: https://maven.repository.redhat.com/earlyaccess/all/org/apache/maven/plugins/maven-resources-plugin/3.0.1/maven-resources-plugin-3.0.1.jar

      Downloading: https://repository.jboss.org/nexus/content/groups/public/org/apache/maven/plugins/maven-resources-plugin/3.0.1/maven-resources-plugin-3.0.1.jar

      Downloading: https://repo.maven.apache.org/maven2/org/apache/maven/plugins/maven-resources-plugin/3.0.1/maven-resources-plugin-3.0.1.jar

      Downloaded: https://repo.maven.apache.org/maven2/org/apache/maven/plugins/maven-resources-plugin/3.0.1/maven-resources-plugin-3.0.1.jar (31 KB at 580.0 KB/sec)

      Downloading: https://maven.repository.redhat.com/ga/org/apache/maven/plugins/maven-compiler-plugin/3.6.0/maven-compiler-plugin-3.6.0.pom

      Downloading: https://maven.repository.redhat.com/earlyaccess/all/org/apache/maven/plugins/maven-compiler-plugin/3.6.0/maven-compiler-plugin-3.6.0.pom

      Downloading: https://repository.jboss.org/nexus/content/groups/public/org/apache/maven/plugins/maven-compiler-plugin/3.6.0/maven-compiler-plugin-3.6.0.pom

      Downloading: https://repo.maven.apache.org/maven2/org/apache/maven/plugins/maven-compiler-plugin/3.6.0/maven-compiler-plugin-3.6.0.pom

      Downloaded: https://repo.maven.apache.org/maven2/org/apache/maven/plugins/maven-compiler-plugin/3.6.0/maven-compiler-plugin-3.6.0.pom (11 KB at 195.8 KB/sec)

      Downloading: https://maven.repository.redhat.com/ga/org/apache/maven/plugins/maven-compiler-plugin/3.6.0/maven-compiler-plugin-3.6.0.jar

      Downloading: https://maven.repository.redhat.com/earlyaccess/all/org/apache/maven/plugins/maven-compiler-plugin/3.6.0/maven-compiler-plugin-3.6.0.jar

      Downloading: https://repository.jboss.org/nexus/content/groups/public/org/apache/maven/plugins/maven-compiler-plugin/3.6.0/maven-compiler-plugin-3.6.0.jar

      Downloading: https://repo.maven.apache.org/maven2/org/apache/maven/plugins/maven-compiler-plugin/3.6.0/maven-compiler-plugin-3.6.0.jar

      Downloaded: https://repo.maven.apache.org/maven2/org/apache/maven/plugins/maven-compiler-plugin/3.6.0/maven-compiler-plugin-3.6.0.jar (54 KB at 929.6 KB/sec)

      Downloading: https://maven.repository.redhat.com/ga/org/apache/maven/plugins/maven-surefire-plugin/2.19.1/maven-surefire-plugin-2.19.1.pom

      Downloaded: https://maven.repository.redhat.com/ga/org/apache/maven/plugins/maven-surefire-plugin/2.19.1/maven-surefire-plugin-2.19.1.pom (6 KB at 35.5 KB/sec)

      Downloading: https://maven.repository.redhat.com/ga/org/apache/maven/surefire/surefire/2.19.1/surefire-2.19.1.pom

      Downloaded: https://maven.repository.redhat.com/ga/org/apache/maven/surefire/surefire/2.19.1/surefire-2.19.1.pom (19 KB at 225.2 KB/sec)

      Downloading: https://maven.repository.redhat.com/ga/org/apache/maven/plugins/maven-surefire-plugin/2.19.1/maven-surefire-plugin-2.19.1.jar

      Downloaded: https://maven.repository.redhat.com/ga/org/apache/maven/plugins/maven-surefire-plugin/2.19.1/maven-surefire-plugin-2.19.1.jar (38 KB at 487.1 KB/sec)

      Downloading: https://maven.repository.redhat.com/ga/org/apache/maven/plugins/maven-install-plugin/2.5.2/maven-install-plugin-2.5.2.pom

      Downloaded: https://maven.repository.redhat.com/ga/org/apache/maven/plugins/maven-install-plugin/2.5.2/maven-install-plugin-2.5.2.pom (7 KB at 87.0 KB/sec)

      Downloading: https://maven.repository.redhat.com/ga/org/apache/maven/plugins/maven-install-plugin/2.5.2/maven-install-plugin-2.5.2.jar

      Downloaded: https://maven.repository.redhat.com/ga/org/apache/maven/plugins/maven-install-plugin/2.5.2/maven-install-plugin-2.5.2.jar (33 KB at 385.0 KB/sec)

      Downloading: https://maven.repository.redhat.com/ga/org/apache/maven/plugins/maven-deploy-plugin/2.8.2/maven-deploy-plugin-2.8.2.pom

      Downloaded: https://maven.repository.redhat.com/ga/org/apache/maven/plugins/maven-deploy-plugin/2.8.2/maven-deploy-plugin-2.8.2.pom (7 KB at 62.2 KB/sec)

      Downloading: https://maven.repository.redhat.com/ga/org/apache/maven/plugins/maven-deploy-plugin/2.8.2/maven-deploy-plugin-2.8.2.jar

      Downloaded: https://maven.repository.redhat.com/ga/org/apache/maven/plugins/maven-deploy-plugin/2.8.2/maven-deploy-plugin-2.8.2.jar (34 KB at 256.4 KB/sec)

      Downloading: https://maven.repository.redhat.com/ga/org/apache/maven/plugins/maven-site-plugin/3.5.1/maven-site-plugin-3.5.1.pom

      Downloading: https://maven.repository.redhat.com/earlyaccess/all/org/apache/maven/plugins/maven-site-plugin/3.5.1/maven-site-plugin-3.5.1.pom

      Downloading: https://repository.jboss.org/nexus/content/groups/public/org/apache/maven/plugins/maven-site-plugin/3.5.1/maven-site-plugin-3.5.1.pom

      Downloading: https://repo.maven.apache.org/maven2/org/apache/maven/plugins/maven-site-plugin/3.5.1/maven-site-plugin-3.5.1.pom

      Downloaded: https://repo.maven.apache.org/maven2/org/apache/maven/plugins/maven-site-plugin/3.5.1/maven-site-plugin-3.5.1.pom (18 KB at 175.3 KB/sec)

      Downloading: https://maven.repository.redhat.com/ga/org/apache/maven/plugins/maven-site-plugin/3.5.1/maven-site-plugin-3.5.1.jar

      Downloading: https://maven.repository.redhat.com/earlyaccess/all/org/apache/maven/plugins/maven-site-plugin/3.5.1/maven-site-plugin-3.5.1.jar

      Downloading: https://repository.jboss.org/nexus/content/groups/public/org/apache/maven/plugins/maven-site-plugin/3.5.1/maven-site-plugin-3.5.1.jar

      Downloading: https://repo.maven.apache.org/maven2/org/apache/maven/plugins/maven-site-plugin/3.5.1/maven-site-plugin-3.5.1.jar

      Downloaded: https://repo.maven.apache.org/maven2/org/apache/maven/plugins/maven-site-plugin/3.5.1/maven-site-plugin-3.5.1.jar (129 KB at 1477.4 KB/sec)

      Downloading: https://maven.repository.redhat.com/ga/org/apache/maven/plugins/maven-antrun-plugin/1.8/maven-antrun-plugin-1.8.pom

      Downloaded: https://maven.repository.redhat.com/ga/org/apache/maven/plugins/maven-antrun-plugin/1.8/maven-antrun-plugin-1.8.pom (4 KB at 12.9 KB/sec)

      Downloading: https://maven.repository.redhat.com/ga/org/apache/maven/plugins/maven-plugins/27/maven-plugins-27.pom

      Downloaded: https://maven.repository.redhat.com/ga/org/apache/maven/plugins/maven-plugins/27/maven-plugins-27.pom (12 KB at 152.0 KB/sec)

      Downloading: https://maven.repository.redhat.com/ga/org/apache/maven/plugins/maven-antrun-plugin/1.8/maven-antrun-plugin-1.8.jar

      Downloaded: https://maven.repository.redhat.com/ga/org/apache/maven/plugins/maven-antrun-plugin/1.8/maven-antrun-plugin-1.8.jar (36 KB at 274.7 KB/sec)

      Downloading: https://maven.repository.redhat.com/ga/org/apache/maven/plugins/maven-archetype-plugin/2.4/maven-archetype-plugin-2.4.pom

      Downloading: https://maven.repository.redhat.com/earlyaccess/all/org/apache/maven/plugins/maven-archetype-plugin/2.4/maven-archetype-plugin-2.4.pom

      Downloading: https://repository.jboss.org/nexus/content/groups/public/org/apache/maven/plugins/maven-archetype-plugin/2.4/maven-archetype-plugin-2.4.pom

      Downloading: https://repo.maven.apache.org/maven2/org/apache/maven/plugins/maven-archetype-plugin/2.4/maven-archetype-plugin-2.4.pom

      Downloaded: https://repo.maven.apache.org/maven2/org/apache/maven/plugins/maven-archetype-plugin/2.4/maven-archetype-plugin-2.4.pom (9 KB at 79.3 KB/sec)

      Downloading: https://maven.repository.redhat.com/ga/org/apache/maven/archetype/maven-archetype/2.4/maven-archetype-2.4.pom

      Downloading: https://maven.repository.redhat.com/earlyaccess/all/org/apache/maven/archetype/maven-archetype/2.4/maven-archetype-2.4.pom

      Downloading: https://repository.jboss.org/nexus/content/groups/public/org/apache/maven/archetype/maven-archetype/2.4/maven-archetype-2.4.pom

      Downloading: https://repo.maven.apache.org/maven2/org/apache/maven/archetype/maven-archetype/2.4/maven-archetype-2.4.pom

      Downloaded: https://repo.maven.apache.org/maven2/org/apache/maven/archetype/maven-archetype/2.4/maven-archetype-2.4.pom (13 KB at 123.9 KB/sec)

      Downloading: https://maven.repository.redhat.com/ga/org/apache/maven/plugins/maven-archetype-plugin/2.4/maven-archetype-plugin-2.4.jar

      Downloading: https://maven.repository.redhat.com/earlyaccess/all/org/apache/maven/plugins/maven-archetype-plugin/2.4/maven-archetype-plugin-2.4.jar

      Downloading: https://repository.jboss.org/nexus/content/groups/public/org/apache/maven/plugins/maven-archetype-plugin/2.4/maven-archetype-plugin-2.4.jar

      Downloading: https://repo.maven.apache.org/maven2/org/apache/maven/plugins/maven-archetype-plugin/2.4/maven-archetype-plugin-2.4.jar

      Downloaded: https://repo.maven.apache.org/maven2/org/apache/maven/plugins/maven-archetype-plugin/2.4/maven-archetype-plugin-2.4.jar (92 KB at 741.9 KB/sec)

      Downloading: https://maven.repository.redhat.com/ga/org/apache/maven/plugins/maven-assembly-plugin/3.0.0/maven-assembly-plugin-3.0.0.pom

      Downloading: https://maven.repository.redhat.com/earlyaccess/all/org/apache/maven/plugins/maven-assembly-plugin/3.0.0/maven-assembly-plugin-3.0.0.pom

      Downloading: https://repository.jboss.org/nexus/content/groups/public/org/apache/maven/plugins/maven-assembly-plugin/3.0.0/maven-assembly-plugin-3.0.0.pom

      Downloading: https://repo.maven.apache.org/maven2/org/apache/maven/plugins/maven-assembly-plugin/3.0.0/maven-assembly-plugin-3.0.0.pom

      Downloaded: https://repo.maven.apache.org/maven2/org/apache/maven/plugins/maven-assembly-plugin/3.0.0/maven-assembly-plugin-3.0.0.pom (16 KB at 238.8 KB/sec)

      Downloading: https://maven.repository.redhat.com/ga/org/apache/maven/plugins/maven-assembly-plugin/3.0.0/maven-assembly-plugin-3.0.0.jar

      Downloading: https://maven.repository.redhat.com/earlyaccess/all/org/apache/maven/plugins/maven-assembly-plugin/3.0.0/maven-assembly-plugin-3.0.0.jar

      Downloading: https://repository.jboss.org/nexus/content/groups/public/org/apache/maven/plugins/maven-assembly-plugin/3.0.0/maven-assembly-plugin-3.0.0.jar

      Downloading: https://repo.maven.apache.org/maven2/org/apache/maven/plugins/maven-assembly-plugin/3.0.0/maven-assembly-plugin-3.0.0.jar

      Downloaded: https://repo.maven.apache.org/maven2/org/apache/maven/plugins/maven-assembly-plugin/3.0.0/maven-assembly-plugin-3.0.0.jar (235 KB at 2196.0 KB/sec)

      Downloading: https://maven.repository.redhat.com/ga/org/codehaus/mojo/build-helper-maven-plugin/1.12/build-helper-maven-plugin-1.12.pom

      Downloading: https://maven.repository.redhat.com/earlyaccess/all/org/codehaus/mojo/build-helper-maven-plugin/1.12/build-helper-maven-plugin-1.12.pom

      Downloading: https://repository.jboss.org/nexus/content/groups/public/org/codehaus/mojo/build-helper-maven-plugin/1.12/build-helper-maven-plugin-1.12.pom

      Downloading: https://repo.maven.apache.org/maven2/org/codehaus/mojo/build-helper-maven-plugin/1.12/build-helper-maven-plugin-1.12.pom

      Downloaded: https://repo.maven.apache.org/maven2/org/codehaus/mojo/build-helper-maven-plugin/1.12/build-helper-maven-plugin-1.12.pom (6 KB at 80.9 KB/sec)

      Downloading: https://maven.repository.redhat.com/ga/org/codehaus/mojo/mojo-parent/40/mojo-parent-40.pom

      Downloading: https://maven.repository.redhat.com/earlyaccess/all/org/codehaus/mojo/mojo-parent/40/mojo-parent-40.pom

      Downloading: https://repository.jboss.org/nexus/content/groups/public/org/codehaus/mojo/mojo-parent/40/mojo-parent-40.pom

      Downloading: https://repo.maven.apache.org/maven2/org/codehaus/mojo/mojo-parent/40/mojo-parent-40.pom

      Downloaded: https://repo.maven.apache.org/maven2/org/codehaus/mojo/mojo-parent/40/mojo-parent-40.pom (33 KB at 538.2 KB/sec)

      Downloading: https://maven.repository.redhat.com/ga/org/codehaus/mojo/build-helper-maven-plugin/1.12/build-helper-maven-plugin-1.12.jar

      Downloading: https://maven.repository.redhat.com/earlyaccess/all/org/codehaus/mojo/build-helper-maven-plugin/1.12/build-helper-maven-plugin-1.12.jar

      Downloading: https://repository.jboss.org/nexus/content/groups/public/org/codehaus/mojo/build-helper-maven-plugin/1.12/build-helper-maven-plugin-1.12.jar

      Downloading: https://repo.maven.apache.org/maven2/org/codehaus/mojo/build-helper-maven-plugin/1.12/build-helper-maven-plugin-1.12.jar

      Downloaded: https://repo.maven.apache.org/maven2/org/codehaus/mojo/build-helper-maven-plugin/1.12/build-helper-maven-plugin-1.12.jar (61 KB at 886.7 KB/sec)

      Downloading: https://maven.repository.redhat.com/ga/org/apache/felix/maven-bundle-plugin/3.2.0/maven-bundle-plugin-3.2.0.pom

      Downloading: https://maven.repository.redhat.com/earlyaccess/all/org/apache/felix/maven-bundle-plugin/3.2.0/maven-bundle-plugin-3.2.0.pom

      Downloading: https://repository.jboss.org/nexus/content/groups/public/org/apache/felix/maven-bundle-plugin/3.2.0/maven-bundle-plugin-3.2.0.pom

      Downloading: https://repo.maven.apache.org/maven2/org/apache/felix/maven-bundle-plugin/3.2.0/maven-bundle-plugin-3.2.0.pom

      Downloaded: https://repo.maven.apache.org/maven2/org/apache/felix/maven-bundle-plugin/3.2.0/maven-bundle-plugin-3.2.0.pom (9 KB at 87.0 KB/sec)

      Downloading: https://maven.repository.redhat.com/ga/org/apache/felix/felix-parent/4/felix-parent-4.pom

      Downloaded: https://maven.repository.redhat.com/ga/org/apache/felix/felix-parent/4/felix-parent-4.pom (24 KB at 110.4 KB/sec)

      Downloading: https://maven.repository.redhat.com/ga/org/apache/felix/maven-bundle-plugin/3.2.0/maven-bundle-plugin-3.2.0.jar

      Downloading: https://maven.repository.redhat.com/earlyaccess/all/org/apache/felix/maven-bundle-plugin/3.2.0/maven-bundle-plugin-3.2.0.jar

      Downloading: https://repository.jboss.org/nexus/content/groups/public/org/apache/felix/maven-bundle-plugin/3.2.0/maven-bundle-plugin-3.2.0.jar

      Downloading: https://repo.maven.apache.org/maven2/org/apache/felix/maven-bundle-plugin/3.2.0/maven-bundle-plugin-3.2.0.jar

      Downloaded: https://repo.maven.apache.org/maven2/org/apache/felix/maven-bundle-plugin/3.2.0/maven-bundle-plugin-3.2.0.jar (218 KB at 1829.8 KB/sec)

      Downloading: https://maven.repository.redhat.com/ga/org/apache/maven/plugins/maven-checkstyle-plugin/2.17/maven-checkstyle-plugin-2.17.pom

      Downloaded: https://maven.repository.redhat.com/ga/org/apache/maven/plugins/maven-checkstyle-plugin/2.17/maven-checkstyle-plugin-2.17.pom (14 KB at 62.1 KB/sec)

      Downloading: https://maven.repository.redhat.com/ga/org/apache/maven/plugins/maven-checkstyle-plugin/2.17/maven-checkstyle-plugin-2.17.jar

      Downloaded: https://maven.repository.redhat.com/ga/org/apache/maven/plugins/maven-checkstyle-plugin/2.17/maven-checkstyle-plugin-2.17.jar (107 KB at 706.9 KB/sec)

      Downloading: https://maven.repository.redhat.com/ga/com/atlassian/maven/plugins/maven-clover2-plugin/4.0.6/maven-clover2-plugin-4.0.6.pom

      Downloading: https://maven.repository.redhat.com/earlyaccess/all/com/atlassian/maven/plugins/maven-clover2-plugin/4.0.6/maven-clover2-plugin-4.0.6.pom

      Downloading: https://repository.jboss.org/nexus/content/groups/public/com/atlassian/maven/plugins/maven-clover2-plugin/4.0.6/maven-clover2-plugin-4.0.6.pom

      Downloading: https://repo.maven.apache.org/maven2/com/atlassian/maven/plugins/maven-clover2-plugin/4.0.6/maven-clover2-plugin-4.0.6.pom

      Downloaded: https://repo.maven.apache.org/maven2/com/atlassian/maven/plugins/maven-clover2-plugin/4.0.6/maven-clover2-plugin-4.0.6.pom (21 KB at 198.0 KB/sec)

      Downloading: https://maven.repository.redhat.com/ga/com/atlassian/pom/central-pom/3.0.90/central-pom-3.0.90.pom

      Downloading: https://maven.repository.redhat.com/earlyaccess/all/com/atlassian/pom/central-pom/3.0.90/central-pom-3.0.90.pom

      Downloading: https://repository.jboss.org/nexus/content/groups/public/com/atlassian/pom/central-pom/3.0.90/central-pom-3.0.90.pom

      Downloading: https://repo.maven.apache.org/maven2/com/atlassian/pom/central-pom/3.0.90/central-pom-3.0.90.pom

      Downloaded: https://repo.maven.apache.org/maven2/com/atlassian/pom/central-pom/3.0.90/central-pom-3.0.90.pom (5 KB at 45.6 KB/sec)

      Downloading: https://maven.repository.redhat.com/ga/com/atlassian/pom/base-pom/3.0.90/base-pom-3.0.90.pom

      Downloading: https://maven.repository.redhat.com/earlyaccess/all/com/atlassian/pom/base-pom/3.0.90/base-pom-3.0.90.pom

      Downloading: https://repository.jboss.org/nexus/content/groups/public/com/atlassian/pom/base-pom/3.0.90/base-pom-3.0.90.pom

      Downloading: https://repo.maven.apache.org/maven2/com/atlassian/pom/base-pom/3.0.90/base-pom-3.0.90.pom

      Downloaded: https://repo.maven.apache.org/maven2/com/atlassian/pom/base-pom/3.0.90/base-pom-3.0.90.pom (29 KB at 372.1 KB/sec)

      Downloading: https://maven.repository.redhat.com/ga/com/atlassian/maven/plugins/maven-clover2-plugin/4.0.6/maven-clover2-plugin-4.0.6.jar

      Downloading: https://maven.repository.redhat.com/earlyaccess/all/com/atlassian/maven/plugins/maven-clover2-plugin/4.0.6/maven-clover2-plugin-4.0.6.jar

      Downloading: https://repository.jboss.org/nexus/content/groups/public/com/atlassian/maven/plugins/maven-clover2-plugin/4.0.6/maven-clover2-plugin-4.0.6.jar

      Downloading: https://repo.maven.apache.org/maven2/com/atlassian/maven/plugins/maven-clover2-plugin/4.0.6/maven-clover2-plugin-4.0.6.jar

      Downloaded: https://repo.maven.apache.org/maven2/com/atlassian/maven/plugins/maven-clover2-plugin/4.0.6/maven-clover2-plugin-4.0.6.jar (137 KB at 701.5 KB/sec)

      Downloading: https://maven.repository.redhat.com/ga/org/codehaus/mojo/cobertura-maven-plugin/2.7/cobertura-maven-plugin-2.7.pom

      Downloading: https://maven.repository.redhat.com/earlyaccess/all/org/codehaus/mojo/cobertura-maven-plugin/2.7/cobertura-maven-plugin-2.7.pom

      Downloading: https://repository.jboss.org/nexus/content/groups/public/org/codehaus/mojo/cobertura-maven-plugin/2.7/cobertura-maven-plugin-2.7.pom

      Downloading: https://repo.maven.apache.org/maven2/org/codehaus/mojo/cobertura-maven-plugin/2.7/cobertura-maven-plugin-2.7.pom

      Downloaded: https://repo.maven.apache.org/maven2/org/codehaus/mojo/cobertura-maven-plugin/2.7/cobertura-maven-plugin-2.7.pom (14 KB at 245.4 KB/sec)

      Downloading: https://maven.repository.redhat.com/ga/org/codehaus/mojo/mojo-parent/34/mojo-parent-34.pom

      Downloaded: https://maven.repository.redhat.com/ga/org/codehaus/mojo/mojo-parent/34/mojo-parent-34.pom (24 KB at 123.1 KB/sec)

      Downloading: https://maven.repository.redhat.com/ga/org/codehaus/codehaus-parent/4/codehaus-parent-4.pom

      Downloaded: https://maven.repository.redhat.com/ga/org/codehaus/codehaus-parent/4/codehaus-parent-4.pom (5 KB at 43.2 KB/sec)

      Downloading: https://maven.repository.redhat.com/ga/org/codehaus/mojo/cobertura-maven-plugin/2.7/cobertura-maven-plugin-2.7.jar

      Downloading: https://maven.repository.redhat.com/earlyaccess/all/org/codehaus/mojo/cobertura-maven-plugin/2.7/cobertura-maven-plugin-2.7.jar

      Downloading: https://repository.jboss.org/nexus/content/groups/public/org/codehaus/mojo/cobertura-maven-plugin/2.7/cobertura-maven-plugin-2.7.jar

      Downloading: https://repo.maven.apache.org/maven2/org/codehaus/mojo/cobertura-maven-plugin/2.7/cobertura-maven-plugin-2.7.jar

      Downloaded: https://repo.maven.apache.org/maven2/org/codehaus/mojo/cobertura-maven-plugin/2.7/cobertura-maven-plugin-2.7.jar (57 KB at 788.8 KB/sec)

      Downloading: https://maven.repository.redhat.com/ga/org/apache/maven/plugins/maven-dependency-plugin/2.10/maven-dependency-plugin-2.10.pom

      Downloaded: https://maven.repository.redhat.com/ga/org/apache/maven/plugins/maven-dependency-plugin/2.10/maven-dependency-plugin-2.10.pom (12 KB at 22.9 KB/sec)

      Downloading: https://maven.repository.redhat.com/ga/org/apache/maven/plugins/maven-dependency-plugin/2.10/maven-dependency-plugin-2.10.jar

      Downloaded: https://maven.repository.redhat.com/ga/org/apache/maven/plugins/maven-dependency-plugin/2.10/maven-dependency-plugin-2.10.jar (157 KB at 292.5 KB/sec)

      Downloading: https://maven.repository.redhat.com/ga/org/apache/maven/plugins/maven-ear-plugin/2.10.1/maven-ear-plugin-2.10.1.pom

      Downloading: https://maven.repository.redhat.com/earlyaccess/all/org/apache/maven/plugins/maven-ear-plugin/2.10.1/maven-ear-plugin-2.10.1.pom

      Downloading: https://repository.jboss.org/nexus/content/groups/public/org/apache/maven/plugins/maven-ear-plugin/2.10.1/maven-ear-plugin-2.10.1.pom

      Downloading: https://repo.maven.apache.org/maven2/org/apache/maven/plugins/maven-ear-plugin/2.10.1/maven-ear-plugin-2.10.1.pom

      Downloaded: https://repo.maven.apache.org/maven2/org/apache/maven/plugins/maven-ear-plugin/2.10.1/maven-ear-plugin-2.10.1.pom (10 KB at 164.6 KB/sec)

      Downloading: https://maven.repository.redhat.com/ga/org/apache/maven/plugins/maven-ear-plugin/2.10.1/maven-ear-plugin-2.10.1.jar

      Downloading: https://maven.repository.redhat.com/earlyaccess/all/org/apache/maven/plugins/maven-ear-plugin/2.10.1/maven-ear-plugin-2.10.1.jar

      Downloading: https://repository.jboss.org/nexus/content/groups/public/org/apache/maven/plugins/maven-ear-plugin/2.10.1/maven-ear-plugin-2.10.1.jar

      Downloading: https://repo.maven.apache.org/maven2/org/apache/maven/plugins/maven-ear-plugin/2.10.1/maven-ear-plugin-2.10.1.jar

      Downloaded: https://repo.maven.apache.org/maven2/org/apache/maven/plugins/maven-ear-plugin/2.10.1/maven-ear-plugin-2.10.1.jar (90 KB at 1156.9 KB/sec)

      Downloading: https://maven.repository.redhat.com/ga/org/wildfly/plugins/wildfly-maven-plugin/1.2.0.Alpha2/wildfly-maven-plugin-1.2.0.Alpha2.pom

      Downloading: https://maven.repository.redhat.com/earlyaccess/all/org/wildfly/plugins/wildfly-maven-plugin/1.2.0.Alpha2/wildfly-maven-plugin-1.2.0.Alpha2.pom

      Downloading: https://repository.jboss.org/nexus/content/groups/public/org/wildfly/plugins/wildfly-maven-plugin/1.2.0.Alpha2/wildfly-maven-plugin-1.2.0.Alpha2.pom

      Downloaded: https://repository.jboss.org/nexus/content/groups/public/org/wildfly/plugins/wildfly-maven-plugin/1.2.0.Alpha2/wildfly-maven-plugin-1.2.0.Alpha2.pom (8 KB at 13.5 KB/sec)

      Downloading: https://maven.repository.redhat.com/ga/org/wildfly/plugins/wildfly-maven-plugin-parent/1.2.0.Alpha2/wildfly-maven-plugin-parent-1.2.0.Alpha2.pom

      Downloading: https://maven.repository.redhat.com/earlyaccess/all/org/wildfly/plugins/wildfly-maven-plugin-parent/1.2.0.Alpha2/wildfly-maven-plugin-parent-1.2.0.Alpha2.pom

      Downloading: https://repository.jboss.org/nexus/content/groups/public/org/wildfly/plugins/wildfly-maven-plugin-parent/1.2.0.Alpha2/wildfly-maven-plugin-parent-1.2.0.Alpha2.pom

      Downloaded: https://repository.jboss.org/nexus/content/groups/public/org/wildfly/plugins/wildfly-maven-plugin-parent/1.2.0.Alpha2/wildfly-maven-plugin-parent-1.2.0.Alpha2.pom (16 KB at 54.5 KB/sec)

      Downloading: https://maven.repository.redhat.com/ga/org/wildfly/plugins/wildfly-maven-plugin/1.2.0.Alpha2/wildfly-maven-plugin-1.2.0.Alpha2.jar

      Downloading: https://maven.repository.redhat.com/earlyaccess/all/org/wildfly/plugins/wildfly-maven-plugin/1.2.0.Alpha2/wildfly-maven-plugin-1.2.0.Alpha2.jar

      Downloading: https://repository.jboss.org/nexus/content/groups/public/org/wildfly/plugins/wildfly-maven-plugin/1.2.0.Alpha2/wildfly-maven-plugin-1.2.0.Alpha2.jar

      Downloaded: https://repository.jboss.org/nexus/content/groups/public/org/wildfly/plugins/wildfly-maven-plugin/1.2.0.Alpha2/wildfly-maven-plugin-1.2.0.Alpha2.jar (111 KB at 209.7 KB/sec)

      [INFO]                                                                       

      [INFO] ------------------------------------------------------------------------

      [INFO] Building WildFly Quickstart: helloworld 11.0.0-SNAPSHOT

      [INFO] ------------------------------------------------------------------------

      [INFO]

      [INFO] --- maven-clean-plugin:3.0.0:clean (default-clean) @ helloworld ---

      Downloading: https://maven.repository.redhat.com/ga/org/codehaus/plexus/plexus-utils/2.0.4/plexus-utils-2.0.4.jar

      Downloading: https://maven.repository.redhat.com/ga/org/apache/maven/shared/maven-shared-utils/3.0.0/maven-shared-utils-3.0.0.jar

      Downloading: https://maven.repository.redhat.com/ga/commons-io/commons-io/2.4/commons-io-2.4.jar

      Downloaded: https://maven.repository.redhat.com/ga/commons-io/commons-io/2.4/commons-io-2.4.jar (181 KB at 779.3 KB/sec)

      Downloaded: https://maven.repository.redhat.com/ga/org/apache/maven/shared/maven-shared-utils/3.0.0/maven-shared-utils-3.0.0.jar (152 KB at 651.2 KB/sec)

      Downloaded: https://maven.repository.redhat.com/ga/org/codehaus/plexus/plexus-utils/2.0.4/plexus-utils-2.0.4.jar (217 KB at 828.0 KB/sec)

      [INFO]

      [INFO] --- maven-enforcer-plugin:1.4.1:enforce (enforce-java-version) @ helloworld ---

      Downloading: https://maven.repository.redhat.com/ga/commons-lang/commons-lang/2.3/commons-lang-2.3.pom

      Downloaded: https://maven.repository.redhat.com/ga/commons-lang/commons-lang/2.3/commons-lang-2.3.pom (11 KB at 148.7 KB/sec)

      Downloading: https://maven.repository.redhat.com/ga/org/apache/maven/enforcer/enforcer-api/1.4.1/enforcer-api-1.4.1.pom

      Downloading: https://maven.repository.redhat.com/earlyaccess/all/org/apache/maven/enforcer/enforcer-api/1.4.1/enforcer-api-1.4.1.pom

      Downloading: https://repository.jboss.org/nexus/content/groups/public/org/apache/maven/enforcer/enforcer-api/1.4.1/enforcer-api-1.4.1.pom

      Downloading: https://repo.maven.apache.org/maven2/org/apache/maven/enforcer/enforcer-api/1.4.1/enforcer-api-1.4.1.pom

      Downloaded: https://repo.maven.apache.org/maven2/org/apache/maven/enforcer/enforcer-api/1.4.1/enforcer-api-1.4.1.pom (3 KB at 38.3 KB/sec)

      Downloading: https://maven.repository.redhat.com/ga/org/apache/maven/enforcer/enforcer-rules/1.4.1/enforcer-rules-1.4.1.pom

      Downloading: https://maven.repository.redhat.com/earlyaccess/all/org/apache/maven/enforcer/enforcer-rules/1.4.1/enforcer-rules-1.4.1.pom

      Downloading: https://repository.jboss.org/nexus/content/groups/public/org/apache/maven/enforcer/enforcer-rules/1.4.1/enforcer-rules-1.4.1.pom

      Downloading: https://repo.maven.apache.org/maven2/org/apache/maven/enforcer/enforcer-rules/1.4.1/enforcer-rules-1.4.1.pom

      Downloaded: https://repo.maven.apache.org/maven2/org/apache/maven/enforcer/enforcer-rules/1.4.1/enforcer-rules-1.4.1.pom (4 KB at 57.5 KB/sec)

      Downloading: https://maven.repository.redhat.com/ga/org/apache/maven/shared/maven-dependency-tree/2.2/maven-dependency-tree-2.2.pom

      Downloaded: https://maven.repository.redhat.com/ga/org/apache/maven/shared/maven-dependency-tree/2.2/maven-dependency-tree-2.2.pom (8 KB at 17.3 KB/sec)

      Downloading: https://maven.repository.redhat.com/ga/org/apache/maven/shared/maven-shared-components/20/maven-shared-components-20.pom

      Downloaded: https://maven.repository.redhat.com/ga/org/apache/maven/shared/maven-shared-components/20/maven-shared-components-20.pom (5 KB at 97.8 KB/sec)

      Downloading: https://maven.repository.redhat.com/ga/org/codehaus/plexus/plexus-i18n/1.0-beta-6/plexus-i18n-1.0-beta-6.pom

      Downloaded: https://maven.repository.redhat.com/ga/org/codehaus/plexus/plexus-i18n/1.0-beta-6/plexus-i18n-1.0-beta-6.pom (771 B at 2.2 KB/sec)

      Downloading: https://maven.repository.redhat.com/ga/org/apache/maven/plugin-testing/maven-plugin-testing-harness/1.3/maven-plugin-testing-harness-1.3.pom

      Downloaded: https://maven.repository.redhat.com/ga/org/apache/maven/plugin-testing/maven-plugin-testing-harness/1.3/maven-plugin-testing-harness-1.3.pom (4 KB at 8.3 KB/sec)

      Downloading: https://maven.repository.redhat.com/ga/org/apache/maven/plugin-testing/maven-plugin-testing/1.3/maven-plugin-testing-1.3.pom

      Downloaded: https://maven.repository.redhat.com/ga/org/apache/maven/plugin-testing/maven-plugin-testing/1.3/maven-plugin-testing-1.3.pom (10 KB at 18.9 KB/sec)

      Downloading: https://maven.repository.redhat.com/ga/org/codehaus/plexus/plexus-archiver/2.2/plexus-archiver-2.2.pom

      Downloaded: https://maven.repository.redhat.com/ga/org/codehaus/plexus/plexus-archiver/2.2/plexus-archiver-2.2.pom (4 KB at 5.6 KB/sec)

      Downloading: https://maven.repository.redhat.com/ga/org/codehaus/plexus/plexus-components/1.1.20/plexus-components-1.1.20.pom

      Downloaded: https://maven.repository.redhat.com/ga/org/codehaus/plexus/plexus-components/1.1.20/plexus-components-1.1.20.pom (3 KB at 7.6 KB/sec)

      Downloading: https://maven.repository.redhat.com/ga/org/codehaus/plexus/plexus-utils/3.0.22/plexus-utils-3.0.22.jar

      Downloading: https://maven.repository.redhat.com/ga/commons-lang/commons-lang/2.3/commons-lang-2.3.jar

      Downloading: https://maven.repository.redhat.com/ga/org/apache/maven/enforcer/enforcer-rules/1.4.1/enforcer-rules-1.4.1.jar

      Downloading: https://maven.repository.redhat.com/ga/org/apache/maven/shared/maven-dependency-tree/2.2/maven-dependency-tree-2.2.jar

      Downloading: https://maven.repository.redhat.com/ga/org/apache/maven/enforcer/enforcer-api/1.4.1/enforcer-api-1.4.1.jar

      Downloaded: https://maven.repository.redhat.com/ga/commons-lang/commons-lang/2.3/commons-lang-2.3.jar (240 KB at 446.9 KB/sec)

      Downloading: https://maven.repository.redhat.com/ga/org/codehaus/plexus/plexus-i18n/1.0-beta-6/plexus-i18n-1.0-beta-6.jar

      Downloading: https://maven.repository.redhat.com/ga/org/apache/maven/plugin-testing/maven-plugin-testing-harness/1.3/maven-plugin-testing-harness-1.3.jar

      Downloading: https://maven.repository.redhat.com/ga/org/codehaus/plexus/plexus-archiver/2.2/plexus-archiver-2.2.jar

      Downloaded: https://maven.repository.redhat.com/ga/org/apache/maven/shared/maven-dependency-tree/2.2/maven-dependency-tree-2.2.jar (63 KB at 75.2 KB/sec)

      Downloaded: https://maven.repository.redhat.com/ga/org/codehaus/plexus/plexus-i18n/1.0-beta-6/plexus-i18n-1.0-beta-6.jar (12 KB at 13.9 KB/sec)

      Downloaded: https://maven.repository.redhat.com/ga/org/codehaus/plexus/plexus-utils/3.0.22/plexus-utils-3.0.22.jar (240 KB at 260.2 KB/sec)

      Downloaded: https://maven.repository.redhat.com/ga/org/apache/maven/plugin-testing/maven-plugin-testing-harness/1.3/maven-plugin-testing-harness-1.3.jar (35 KB at 34.9 KB/sec)

      Downloaded: https://maven.repository.redhat.com/ga/org/codehaus/plexus/plexus-archiver/2.2/plexus-archiver-2.2.jar (181 KB at 161.6 KB/sec)

      Downloading: https://maven.repository.redhat.com/earlyaccess/all/org/apache/maven/enforcer/enforcer-api/1.4.1/enforcer-api-1.4.1.jar

      Downloading: https://maven.repository.redhat.com/earlyaccess/all/org/apache/maven/enforcer/enforcer-rules/1.4.1/enforcer-rules-1.4.1.jar

      Downloading: https://repository.jboss.org/nexus/content/groups/public/org/apache/maven/enforcer/enforcer-rules/1.4.1/enforcer-rules-1.4.1.jar

      Downloading: https://repository.jboss.org/nexus/content/groups/public/org/apache/maven/enforcer/enforcer-api/1.4.1/enforcer-api-1.4.1.jar

      Downloading: https://repo.maven.apache.org/maven2/org/apache/maven/enforcer/enforcer-api/1.4.1/enforcer-api-1.4.1.jar

      Downloading: https://repo.maven.apache.org/maven2/org/apache/maven/enforcer/enforcer-rules/1.4.1/enforcer-rules-1.4.1.jar

      Downloaded: https://repo.maven.apache.org/maven2/org/apache/maven/enforcer/enforcer-api/1.4.1/enforcer-api-1.4.1.jar (12 KB at 197.8 KB/sec)

      Downloaded: https://repo.maven.apache.org/maven2/org/apache/maven/enforcer/enforcer-rules/1.4.1/enforcer-rules-1.4.1.jar (97 KB at 279.9 KB/sec)

      [INFO]

      [INFO] --- maven-enforcer-plugin:1.4.1:enforce (enforce-maven-version) @ helloworld ---

      [INFO]

      [INFO] --- buildnumber-maven-plugin:1.4:create (get-scm-revision) @ helloworld ---

      Downloading: https://maven.repository.redhat.com/ga/org/apache/maven/scm/maven-scm-api/1.9.4/maven-scm-api-1.9.4.pom

      Downloading: https://maven.repository.redhat.com/earlyaccess/all/org/apache/maven/scm/maven-scm-api/1.9.4/maven-scm-api-1.9.4.pom

      Downloading: https://repository.jboss.org/nexus/content/groups/public/org/apache/maven/scm/maven-scm-api/1.9.4/maven-scm-api-1.9.4.pom

      Downloading: https://repo.maven.apache.org/maven2/org/apache/maven/scm/maven-scm-api/1.9.4/maven-scm-api-1.9.4.pom

      Downloaded: https://repo.maven.apache.org/maven2/org/apache/maven/scm/maven-scm-api/1.9.4/maven-scm-api-1.9.4.pom (2 KB at 27.1 KB/sec)

      Downloading: https://maven.repository.redhat.com/ga/org/apache/maven/scm/maven-scm/1.9.4/maven-scm-1.9.4.pom

      Downloading: https://maven.repository.redhat.com/earlyaccess/all/org/apache/maven/scm/maven-scm/1.9.4/maven-scm-1.9.4.pom

      Downloading: https://repository.jboss.org/nexus/content/groups/public/org/apache/maven/scm/maven-scm/1.9.4/maven-scm-1.9.4.pom

      Downloading: https://repo.maven.apache.org/maven2/org/apache/maven/scm/maven-scm/1.9.4/maven-scm-1.9.4.pom

      Downloaded: https://repo.maven.apache.org/maven2/org/apache/maven/scm/maven-scm/1.9.4/maven-scm-1.9.4.pom (22 KB at 284.1 KB/sec)

      Downloading: https://maven.repository.redhat.com/ga/org/codehaus/plexus/plexus-utils/3.0.15/plexus-utils-3.0.15.pom

      Downloaded: https://maven.repository.redhat.com/ga/org/codehaus/plexus/plexus-utils/3.0.15/plexus-utils-3.0.15.pom (4 KB at 7.0 KB/sec)

      Downloading: https://maven.repository.redhat.com/ga/org/apache/maven/scm/maven-scm-manager-plexus/1.9.4/maven-scm-manager-plexus-1.9.4.pom

      Downloading: https://maven.repository.redhat.com/earlyaccess/all/org/apache/maven/scm/maven-scm-manager-plexus/1.9.4/maven-scm-manager-plexus-1.9.4.pom

      Downloading: https://repository.jboss.org/nexus/content/groups/public/org/apache/maven/scm/maven-scm-manager-plexus/1.9.4/maven-scm-manager-plexus-1.9.4.pom

      Downloading: https://repo.maven.apache.org/maven2/org/apache/maven/scm/maven-scm-manager-plexus/1.9.4/maven-scm-manager-plexus-1.9.4.pom

      Downloaded: https://repo.maven.apache.org/maven2/org/apache/maven/scm/maven-scm-manager-plexus/1.9.4/maven-scm-manager-plexus-1.9.4.pom (3 KB at 35.5 KB/sec)

      Downloading: https://maven.repository.redhat.com/ga/org/apache/maven/scm/maven-scm-managers/1.9.4/maven-scm-managers-1.9.4.pom

      Downloading: https://maven.repository.redhat.com/earlyaccess/all/org/apache/maven/scm/maven-scm-managers/1.9.4/maven-scm-managers-1.9.4.pom

      Downloading: https://repository.jboss.org/nexus/content/groups/public/org/apache/maven/scm/maven-scm-managers/1.9.4/maven-scm-managers-1.9.4.pom

      Downloading: https://repo.maven.apache.org/maven2/org/apache/maven/scm/maven-scm-managers/1.9.4/maven-scm-managers-1.9.4.pom

      Downloaded: https://repo.maven.apache.org/maven2/org/apache/maven/scm/maven-scm-managers/1.9.4/maven-scm-managers-1.9.4.pom (2 KB at 29.7 KB/sec)

      Downloading: https://maven.repository.redhat.com/ga/org/apache/maven/scm/maven-scm-provider-bazaar/1.9.4/maven-scm-provider-bazaar-1.9.4.pom

      Downloading: https://maven.repository.redhat.com/earlyaccess/all/org/apache/maven/scm/maven-scm-provider-bazaar/1.9.4/maven-scm-provider-bazaar-1.9.4.pom

      Downloading: https://repository.jboss.org/nexus/content/groups/public/org/apache/maven/scm/maven-scm-provider-bazaar/1.9.4/maven-scm-provider-bazaar-1.9.4.pom

      Downloading: https://repo.maven.apache.org/maven2/org/apache/maven/scm/maven-scm-provider-bazaar/1.9.4/maven-scm-provider-bazaar-1.9.4.pom

      Downloaded: https://repo.maven.apache.org/maven2/org/apache/maven/scm/maven-scm-provider-bazaar/1.9.4/maven-scm-provider-bazaar-1.9.4.pom (2 KB at 34.3 KB/sec)

      Downloading: https://maven.repository.redhat.com/ga/org/apache/maven/scm/maven-scm-providers/1.9.4/maven-scm-providers-1.9.4.pom

      Downloading: https://maven.repository.redhat.com/earlyaccess/all/org/apache/maven/scm/maven-scm-providers/1.9.4/maven-scm-providers-1.9.4.pom

      Downloading: https://repository.jboss.org/nexus/content/groups/public/org/apache/maven/scm/maven-scm-providers/1.9.4/maven-scm-providers-1.9.4.pom

      Downloading: https://repo.maven.apache.org/maven2/org/apache/maven/scm/maven-scm-providers/1.9.4/maven-scm-providers-1.9.4.pom

      Downloaded: https://repo.maven.apache.org/maven2/org/apache/maven/scm/maven-scm-providers/1.9.4/maven-scm-providers-1.9.4.pom (4 KB at 63.4 KB/sec)

      Downloading: https://maven.repository.redhat.com/ga/org/apache/maven/scm/maven-scm-provider-svnexe/1.9.4/maven-scm-provider-svnexe-1.9.4.pom

      Downloading: https://maven.repository.redhat.com/earlyaccess/all/org/apache/maven/scm/maven-scm-provider-svnexe/1.9.4/maven-scm-provider-svnexe-1.9.4.pom

      Downloading: https://repository.jboss.org/nexus/content/groups/public/org/apache/maven/scm/maven-scm-provider-svnexe/1.9.4/maven-scm-provider-svnexe-1.9.4.pom

      Downloading: https://repo.maven.apache.org/maven2/org/apache/maven/scm/maven-scm-provider-svnexe/1.9.4/maven-scm-provider-svnexe-1.9.4.pom

      Downloaded: https://repo.maven.apache.org/maven2/org/apache/maven/scm/maven-scm-provider-svnexe/1.9.4/maven-scm-provider-svnexe-1.9.4.pom (3 KB at 52.7 KB/sec)

      Downloading: https://maven.repository.redhat.com/ga/org/apache/maven/scm/maven-scm-providers-svn/1.9.4/maven-scm-providers-svn-1.9.4.pom

      Downloading: https://maven.repository.redhat.com/earlyaccess/all/org/apache/maven/scm/maven-scm-providers-svn/1.9.4/maven-scm-providers-svn-1.9.4.pom

      Downloading: https://repository.jboss.org/nexus/content/groups/public/org/apache/maven/scm/maven-scm-providers-svn/1.9.4/maven-scm-providers-svn-1.9.4.pom

      Downloading: https://repo.maven.apache.org/maven2/org/apache/maven/scm/maven-scm-providers-svn/1.9.4/maven-scm-providers-svn-1.9.4.pom

      Downloaded: https://repo.maven.apache.org/maven2/org/apache/maven/scm/maven-scm-providers-svn/1.9.4/maven-scm-providers-svn-1.9.4.pom (3 KB at 41.5 KB/sec)

      Downloading: https://maven.repository.redhat.com/ga/org/apache/maven/scm/maven-scm-provider-svn-commons/1.9.4/maven-scm-provider-svn-commons-1.9.4.pom

      Downloading: https://maven.repository.redhat.com/earlyaccess/all/org/apache/maven/scm/maven-scm-provider-svn-commons/1.9.4/maven-scm-provider-svn-commons-1.9.4.pom

      Downloading: https://repository.jboss.org/nexus/content/groups/public/org/apache/maven/scm/maven-scm-provider-svn-commons/1.9.4/maven-scm-provider-svn-commons-1.9.4.pom

      Downloading: https://repo.maven.apache.org/maven2/org/apache/maven/scm/maven-scm-provider-svn-commons/1.9.4/maven-scm-provider-svn-commons-1.9.4.pom

      Downloaded: https://repo.maven.apache.org/maven2/org/apache/maven/scm/maven-scm-provider-svn-commons/1.9.4/maven-scm-provider-svn-commons-1.9.4.pom (3 KB at 58.6 KB/sec)

      Downloading: https://maven.repository.redhat.com/ga/org/apache/maven/scm/maven-scm-provider-gitexe/1.9.4/maven-scm-provider-gitexe-1.9.4.pom

      Downloading: https://maven.repository.redhat.com/earlyaccess/all/org/apache/maven/scm/maven-scm-provider-gitexe/1.9.4/maven-scm-provider-gitexe-1.9.4.pom

      Downloading: https://repository.jboss.org/nexus/content/groups/public/org/apache/maven/scm/maven-scm-provider-gitexe/1.9.4/maven-scm-provider-gitexe-1.9.4.pom

      Downloading: https://repo.maven.apache.org/maven2/org/apache/maven/scm/maven-scm-provider-gitexe/1.9.4/maven-scm-provider-gitexe-1.9.4.pom

      Downloaded: https://repo.maven.apache.org/maven2/org/apache/maven/scm/maven-scm-provider-gitexe/1.9.4/maven-scm-provider-gitexe-1.9.4.pom (3 KB at 56.1 KB/sec)

      Downloading: https://maven.repository.redhat.com/ga/org/apache/maven/scm/maven-scm-providers-git/1.9.4/maven-scm-providers-git-1.9.4.pom

      Downloading: https://maven.repository.redhat.com/earlyaccess/all/org/apache/maven/scm/maven-scm-providers-git/1.9.4/maven-scm-providers-git-1.9.4.pom

      Downloading: https://repository.jboss.org/nexus/content/groups/public/org/apache/maven/scm/maven-scm-providers-git/1.9.4/maven-scm-providers-git-1.9.4.pom

      Downloading: https://repo.maven.apache.org/maven2/org/apache/maven/scm/maven-scm-providers-git/1.9.4/maven-scm-providers-git-1.9.4.pom

      Downloaded: https://repo.maven.apache.org/maven2/org/apache/maven/scm/maven-scm-providers-git/1.9.4/maven-scm-providers-git-1.9.4.pom (3 KB at 37.6 KB/sec)

      Downloading: https://maven.repository.redhat.com/ga/org/apache/maven/scm/maven-scm-provider-git-commons/1.9.4/maven-scm-provider-git-commons-1.9.4.pom

      Downloading: https://maven.repository.redhat.com/earlyaccess/all/org/apache/maven/scm/maven-scm-provider-git-commons/1.9.4/maven-scm-provider-git-commons-1.9.4.pom

      Downloading: https://repository.jboss.org/nexus/content/groups/public/org/apache/maven/scm/maven-scm-provider-git-commons/1.9.4/maven-scm-provider-git-commons-1.9.4.pom

      Downloading: https://repo.maven.apache.org/maven2/org/apache/maven/scm/maven-scm-provider-git-commons/1.9.4/maven-scm-provider-git-commons-1.9.4.pom

      Downloaded: https://repo.maven.apache.org/maven2/org/apache/maven/scm/maven-scm-provider-git-commons/1.9.4/maven-scm-provider-git-commons-1.9.4.pom (3 KB at 43.2 KB/sec)

      Downloading: https://maven.repository.redhat.com/ga/org/apache/maven/scm/maven-scm-provider-cvsexe/1.9.4/maven-scm-provider-cvsexe-1.9.4.pom

      Downloading: https://maven.repository.redhat.com/earlyaccess/all/org/apache/maven/scm/maven-scm-provider-cvsexe/1.9.4/maven-scm-provider-cvsexe-1.9.4.pom

      Downloading: https://repository.jboss.org/nexus/content/groups/public/org/apache/maven/scm/maven-scm-provider-cvsexe/1.9.4/maven-scm-provider-cvsexe-1.9.4.pom

      Downloading: https://repo.maven.apache.org/maven2/org/apache/maven/scm/maven-scm-provider-cvsexe/1.9.4/maven-scm-provider-cvsexe-1.9.4.pom

      Downloaded: https://repo.maven.apache.org/maven2/org/apache/maven/scm/maven-scm-provider-cvsexe/1.9.4/maven-scm-provider-cvsexe-1.9.4.pom (3 KB at 49.7 KB/sec)

      Downloading: https://maven.repository.redhat.com/ga/org/apache/maven/scm/maven-scm-providers-cvs/1.9.4/maven-scm-providers-cvs-1.9.4.pom

      Downloading: https://maven.repository.redhat.com/earlyaccess/all/org/apache/maven/scm/maven-scm-providers-cvs/1.9.4/maven-scm-providers-cvs-1.9.4.pom

      Downloading: https://repository.jboss.org/nexus/content/groups/public/org/apache/maven/scm/maven-scm-providers-cvs/1.9.4/maven-scm-providers-cvs-1.9.4.pom

      Downloading: https://repo.maven.apache.org/maven2/org/apache/maven/scm/maven-scm-providers-cvs/1.9.4/maven-scm-providers-cvs-1.9.4.pom

      Downloaded: https://repo.maven.apache.org/maven2/org/apache/maven/scm/maven-scm-providers-cvs/1.9.4/maven-scm-providers-cvs-1.9.4.pom (2 KB at 32.8 KB/sec)

      Downloading: https://maven.repository.redhat.com/ga/org/apache/maven/scm/maven-scm-provider-cvs-commons/1.9.4/maven-scm-provider-cvs-commons-1.9.4.pom

      Downloading: https://maven.repository.redhat.com/earlyaccess/all/org/apache/maven/scm/maven-scm-provider-cvs-commons/1.9.4/maven-scm-provider-cvs-commons-1.9.4.pom

      Downloading: https://repository.jboss.org/nexus/content/groups/public/org/apache/maven/scm/maven-scm-provider-cvs-commons/1.9.4/maven-scm-provider-cvs-commons-1.9.4.pom

      Downloading: https://repo.maven.apache.org/maven2/org/apache/maven/scm/maven-scm-provider-cvs-commons/1.9.4/maven-scm-provider-cvs-commons-1.9.4.pom

      Downloaded: https://repo.maven.apache.org/maven2/org/apache/maven/scm/maven-scm-provider-cvs-commons/1.9.4/maven-scm-provider-cvs-commons-1.9.4.pom (3 KB at 41.2 KB/sec)

      Downloading: https://maven.repository.redhat.com/ga/org/apache/maven/scm/maven-scm-provider-starteam/1.9.4/maven-scm-provider-starteam-1.9.4.pom

      Downloading: https://maven.repository.redhat.com/earlyaccess/all/org/apache/maven/scm/maven-scm-provider-starteam/1.9.4/maven-scm-provider-starteam-1.9.4.pom

      Downloading: https://repository.jboss.org/nexus/content/groups/public/org/apache/maven/scm/maven-scm-provider-starteam/1.9.4/maven-scm-provider-starteam-1.9.4.pom

      Downloading: https://repo.maven.apache.org/maven2/org/apache/maven/scm/maven-scm-provider-starteam/1.9.4/maven-scm-provider-starteam-1.9.4.pom

      Downloaded: https://repo.maven.apache.org/maven2/org/apache/maven/scm/maven-scm-provider-starteam/1.9.4/maven-scm-provider-starteam-1.9.4.pom (3 KB at 53.8 KB/sec)

      Downloading: https://maven.repository.redhat.com/ga/org/apache/maven/scm/maven-scm-provider-clearcase/1.9.4/maven-scm-provider-clearcase-1.9.4.pom

      Downloading: https://maven.repository.redhat.com/earlyaccess/all/org/apache/maven/scm/maven-scm-provider-clearcase/1.9.4/maven-scm-provider-clearcase-1.9.4.pom

      Downloading: https://repository.jboss.org/nexus/content/groups/public/org/apache/maven/scm/maven-scm-provider-clearcase/1.9.4/maven-scm-provider-clearcase-1.9.4.pom

      Downloading: https://repo.maven.apache.org/maven2/org/apache/maven/scm/maven-scm-provider-clearcase/1.9.4/maven-scm-provider-clearcase-1.9.4.pom

      Downloaded: https://repo.maven.apache.org/maven2/org/apache/maven/scm/maven-scm-provider-clearcase/1.9.4/maven-scm-provider-clearcase-1.9.4.pom (3 KB at 50.6 KB/sec)

      Downloading: https://maven.repository.redhat.com/ga/org/apache/maven/scm/maven-scm-provider-perforce/1.9.4/maven-scm-provider-perforce-1.9.4.pom

      Downloading: https://maven.repository.redhat.com/earlyaccess/all/org/apache/maven/scm/maven-scm-provider-perforce/1.9.4/maven-scm-provider-perforce-1.9.4.pom

      Downloading: https://repository.jboss.org/nexus/content/groups/public/org/apache/maven/scm/maven-scm-provider-perforce/1.9.4/maven-scm-provider-perforce-1.9.4.pom

      Downloading: https://repo.maven.apache.org/maven2/org/apache/maven/scm/maven-scm-provider-perforce/1.9.4/maven-scm-provider-perforce-1.9.4.pom

      Downloaded: https://repo.maven.apache.org/maven2/org/apache/maven/scm/maven-scm-provider-perforce/1.9.4/maven-scm-provider-perforce-1.9.4.pom (3 KB at 41.4 KB/sec)

      Downloading: https://maven.repository.redhat.com/ga/org/apache/maven/scm/maven-scm-provider-hg/1.9.4/maven-scm-provider-hg-1.9.4.pom

      Downloading: https://maven.repository.redhat.com/earlyaccess/all/org/apache/maven/scm/maven-scm-provider-hg/1.9.4/maven-scm-provider-hg-1.9.4.pom

      Downloading: https://repository.jboss.org/nexus/content/groups/public/org/apache/maven/scm/maven-scm-provider-hg/1.9.4/maven-scm-provider-hg-1.9.4.pom

      Downloading: https://repo.maven.apache.org/maven2/org/apache/maven/scm/maven-scm-provider-hg/1.9.4/maven-scm-provider-hg-1.9.4.pom

      Downloaded: https://repo.maven.apache.org/maven2/org/apache/maven/scm/maven-scm-provider-hg/1.9.4/maven-scm-provider-hg-1.9.4.pom (3 KB at 39.7 KB/sec)

      Downloading: https://maven.repository.redhat.com/ga/com/google/code/maven-scm-provider-svnjava/maven-scm-provider-svnjava/2.1.1/maven-scm-provider-svnjava-2.1.1.pom

      Downloading: https://maven.repository.redhat.com/earlyaccess/all/com/google/code/maven-scm-provider-svnjava/maven-scm-provider-svnjava/2.1.1/maven-scm-provider-svnjava-2.1.1.pom

      Downloading: https://repository.jboss.org/nexus/content/groups/public/com/google/code/maven-scm-provider-svnjava/maven-scm-provider-svnjava/2.1.1/maven-scm-provider-svnjava-2.1.1.pom

      Downloading: https://repo.maven.apache.org/maven2/com/google/code/maven-scm-provider-svnjava/maven-scm-provider-svnjava/2.1.1/maven-scm-provider-svnjava-2.1.1.pom

      Downloaded: https://repo.maven.apache.org/maven2/com/google/code/maven-scm-provider-svnjava/maven-scm-provider-svnjava/2.1.1/maven-scm-provider-svnjava-2.1.1.pom (10 KB at 187.3 KB/sec)

      Downloading: https://maven.repository.redhat.com/ga/org/apache/maven/scm/maven-scm-provider-svn-commons/1.8/maven-scm-provider-svn-commons-1.8.pom

      Downloaded: https://maven.repository.redhat.com/ga/org/apache/maven/scm/maven-scm-provider-svn-commons/1.8/maven-scm-provider-svn-commons-1.8.pom (3 KB at 5.3 KB/sec)

      Downloading: https://maven.repository.redhat.com/ga/org/apache/maven/scm/maven-scm-providers-svn/1.8/maven-scm-providers-svn-1.8.pom

      Downloaded: https://maven.repository.redhat.com/ga/org/apache/maven/scm/maven-scm-providers-svn/1.8/maven-scm-providers-svn-1.8.pom (3 KB at 4.5 KB/sec)

      Downloading: https://maven.repository.redhat.com/ga/org/apache/maven/scm/maven-scm-providers/1.8/maven-scm-providers-1.8.pom

      Downloaded: https://maven.repository.redhat.com/ga/org/apache/maven/scm/maven-scm-providers/1.8/maven-scm-providers-1.8.pom (4 KB at 8.0 KB/sec)

      Downloading: https://maven.repository.redhat.com/ga/org/apache/maven/scm/maven-scm/1.8/maven-scm-1.8.pom

      Downloaded: https://maven.repository.redhat.com/ga/org/apache/maven/scm/maven-scm/1.8/maven-scm-1.8.pom (21 KB at 45.3 KB/sec)

      Downloading: https://maven.repository.redhat.com/ga/org/apache/maven/scm/maven-scm-api/1.8/maven-scm-api-1.8.pom

      Downloaded: https://maven.repository.redhat.com/ga/org/apache/maven/scm/maven-scm-api/1.8/maven-scm-api-1.8.pom (2 KB at 2.8 KB/sec)

      Downloading: https://maven.repository.redhat.com/ga/org/codehaus/plexus/plexus-utils/3.0.3/plexus-utils-3.0.3.pom

      Downloaded: https://maven.repository.redhat.com/ga/org/codehaus/plexus/plexus-utils/3.0.3/plexus-utils-3.0.3.pom (3 KB at 4.9 KB/sec)

      Downloading: https://maven.repository.redhat.com/ga/net/java/dev/jna/jna/3.5.2/jna-3.5.2.pom

      Downloading: https://maven.repository.redhat.com/earlyaccess/all/net/java/dev/jna/jna/3.5.2/jna-3.5.2.pom

      Downloading: https://repository.jboss.org/nexus/content/groups/public/net/java/dev/jna/jna/3.5.2/jna-3.5.2.pom

      Downloading: https://repo.maven.apache.org/maven2/net/java/dev/jna/jna/3.5.2/jna-3.5.2.pom

      Downloaded: https://repo.maven.apache.org/maven2/net/java/dev/jna/jna/3.5.2/jna-3.5.2.pom (2 KB at 21.2 KB/sec)

      Downloading: https://maven.repository.redhat.com/ga/org/codehaus/plexus/plexus-utils/3.0.14/plexus-utils-3.0.14.pom

      Downloading: https://maven.repository.redhat.com/earlyaccess/all/org/codehaus/plexus/plexus-utils/3.0.14/plexus-utils-3.0.14.pom

      Downloading: https://repository.jboss.org/nexus/content/groups/public/org/codehaus/plexus/plexus-utils/3.0.14/plexus-utils-3.0.14.pom

      Downloading: https://repo.maven.apache.org/maven2/org/codehaus/plexus/plexus-utils/3.0.14/plexus-utils-3.0.14.pom

      Downloaded: https://repo.maven.apache.org/maven2/org/codehaus/plexus/plexus-utils/3.0.14/plexus-utils-3.0.14.pom (4 KB at 60.2 KB/sec)

      Downloading: https://maven.repository.redhat.com/ga/org/tmatesoft/svnkit/svnkit/1.8.5/svnkit-1.8.5.pom

      Downloading: https://maven.repository.redhat.com/earlyaccess/all/org/tmatesoft/svnkit/svnkit/1.8.5/svnkit-1.8.5.pom

      Downloading: https://repository.jboss.org/nexus/content/groups/public/org/tmatesoft/svnkit/svnkit/1.8.5/svnkit-1.8.5.pom

      Downloading: https://repo.maven.apache.org/maven2/org/tmatesoft/svnkit/svnkit/1.8.5/svnkit-1.8.5.pom

      Downloaded: https://repo.maven.apache.org/maven2/org/tmatesoft/svnkit/svnkit/1.8.5/svnkit-1.8.5.pom (3 KB at 51.0 KB/sec)

      Downloading: https://maven.repository.redhat.com/ga/com/jcraft/jsch.agentproxy.svnkit-trilead-ssh2/0.0.7/jsch.agentproxy.svnkit-trilead-ssh2-0.0.7.pom

      Downloading: https://maven.repository.redhat.com/earlyaccess/all/com/jcraft/jsch.agentproxy.svnkit-trilead-ssh2/0.0.7/jsch.agentproxy.svnkit-trilead-ssh2-0.0.7.pom

      Downloading: https://repository.jboss.org/nexus/content/groups/public/com/jcraft/jsch.agentproxy.svnkit-trilead-ssh2/0.0.7/jsch.agentproxy.svnkit-trilead-ssh2-0.0.7.pom

      Downloading: https://repo.maven.apache.org/maven2/com/jcraft/jsch.agentproxy.svnkit-trilead-ssh2/0.0.7/jsch.agentproxy.svnkit-trilead-ssh2-0.0.7.pom

      Downloaded: https://repo.maven.apache.org/maven2/com/jcraft/jsch.agentproxy.svnkit-trilead-ssh2/0.0.7/jsch.agentproxy.svnkit-trilead-ssh2-0.0.7.pom (2 KB at 23.7 KB/sec)

      Downloading: https://maven.repository.redhat.com/ga/com/jcraft/jsch.agentproxy/0.0.7/jsch.agentproxy-0.0.7.pom

      Downloaded: https://maven.repository.redhat.com/ga/com/jcraft/jsch.agentproxy/0.0.7/jsch.agentproxy-0.0.7.pom (5 KB at 28.7 KB/sec)

      Downloading: https://maven.repository.redhat.com/ga/org/sonatype/oss/oss-parent/6/oss-parent-6.pom

      Downloaded: https://maven.repository.redhat.com/ga/org/sonatype/oss/oss-parent/6/oss-parent-6.pom (5 KB at 36.9 KB/sec)

      Downloading: https://maven.repository.redhat.com/ga/com/trilead/trilead-ssh2/1.0.0-build217/trilead-ssh2-1.0.0-build217.pom

      Downloading: https://maven.repository.redhat.com/earlyaccess/all/com/trilead/trilead-ssh2/1.0.0-build217/trilead-ssh2-1.0.0-build217.pom

      Downloading: https://repository.jboss.org/nexus/content/groups/public/com/trilead/trilead-ssh2/1.0.0-build217/trilead-ssh2-1.0.0-build217.pom

      Downloading: https://repo.maven.apache.org/maven2/com/trilead/trilead-ssh2/1.0.0-build217/trilead-ssh2-1.0.0-build217.pom

      Downloaded: https://repo.maven.apache.org/maven2/com/trilead/trilead-ssh2/1.0.0-build217/trilead-ssh2-1.0.0-build217.pom (2 KB at 15.1 KB/sec)

      Downloading: https://maven.repository.redhat.com/ga/com/jcraft/jsch.agentproxy.core/0.0.7/jsch.agentproxy.core-0.0.7.pom

      Downloaded: https://maven.repository.redhat.com/ga/com/jcraft/jsch.agentproxy.core/0.0.7/jsch.agentproxy.core-0.0.7.pom (804 B at 5.6 KB/sec)

      Downloading: https://maven.repository.redhat.com/ga/org/tmatesoft/sqljet/sqljet/1.1.10/sqljet-1.1.10.pom

      Downloading: https://maven.repository.redhat.com/earlyaccess/all/org/tmatesoft/sqljet/sqljet/1.1.10/sqljet-1.1.10.pom

      Downloading: https://repository.jboss.org/nexus/content/groups/public/org/tmatesoft/sqljet/sqljet/1.1.10/sqljet-1.1.10.pom

      Downloading: https://repo.maven.apache.org/maven2/org/tmatesoft/sqljet/sqljet/1.1.10/sqljet-1.1.10.pom

      Downloaded: https://repo.maven.apache.org/maven2/org/tmatesoft/sqljet/sqljet/1.1.10/sqljet-1.1.10.pom (3 KB at 27.5 KB/sec)

      Downloading: https://maven.repository.redhat.com/ga/org/antlr/antlr-runtime/3.4/antlr-runtime-3.4.pom

      Downloaded: https://maven.repository.redhat.com/ga/org/antlr/antlr-runtime/3.4/antlr-runtime-3.4.pom (4 KB at 19.1 KB/sec)

      Downloading: https://maven.repository.redhat.com/ga/org/antlr/antlr-master/3.4/antlr-master-3.4.pom

      Downloaded: https://maven.repository.redhat.com/ga/org/antlr/antlr-master/3.4/antlr-master-3.4.pom (10 KB at 134.9 KB/sec)

      Downloading: https://maven.repository.redhat.com/ga/net/java/dev/jna/platform/3.5.2/platform-3.5.2.pom

      Downloading: https://maven.repository.redhat.com/earlyaccess/all/net/java/dev/jna/platform/3.5.2/platform-3.5.2.pom

      Downloading: https://repository.jboss.org/nexus/content/groups/public/net/java/dev/jna/platform/3.5.2/platform-3.5.2.pom

      Downloading: https://repo.maven.apache.org/maven2/net/java/dev/jna/platform/3.5.2/platform-3.5.2.pom

      Downloaded: https://repo.maven.apache.org/maven2/net/java/dev/jna/platform/3.5.2/platform-3.5.2.pom (2 KB at 22.8 KB/sec)

      Downloading: https://maven.repository.redhat.com/ga/com/jcraft/jsch.agentproxy.connector-factory/0.0.7/jsch.agentproxy.connector-factory-0.0.7.pom

      Downloaded: https://maven.repository.redhat.com/ga/com/jcraft/jsch.agentproxy.connector-factory/0.0.7/jsch.agentproxy.connector-factory-0.0.7.pom (2 KB at 9.8 KB/sec)

      Downloading: https://maven.repository.redhat.com/ga/com/jcraft/jsch.agentproxy.usocket-jna/0.0.7/jsch.agentproxy.usocket-jna-0.0.7.pom

      Downloaded: https://maven.repository.redhat.com/ga/com/jcraft/jsch.agentproxy.usocket-jna/0.0.7/jsch.agentproxy.usocket-jna-0.0.7.pom (2 KB at 14.1 KB/sec)

      Downloading: https://maven.repository.redhat.com/ga/net/java/dev/jna/jna/3.4.0/jna-3.4.0.pom

      Downloaded: https://maven.repository.redhat.com/ga/net/java/dev/jna/jna/3.4.0/jna-3.4.0.pom (3 KB at 26.1 KB/sec)

      Downloading: https://maven.repository.redhat.com/ga/net/java/dev/jna/platform/3.4.0/platform-3.4.0.pom

      Downloaded: https://maven.repository.redhat.com/ga/net/java/dev/jna/platform/3.4.0/platform-3.4.0.pom (3 KB at 32.2 KB/sec)

      Downloading: https://maven.repository.redhat.com/ga/com/jcraft/jsch.agentproxy.usocket-nc/0.0.7/jsch.agentproxy.usocket-nc-0.0.7.pom

      Downloaded: https://maven.repository.redhat.com/ga/com/jcraft/jsch.agentproxy.usocket-nc/0.0.7/jsch.agentproxy.usocket-nc-0.0.7.pom (996 B at 13.9 KB/sec)

      Downloading: https://maven.repository.redhat.com/ga/com/jcraft/jsch.agentproxy.sshagent/0.0.7/jsch.agentproxy.sshagent-0.0.7.pom

      Downloaded: https://maven.repository.redhat.com/ga/com/jcraft/jsch.agentproxy.sshagent/0.0.7/jsch.agentproxy.sshagent-0.0.7.pom (971 B at 12.3 KB/sec)

      Downloading: https://maven.repository.redhat.com/ga/com/jcraft/jsch.agentproxy.pageant/0.0.7/jsch.agentproxy.pageant-0.0.7.pom

      Downloaded: https://maven.repository.redhat.com/ga/com/jcraft/jsch.agentproxy.pageant/0.0.7/jsch.agentproxy.pageant-0.0.7.pom (2 KB at 17.5 KB/sec)

      Downloading: https://maven.repository.redhat.com/ga/de/regnis/q/sequence/sequence-library/1.0.2/sequence-library-1.0.2.pom

      Downloading: https://maven.repository.redhat.com/earlyaccess/all/de/regnis/q/sequence/sequence-library/1.0.2/sequence-library-1.0.2.pom

      Downloading: https://repository.jboss.org/nexus/content/groups/public/de/regnis/q/sequence/sequence-library/1.0.2/sequence-library-1.0.2.pom

      Downloading: https://repo.maven.apache.org/maven2/de/regnis/q/sequence/sequence-library/1.0.2/sequence-library-1.0.2.pom

      Downloaded: https://repo.maven.apache.org/maven2/de/regnis/q/sequence/sequence-library/1.0.2/sequence-library-1.0.2.pom (2 KB at 21.0 KB/sec)

      Downloading: https://maven.repository.redhat.com/ga/org/codehaus/plexus/plexus-utils/3.0.21/plexus-utils-3.0.21.pom

      Downloaded: https://maven.repository.redhat.com/ga/org/codehaus/plexus/plexus-utils/3.0.21/plexus-utils-3.0.21.pom (4 KB at 27.0 KB/sec)

      Downloading: https://maven.repository.redhat.com/ga/org/sonatype/plexus/plexus-sec-dispatcher/1.4/plexus-sec-dispatcher-1.4.pom

      Downloaded: https://maven.repository.redhat.com/ga/org/sonatype/plexus/plexus-sec-dispatcher/1.4/plexus-sec-dispatcher-1.4.pom (3 KB at 39.6 KB/sec)

      Downloading: https://maven.repository.redhat.com/ga/org/apache/maven/scm/maven-scm-api/1.9.4/maven-scm-api-1.9.4.jar

      Downloading: https://maven.repository.redhat.com/ga/org/apache/maven/scm/maven-scm-manager-plexus/1.9.4/maven-scm-manager-plexus-1.9.4.jar

      Downloading: https://maven.repository.redhat.com/ga/org/apache/maven/scm/maven-scm-provider-bazaar/1.9.4/maven-scm-provider-bazaar-1.9.4.jar

      Downloading: https://maven.repository.redhat.com/ga/org/apache/maven/scm/maven-scm-provider-svnexe/1.9.4/maven-scm-provider-svnexe-1.9.4.jar

      Downloading: https://maven.repository.redhat.com/ga/org/apache/maven/scm/maven-scm-provider-gitexe/1.9.4/maven-scm-provider-gitexe-1.9.4.jar

      Downloading: https://maven.repository.redhat.com/ga/org/apache/maven/scm/maven-scm-provider-git-commons/1.9.4/maven-scm-provider-git-commons-1.9.4.jar

      Downloading: https://maven.repository.redhat.com/ga/org/apache/maven/scm/maven-scm-provider-svn-commons/1.9.4/maven-scm-provider-svn-commons-1.9.4.jar

      Downloading: https://maven.repository.redhat.com/ga/org/apache/maven/scm/maven-scm-provider-cvsexe/1.9.4/maven-scm-provider-cvsexe-1.9.4.jar

      Downloading: https://maven.repository.redhat.com/ga/org/apache/maven/scm/maven-scm-provider-cvs-commons/1.9.4/maven-scm-provider-cvs-commons-1.9.4.jar

      Downloading: https://maven.repository.redhat.com/ga/org/apache/maven/scm/maven-scm-provider-starteam/1.9.4/maven-scm-provider-starteam-1.9.4.jar

      Downloading: https://maven.repository.redhat.com/ga/org/apache/maven/scm/maven-scm-provider-clearcase/1.9.4/maven-scm-provider-clearcase-1.9.4.jar

      Downloading: https://maven.repository.redhat.com/ga/org/apache/maven/scm/maven-scm-provider-perforce/1.9.4/maven-scm-provider-perforce-1.9.4.jar

      Downloading: https://maven.repository.redhat.com/ga/org/apache/maven/scm/maven-scm-provider-hg/1.9.4/maven-scm-provider-hg-1.9.4.jar

      Downloading: https://maven.repository.redhat.com/ga/com/google/code/maven-scm-provider-svnjava/maven-scm-provider-svnjava/2.1.1/maven-scm-provider-svnjava-2.1.1.jar

      Downloading: https://maven.repository.redhat.com/ga/net/java/dev/jna/jna/3.5.2/jna-3.5.2.jar

      Downloading: https://maven.repository.redhat.com/ga/org/tmatesoft/svnkit/svnkit/1.8.5/svnkit-1.8.5.jar

      Downloading: https://maven.repository.redhat.com/ga/com/jcraft/jsch.agentproxy.svnkit-trilead-ssh2/0.0.7/jsch.agentproxy.svnkit-trilead-ssh2-0.0.7.jar

      Downloading: https://maven.repository.redhat.com/ga/com/jcraft/jsch.agentproxy.core/0.0.7/jsch.agentproxy.core-0.0.7.jar

      Downloading: https://maven.repository.redhat.com/ga/org/tmatesoft/sqljet/sqljet/1.1.10/sqljet-1.1.10.jar

      Downloading: https://maven.repository.redhat.com/ga/org/antlr/antlr-runtime/3.4/antlr-runtime-3.4.jar

      Downloading: https://maven.repository.redhat.com/ga/net/java/dev/jna/platform/3.5.2/platform-3.5.2.jar

      Downloading: https://maven.repository.redhat.com/ga/com/jcraft/jsch.agentproxy.connector-factory/0.0.7/jsch.agentproxy.connector-factory-0.0.7.jar

      Downloaded: https://maven.repository.redhat.com/ga/com/jcraft/jsch.agentproxy.core/0.0.7/jsch.agentproxy.core-0.0.7.jar (10 KB at 7.3 KB/sec)

      Downloading: https://maven.repository.redhat.com/ga/com/jcraft/jsch.agentproxy.usocket-jna/0.0.7/jsch.agentproxy.usocket-jna-0.0.7.jar

      Downloaded: https://maven.repository.redhat.com/ga/com/jcraft/jsch.agentproxy.usocket-jna/0.0.7/jsch.agentproxy.usocket-jna-0.0.7.jar (7 KB at 4.8 KB/sec)

      Downloading: https://maven.repository.redhat.com/ga/com/jcraft/jsch.agentproxy.usocket-nc/0.0.7/jsch.agentproxy.usocket-nc-0.0.7.jar

      Downloaded: https://maven.repository.redhat.com/ga/com/jcraft/jsch.agentproxy.connector-factory/0.0.7/jsch.agentproxy.connector-factory-0.0.7.jar (12 KB at 8.7 KB/sec)

      Downloading: https://maven.repository.redhat.com/ga/com/jcraft/jsch.agentproxy.sshagent/0.0.7/jsch.agentproxy.sshagent-0.0.7.jar

      Downloaded: https://maven.repository.redhat.com/ga/com/jcraft/jsch.agentproxy.usocket-nc/0.0.7/jsch.agentproxy.usocket-nc-0.0.7.jar (6 KB at 3.7 KB/sec)

      Downloading: https://maven.repository.redhat.com/ga/com/jcraft/jsch.agentproxy.pageant/0.0.7/jsch.agentproxy.pageant-0.0.7.jar

      Downloaded: https://maven.repository.redhat.com/ga/org/antlr/antlr-runtime/3.4/antlr-runtime-3.4.jar (161 KB at 112.7 KB/sec)

      Downloading: https://maven.repository.redhat.com/ga/de/regnis/q/sequence/sequence-library/1.0.2/sequence-library-1.0.2.jar

      Downloaded: https://maven.repository.redhat.com/ga/com/jcraft/jsch.agentproxy.sshagent/0.0.7/jsch.agentproxy.sshagent-0.0.7.jar (5 KB at 2.9 KB/sec)

      Downloading: https://maven.repository.redhat.com/ga/com/trilead/trilead-ssh2/1.0.0-build217/trilead-ssh2-1.0.0-build217.jar

      Downloading: https://maven.repository.redhat.com/ga/org/codehaus/plexus/plexus-utils/3.0.21/plexus-utils-3.0.21.jar

      Downloading: https://maven.repository.redhat.com/ga/org/sonatype/plexus/plexus-sec-dispatcher/1.4/plexus-sec-dispatcher-1.4.jar

      Downloaded: https://maven.repository.redhat.com/ga/com/jcraft/jsch.agentproxy.pageant/0.0.7/jsch.agentproxy.pageant-0.0.7.jar (8 KB at 5.2 KB/sec)

      Downloaded: https://maven.repository.redhat.com/ga/org/sonatype/plexus/plexus-sec-dispatcher/1.4/plexus-sec-dispatcher-1.4.jar (28 KB at 16.5 KB/sec)

      Downloaded: https://maven.repository.redhat.com/ga/org/codehaus/plexus/plexus-utils/3.0.21/plexus-utils-3.0.21.jar (240 KB at 143.8 KB/sec)

      Downloading: https://maven.repository.redhat.com/earlyaccess/all/org/apache/maven/scm/maven-scm-api/1.9.4/maven-scm-api-1.9.4.jar

      Downloading: https://maven.repository.redhat.com/earlyaccess/all/org/apache/maven/scm/maven-scm-manager-plexus/1.9.4/maven-scm-manager-plexus-1.9.4.jar

      Downloading: https://maven.repository.redhat.com/earlyaccess/all/org/apache/maven/scm/maven-scm-provider-bazaar/1.9.4/maven-scm-provider-bazaar-1.9.4.jar

      Downloading: https://maven.repository.redhat.com/earlyaccess/all/org/apache/maven/scm/maven-scm-provider-svnexe/1.9.4/maven-scm-provider-svnexe-1.9.4.jar

      Downloading: https://maven.repository.redhat.com/earlyaccess/all/org/apache/maven/scm/maven-scm-provider-gitexe/1.9.4/maven-scm-provider-gitexe-1.9.4.jar

      Downloading: https://maven.repository.redhat.com/earlyaccess/all/org/apache/maven/scm/maven-scm-provider-git-commons/1.9.4/maven-scm-provider-git-commons-1.9.4.jar

      Downloading: https://maven.repository.redhat.com/earlyaccess/all/org/apache/maven/scm/maven-scm-provider-svn-commons/1.9.4/maven-scm-provider-svn-commons-1.9.4.jar

      Downloading: https://maven.repository.redhat.com/earlyaccess/all/org/apache/maven/scm/maven-scm-provider-cvsexe/1.9.4/maven-scm-provider-cvsexe-1.9.4.jar

      Downloading: https://maven.repository.redhat.com/earlyaccess/all/org/apache/maven/scm/maven-scm-provider-cvs-commons/1.9.4/maven-scm-provider-cvs-commons-1.9.4.jar

      Downloading: https://maven.repository.redhat.com/earlyaccess/all/org/apache/maven/scm/maven-scm-provider-starteam/1.9.4/maven-scm-provider-starteam-1.9.4.jar

      Downloading: https://maven.repository.redhat.com/earlyaccess/all/org/apache/maven/scm/maven-scm-provider-clearcase/1.9.4/maven-scm-provider-clearcase-1.9.4.jar

      Downloading: https://maven.repository.redhat.com/earlyaccess/all/org/apache/maven/scm/maven-scm-provider-perforce/1.9.4/maven-scm-provider-perforce-1.9.4.jar

      Downloading: https://maven.repository.redhat.com/earlyaccess/all/org/apache/maven/scm/maven-scm-provider-hg/1.9.4/maven-scm-provider-hg-1.9.4.jar

      Downloading: https://maven.repository.redhat.com/earlyaccess/all/com/google/code/maven-scm-provider-svnjava/maven-scm-provider-svnjava/2.1.1/maven-scm-provider-svnjava-2.1.1.jar

      Downloading: https://maven.repository.redhat.com/earlyaccess/all/net/java/dev/jna/jna/3.5.2/jna-3.5.2.jar

      Downloading: https://maven.repository.redhat.com/earlyaccess/all/org/tmatesoft/svnkit/svnkit/1.8.5/svnkit-1.8.5.jar

      Downloading: https://maven.repository.redhat.com/earlyaccess/all/com/jcraft/jsch.agentproxy.svnkit-trilead-ssh2/0.0.7/jsch.agentproxy.svnkit-trilead-ssh2-0.0.7.jar

      Downloading: https://maven.repository.redhat.com/earlyaccess/all/org/tmatesoft/sqljet/sqljet/1.1.10/sqljet-1.1.10.jar

      Downloading: https://maven.repository.redhat.com/earlyaccess/all/net/java/dev/jna/platform/3.5.2/platform-3.5.2.jar

      Downloading: https://maven.repository.redhat.com/earlyaccess/all/de/regnis/q/sequence/sequence-library/1.0.2/sequence-library-1.0.2.jar

      Downloading: https://maven.repository.redhat.com/earlyaccess/all/com/trilead/trilead-ssh2/1.0.0-build217/trilead-ssh2-1.0.0-build217.jar

      Downloading: https://repository.jboss.org/nexus/content/groups/public/org/apache/maven/scm/maven-scm-api/1.9.4/maven-scm-api-1.9.4.jar

      Downloading: https://repository.jboss.org/nexus/content/groups/public/org/apache/maven/scm/maven-scm-manager-plexus/1.9.4/maven-scm-manager-plexus-1.9.4.jar

      Downloading: https://repository.jboss.org/nexus/content/groups/public/org/apache/maven/scm/maven-scm-provider-bazaar/1.9.4/maven-scm-provider-bazaar-1.9.4.jar

      Downloading: https://repository.jboss.org/nexus/content/groups/public/org/apache/maven/scm/maven-scm-provider-svnexe/1.9.4/maven-scm-provider-svnexe-1.9.4.jar

      Downloading: https://repository.jboss.org/nexus/content/groups/public/org/apache/maven/scm/maven-scm-provider-gitexe/1.9.4/maven-scm-provider-gitexe-1.9.4.jar

      Downloading: https://repository.jboss.org/nexus/content/groups/public/org/apache/maven/scm/maven-scm-provider-git-commons/1.9.4/maven-scm-provider-git-commons-1.9.4.jar

      Downloading: https://repository.jboss.org/nexus/content/groups/public/org/apache/maven/scm/maven-scm-provider-svn-commons/1.9.4/maven-scm-provider-svn-commons-1.9.4.jar

      Downloading: https://repository.jboss.org/nexus/content/groups/public/org/apache/maven/scm/maven-scm-provider-cvsexe/1.9.4/maven-scm-provider-cvsexe-1.9.4.jar

      Downloading: https://repository.jboss.org/nexus/content/groups/public/org/apache/maven/scm/maven-scm-provider-cvs-commons/1.9.4/maven-scm-provider-cvs-commons-1.9.4.jar

      Downloading: https://repository.jboss.org/nexus/content/groups/public/org/apache/maven/scm/maven-scm-provider-starteam/1.9.4/maven-scm-provider-starteam-1.9.4.jar

      Downloading: https://repository.jboss.org/nexus/content/groups/public/org/apache/maven/scm/maven-scm-provider-clearcase/1.9.4/maven-scm-provider-clearcase-1.9.4.jar

      Downloading: https://repository.jboss.org/nexus/content/groups/public/org/apache/maven/scm/maven-scm-provider-perforce/1.9.4/maven-scm-provider-perforce-1.9.4.jar

      Downloading: https://repository.jboss.org/nexus/content/groups/public/org/apache/maven/scm/maven-scm-provider-hg/1.9.4/maven-scm-provider-hg-1.9.4.jar

      Downloading: https://repository.jboss.org/nexus/content/groups/public/com/google/code/maven-scm-provider-svnjava/maven-scm-provider-svnjava/2.1.1/maven-scm-provider-svnjava-2.1.1.jar

      Downloading: https://repository.jboss.org/nexus/content/groups/public/net/java/dev/jna/jna/3.5.2/jna-3.5.2.jar

      Downloading: https://repository.jboss.org/nexus/content/groups/public/org/tmatesoft/svnkit/svnkit/1.8.5/svnkit-1.8.5.jar

      Downloading: https://repository.jboss.org/nexus/content/groups/public/com/jcraft/jsch.agentproxy.svnkit-trilead-ssh2/0.0.7/jsch.agentproxy.svnkit-trilead-ssh2-0.0.7.jar

      Downloading: https://repository.jboss.org/nexus/content/groups/public/org/tmatesoft/sqljet/sqljet/1.1.10/sqljet-1.1.10.jar

      Downloading: https://repository.jboss.org/nexus/content/groups/public/net/java/dev/jna/platform/3.5.2/platform-3.5.2.jar

      Downloading: https://repository.jboss.org/nexus/content/groups/public/de/regnis/q/sequence/sequence-library/1.0.2/sequence-library-1.0.2.jar

      Downloading: https://repository.jboss.org/nexus/content/groups/public/com/trilead/trilead-ssh2/1.0.0-build217/trilead-ssh2-1.0.0-build217.jar

      Downloading: https://repo.maven.apache.org/maven2/org/apache/maven/scm/maven-scm-api/1.9.4/maven-scm-api-1.9.4.jar

      Downloading: https://repo.maven.apache.org/maven2/org/apache/maven/scm/maven-scm-manager-plexus/1.9.4/maven-scm-manager-plexus-1.9.4.jar

      Downloading: https://repo.maven.apache.org/maven2/org/apache/maven/scm/maven-scm-provider-bazaar/1.9.4/maven-scm-provider-bazaar-1.9.4.jar

      Downloading: https://repo.maven.apache.org/maven2/org/apache/maven/scm/maven-scm-provider-svnexe/1.9.4/maven-scm-provider-svnexe-1.9.4.jar

      Downloading: https://repo.maven.apache.org/maven2/org/apache/maven/scm/maven-scm-provider-gitexe/1.9.4/maven-scm-provider-gitexe-1.9.4.jar

      Downloaded: https://repo.maven.apache.org/maven2/org/apache/maven/scm/maven-scm-manager-plexus/1.9.4/maven-scm-manager-plexus-1.9.4.jar (11 KB at 196.3 KB/sec)

      Downloading: https://repo.maven.apache.org/maven2/org/apache/maven/scm/maven-scm-provider-git-commons/1.9.4/maven-scm-provider-git-commons-1.9.4.jar

      Downloaded: https://repo.maven.apache.org/maven2/org/apache/maven/scm/maven-scm-api/1.9.4/maven-scm-api-1.9.4.jar (105 KB at 1358.6 KB/sec)

      Downloading: https://repo.maven.apache.org/maven2/org/apache/maven/scm/maven-scm-provider-svn-commons/1.9.4/maven-scm-provider-svn-commons-1.9.4.jar

      Downloaded: https://repo.maven.apache.org/maven2/org/apache/maven/scm/maven-scm-provider-git-commons/1.9.4/maven-scm-provider-git-commons-1.9.4.jar (34 KB at 296.3 KB/sec)

      Downloading: https://repo.maven.apache.org/maven2/org/apache/maven/scm/maven-scm-provider-cvsexe/1.9.4/maven-scm-provider-cvsexe-1.9.4.jar

      Downloaded: https://repo.maven.apache.org/maven2/org/apache/maven/scm/maven-scm-provider-svn-commons/1.9.4/maven-scm-provider-svn-commons-1.9.4.jar (37 KB at 284.7 KB/sec)

      Downloading: https://repo.maven.apache.org/maven2/org/apache/maven/scm/maven-scm-provider-cvs-commons/1.9.4/maven-scm-provider-cvs-commons-1.9.4.jar

      Downloaded: https://repo.maven.apache.org/maven2/org/apache/maven/scm/maven-scm-provider-cvsexe/1.9.4/maven-scm-provider-cvsexe-1.9.4.jar (30 KB at 181.0 KB/sec)

      Downloading: https://repo.maven.apache.org/maven2/org/apache/maven/scm/maven-scm-provider-starteam/1.9.4/maven-scm-provider-starteam-1.9.4.jar

      Downloaded: https://repo.maven.apache.org/maven2/org/apache/maven/scm/maven-scm-provider-cvs-commons/1.9.4/maven-scm-provider-cvs-commons-1.9.4.jar (75 KB at 388.5 KB/sec)

      Downloading: https://repo.maven.apache.org/maven2/org/apache/maven/scm/maven-scm-provider-clearcase/1.9.4/maven-scm-provider-clearcase-1.9.4.jar

      Downloaded: https://repo.maven.apache.org/maven2/org/apache/maven/scm/maven-scm-provider-starteam/1.9.4/maven-scm-provider-starteam-1.9.4.jar (70 KB at 304.4 KB/sec)

      Downloading: https://repo.maven.apache.org/maven2/org/apache/maven/scm/maven-scm-provider-perforce/1.9.4/maven-scm-provider-perforce-1.9.4.jar

      Downloaded: https://repo.maven.apache.org/maven2/org/apache/maven/scm/maven-scm-provider-bazaar/1.9.4/maven-scm-provider-bazaar-1.9.4.jar (55 KB at 222.8 KB/sec)

      Downloading: https://repo.maven.apache.org/maven2/org/apache/maven/scm/maven-scm-provider-hg/1.9.4/maven-scm-provider-hg-1.9.4.jar

      Downloaded: https://repo.maven.apache.org/maven2/org/apache/maven/scm/maven-scm-provider-svnexe/1.9.4/maven-scm-provider-svnexe-1.9.4.jar (76 KB at 303.1 KB/sec)

      Downloading: https://repo.maven.apache.org/maven2/com/google/code/maven-scm-provider-svnjava/maven-scm-provider-svnjava/2.1.1/maven-scm-provider-svnjava-2.1.1.jar

      Downloaded: https://repo.maven.apache.org/maven2/org/apache/maven/scm/maven-scm-provider-gitexe/1.9.4/maven-scm-provider-gitexe-1.9.4.jar (65 KB at 259.7 KB/sec)

      Downloading: https://repo.maven.apache.org/maven2/net/java/dev/jna/jna/3.5.2/jna-3.5.2.jar

      Downloaded: https://repo.maven.apache.org/maven2/org/apache/maven/scm/maven-scm-provider-clearcase/1.9.4/maven-scm-provider-clearcase-1.9.4.jar (66 KB at 258.8 KB/sec)

      Downloading: https://repo.maven.apache.org/maven2/org/tmatesoft/svnkit/svnkit/1.8.5/svnkit-1.8.5.jar

      Downloaded: https://repo.maven.apache.org/maven2/org/apache/maven/scm/maven-scm-provider-perforce/1.9.4/maven-scm-provider-perforce-1.9.4.jar (82 KB at 282.7 KB/sec)

      Downloading: https://repo.maven.apache.org/maven2/com/jcraft/jsch.agentproxy.svnkit-trilead-ssh2/0.0.7/jsch.agentproxy.svnkit-trilead-ssh2-0.0.7.jar

      Downloaded: https://repo.maven.apache.org/maven2/com/google/code/maven-scm-provider-svnjava/maven-scm-provider-svnjava/2.1.1/maven-scm-provider-svnjava-2.1.1.jar (61 KB at 191.0 KB/sec)

      Downloading: https://repo.maven.apache.org/maven2/org/tmatesoft/sqljet/sqljet/1.1.10/sqljet-1.1.10.jar

      Downloaded: https://repo.maven.apache.org/maven2/org/apache/maven/scm/maven-scm-provider-hg/1.9.4/maven-scm-provider-hg-1.9.4.jar (65 KB at 200.3 KB/sec)

      Downloading: https://repo.maven.apache.org/maven2/net/java/dev/jna/platform/3.5.2/platform-3.5.2.jar

      Downloaded: https://repo.maven.apache.org/maven2/com/jcraft/jsch.agentproxy.svnkit-trilead-ssh2/0.0.7/jsch.agentproxy.svnkit-trilead-ssh2-0.0.7.jar (4 KB at 11.1 KB/sec)

      Downloading: https://repo.maven.apache.org/maven2/de/regnis/q/sequence/sequence-library/1.0.2/sequence-library-1.0.2.jar

      Downloaded: https://repo.maven.apache.org/maven2/de/regnis/q/sequence/sequence-library/1.0.2/sequence-library-1.0.2.jar (69 KB at 148.0 KB/sec)

      Downloading: https://repo.maven.apache.org/maven2/com/trilead/trilead-ssh2/1.0.0-build217/trilead-ssh2-1.0.0-build217.jar

      Downloaded: https://repo.maven.apache.org/maven2/net/java/dev/jna/jna/3.5.2/jna-3.5.2.jar (676 KB at 1275.2 KB/sec)

      Downloaded: https://repo.maven.apache.org/maven2/org/tmatesoft/sqljet/sqljet/1.1.10/sqljet-1.1.10.jar (745 KB at 1263.4 KB/sec)

      Downloaded: https://repo.maven.apache.org/maven2/net/java/dev/jna/platform/3.5.2/platform-3.5.2.jar (1165 KB at 1899.5 KB/sec)

      Downloaded: https://repo.maven.apache.org/maven2/com/trilead/trilead-ssh2/1.0.0-build217/trilead-ssh2-1.0.0-build217.jar (245 KB at 389.6 KB/sec)

      Downloaded: https://repo.maven.apache.org/maven2/org/tmatesoft/svnkit/svnkit/1.8.5/svnkit-1.8.5.jar (3726 KB at 3151.8 KB/sec)

      [INFO] Executing: /bin/sh -c cd '/home/aw/wildflyTutorial/quickstart-11.x-new/helloworld' && 'git' 'rev-parse' '--verify' 'HEAD'

      [INFO] Working directory: /home/aw/wildflyTutorial/quickstart-11.x-new/helloworld

      [WARNING] Cannot get the revision information from the scm repository, proceeding with revision of UNKNOWN :

      Exception while executing SCM command.

      [INFO] Storing buildNumber: UNKNOWN at timestamp: 1493809102838

      [WARNING] Cannot get the branch information from the git repository:

      Error while executing command.

      [INFO] Executing: /bin/sh -c cd '/home/aw/wildflyTutorial/quickstart-11.x-new/helloworld' && 'git' 'rev-parse' '--verify' 'HEAD'

      [INFO] Working directory: /home/aw/wildflyTutorial/quickstart-11.x-new/helloworld

      [WARNING] Cannot get the branch information from the scm repository, proceeding with UNKNOWN_BRANCH :

      Exception while executing SCM command.

      [INFO] Storing buildScmBranch: UNKNOWN_BRANCH

      [INFO]

      [INFO] --- maven-resources-plugin:3.0.1:resources (default-resources) @ helloworld ---

      [INFO] Using 'UTF-8' encoding to copy filtered resources.

      [INFO] skip non existing resourceDirectory /home/aw/wildflyTutorial/quickstart-11.x-new/helloworld/src/main/resources

      [INFO]

      [INFO] --- maven-compiler-plugin:3.6.0:compile (default-compile) @ helloworld ---

      Downloading: https://maven.repository.redhat.com/ga/org/apache/maven/shared/maven-shared-utils/3.1.0/maven-shared-utils-3.1.0.pom

      Downloaded: https://maven.repository.redhat.com/ga/org/apache/maven/shared/maven-shared-utils/3.1.0/maven-shared-utils-3.1.0.pom (5 KB at 37.1 KB/sec)

      Downloading: https://maven.repository.redhat.com/ga/org/ow2/asm/asm/6.0_ALPHA/asm-6.0_ALPHA.pom

      Downloaded: https://maven.repository.redhat.com/ga/org/ow2/asm/asm/6.0_ALPHA/asm-6.0_ALPHA.pom (2 KB at 28.3 KB/sec)

      Downloading: https://maven.repository.redhat.com/ga/org/ow2/asm/asm-parent/6.0_ALPHA/asm-parent-6.0_ALPHA.pom

      Downloaded: https://maven.repository.redhat.com/ga/org/ow2/asm/asm-parent/6.0_ALPHA/asm-parent-6.0_ALPHA.pom (6 KB at 77.8 KB/sec)

      Downloading: https://maven.repository.redhat.com/ga/org/ow2/ow2/1.3/ow2-1.3.pom

      Downloaded: https://maven.repository.redhat.com/ga/org/ow2/ow2/1.3/ow2-1.3.pom (10 KB at 134.6 KB/sec)

      Downloading: https://maven.repository.redhat.com/ga/org/codehaus/plexus/plexus-compiler-api/2.8.1/plexus-compiler-api-2.8.1.pom

      Downloaded: https://maven.repository.redhat.com/ga/org/codehaus/plexus/plexus-compiler-api/2.8.1/plexus-compiler-api-2.8.1.pom (893 B at 13.8 KB/sec)

      Downloading: https://maven.repository.redhat.com/ga/org/codehaus/plexus/plexus-compiler/2.8.1/plexus-compiler-2.8.1.pom

      Downloaded: https://maven.repository.redhat.com/ga/org/codehaus/plexus/plexus-compiler/2.8.1/plexus-compiler-2.8.1.pom (5 KB at 71.9 KB/sec)

      Downloading: https://maven.repository.redhat.com/ga/org/codehaus/plexus/plexus-components/4.0/plexus-components-4.0.pom

      Downloaded: https://maven.repository.redhat.com/ga/org/codehaus/plexus/plexus-components/4.0/plexus-components-4.0.pom (3 KB at 37.6 KB/sec)

      Downloading: https://maven.repository.redhat.com/ga/org/codehaus/plexus/plexus-compiler-manager/2.8.1/plexus-compiler-manager-2.8.1.pom

      Downloaded: https://maven.repository.redhat.com/ga/org/codehaus/plexus/plexus-compiler-manager/2.8.1/plexus-compiler-manager-2.8.1.pom (713 B at 10.9 KB/sec)

      Downloading: https://maven.repository.redhat.com/ga/org/codehaus/plexus/plexus-compiler-javac/2.8.1/plexus-compiler-javac-2.8.1.pom

      Downloaded: https://maven.repository.redhat.com/ga/org/codehaus/plexus/plexus-compiler-javac/2.8.1/plexus-compiler-javac-2.8.1.pom (794 B at 11.2 KB/sec)

      Downloading: https://maven.repository.redhat.com/ga/org/codehaus/plexus/plexus-compilers/2.8.1/plexus-compilers-2.8.1.pom

      Downloaded: https://maven.repository.redhat.com/ga/org/codehaus/plexus/plexus-compilers/2.8.1/plexus-compilers-2.8.1.pom (2 KB at 19.9 KB/sec)

      Downloading: https://maven.repository.redhat.com/ga/org/apache/maven/shared/maven-shared-utils/3.1.0/maven-shared-utils-3.1.0.jar

      Downloading: https://maven.repository.redhat.com/ga/org/ow2/asm/asm/6.0_ALPHA/asm-6.0_ALPHA.jar

      Downloading: https://maven.repository.redhat.com/ga/org/codehaus/plexus/plexus-compiler-manager/2.8.1/plexus-compiler-manager-2.8.1.jar

      Downloading: https://maven.repository.redhat.com/ga/org/codehaus/plexus/plexus-compiler-api/2.8.1/plexus-compiler-api-2.8.1.jar

      Downloading: https://maven.repository.redhat.com/ga/org/codehaus/plexus/plexus-compiler-javac/2.8.1/plexus-compiler-javac-2.8.1.jar

      Downloaded: https://maven.repository.redhat.com/ga/org/codehaus/plexus/plexus-compiler-manager/2.8.1/plexus-compiler-manager-2.8.1.jar (5 KB at 35.2 KB/sec)

      Downloaded: https://maven.repository.redhat.com/ga/org/codehaus/plexus/plexus-compiler-javac/2.8.1/plexus-compiler-javac-2.8.1.jar (20 KB at 136.2 KB/sec)

      Downloaded: https://maven.repository.redhat.com/ga/org/apache/maven/shared/maven-shared-utils/3.1.0/maven-shared-utils-3.1.0.jar (160 KB at 1011.7 KB/sec)

      Downloaded: https://maven.repository.redhat.com/ga/org/codehaus/plexus/plexus-compiler-api/2.8.1/plexus-compiler-api-2.8.1.jar (26 KB at 151.3 KB/sec)

      Downloaded: https://maven.repository.redhat.com/ga/org/ow2/asm/asm/6.0_ALPHA/asm-6.0_ALPHA.jar (55 KB at 268.5 KB/sec)

      [INFO] Changes detected - recompiling the module!

      [INFO] Compiling 2 source files to /home/aw/wildflyTutorial/quickstart-11.x-new/helloworld/target/classes

      [INFO]

      [INFO] --- maven-resources-plugin:3.0.1:testResources (default-testResources) @ helloworld ---

      [INFO] Using 'UTF-8' encoding to copy filtered resources.

      [INFO] skip non existing resourceDirectory /home/aw/wildflyTutorial/quickstart-11.x-new/helloworld/src/test/resources

      [INFO]

      [INFO] --- maven-compiler-plugin:3.6.0:testCompile (default-testCompile) @ helloworld ---

      [INFO] No sources to compile

      [INFO]

      [INFO] --- maven-surefire-plugin:2.19.1:test (default-test) @ helloworld ---

      Downloading: https://maven.repository.redhat.com/ga/org/apache/maven/surefire/maven-surefire-common/2.19.1/maven-surefire-common-2.19.1.pom

      Downloaded: https://maven.repository.redhat.com/ga/org/apache/maven/surefire/maven-surefire-common/2.19.1/maven-surefire-common-2.19.1.pom (8 KB at 110.2 KB/sec)

      Downloading: https://maven.repository.redhat.com/ga/org/apache/maven/plugin-tools/maven-plugin-annotations/3.3/maven-plugin-annotations-3.3.pom

      Downloaded: https://maven.repository.redhat.com/ga/org/apache/maven/plugin-tools/maven-plugin-annotations/3.3/maven-plugin-annotations-3.3.pom (2 KB at 23.7 KB/sec)

      Downloading: https://maven.repository.redhat.com/ga/org/apache/maven/plugin-tools/maven-plugin-tools/3.3/maven-plugin-tools-3.3.pom

      Downloaded: https://maven.repository.redhat.com/ga/org/apache/maven/plugin-tools/maven-plugin-tools/3.3/maven-plugin-tools-3.3.pom (13 KB at 176.5 KB/sec)

      Downloading: https://maven.repository.redhat.com/ga/org/apache/maven/surefire/surefire-api/2.19.1/surefire-api-2.19.1.pom

      Downloaded: https://maven.repository.redhat.com/ga/org/apache/maven/surefire/surefire-api/2.19.1/surefire-api-2.19.1.pom (4 KB at 53.6 KB/sec)

      Downloading: https://maven.repository.redhat.com/ga/org/apache/maven/surefire/surefire-booter/2.19.1/surefire-booter-2.19.1.pom

      Downloaded: https://maven.repository.redhat.com/ga/org/apache/maven/surefire/surefire-booter/2.19.1/surefire-booter-2.19.1.pom (4 KB at 45.7 KB/sec)

      Downloading: https://maven.repository.redhat.com/ga/org/apache/maven/maven-toolchain/2.2.1/maven-toolchain-2.2.1.pom

      Downloaded: https://maven.repository.redhat.com/ga/org/apache/maven/maven-toolchain/2.2.1/maven-toolchain-2.2.1.pom (4 KB at 39.8 KB/sec)

      Downloading: https://maven.repository.redhat.com/ga/org/apache/maven/surefire/maven-surefire-common/2.19.1/maven-surefire-common-2.19.1.jar

      Downloading: https://maven.repository.redhat.com/ga/org/apache/maven/surefire/surefire-booter/2.19.1/surefire-booter-2.19.1.jar

      Downloading: https://maven.repository.redhat.com/ga/org/codehaus/plexus/plexus-utils/1.5.15/plexus-utils-1.5.15.jar

      Downloading: https://maven.repository.redhat.com/ga/org/apache/maven/maven-toolchain/2.2.1/maven-toolchain-2.2.1.jar

      Downloading: https://maven.repository.redhat.com/ga/org/apache/maven/surefire/surefire-api/2.19.1/surefire-api-2.19.1.jar

      Downloaded: https://maven.repository.redhat.com/ga/org/apache/maven/surefire/surefire-booter/2.19.1/surefire-booter-2.19.1.jar (45 KB at 462.8 KB/sec)

      Downloading: https://maven.repository.redhat.com/ga/org/apache/maven/plugin-tools/maven-plugin-annotations/3.3/maven-plugin-annotations-3.3.jar

      Downloaded: https://maven.repository.redhat.com/ga/org/apache/maven/maven-toolchain/2.2.1/maven-toolchain-2.2.1.jar (37 KB at 268.2 KB/sec)

      Downloaded: https://maven.repository.redhat.com/ga/org/apache/maven/surefire/surefire-api/2.19.1/surefire-api-2.19.1.jar (192 KB at 1377.5 KB/sec)

      Downloaded: https://maven.repository.redhat.com/ga/org/apache/maven/plugin-tools/maven-plugin-annotations/3.3/maven-plugin-annotations-3.3.jar (14 KB at 80.6 KB/sec)

      Downloaded: https://maven.repository.redhat.com/ga/org/apache/maven/surefire/maven-surefire-common/2.19.1/maven-surefire-common-2.19.1.jar (286 KB at 1595.8 KB/sec)

      Downloaded: https://maven.repository.redhat.com/ga/org/codehaus/plexus/plexus-utils/1.5.15/plexus-utils-1.5.15.jar (223 KB at 1204.1 KB/sec)

      [INFO] No tests to run.

      [INFO]

      [INFO] --- maven-war-plugin:3.0.0:war (default-war) @ helloworld ---

      [INFO] Packaging webapp

      [INFO] Assembling webapp [helloworld] in [/home/aw/wildflyTutorial/quickstart-11.x-new/helloworld/target/helloworld]

      [INFO] Processing war project

      [INFO] Copying webapp resources [/home/aw/wildflyTutorial/quickstart-11.x-new/helloworld/src/main/webapp]

      [INFO] Webapp assembled in [110 msecs]

      [INFO] Building war: /home/aw/wildflyTutorial/quickstart-11.x-new/helloworld/target/helloworld.war

      [INFO]

      [INFO] --- maven-source-plugin:3.0.1:jar-no-fork (attach-sources) @ helloworld ---

      [INFO] Building jar: /home/aw/wildflyTutorial/quickstart-11.x-new/helloworld/target/helloworld-sources.jar

      [INFO]

      [INFO] --- maven-install-plugin:2.5.2:install (default-install) @ helloworld ---

      Downloading: https://maven.repository.redhat.com/ga/org/apache/maven/shared/maven-shared-utils/0.4/maven-shared-utils-0.4.pom

      Downloaded: https://maven.repository.redhat.com/ga/org/apache/maven/shared/maven-shared-utils/0.4/maven-shared-utils-0.4.pom (4 KB at 39.1 KB/sec)

      Downloading: https://maven.repository.redhat.com/ga/org/apache/maven/shared/maven-shared-utils/0.4/maven-shared-utils-0.4.jar

      Downloading: https://maven.repository.redhat.com/ga/org/codehaus/plexus/plexus-utils/3.0.15/plexus-utils-3.0.15.jar

      Downloaded: https://maven.repository.redhat.com/ga/org/apache/maven/shared/maven-shared-utils/0.4/maven-shared-utils-0.4.jar (152 KB at 1459.7 KB/sec)

      Downloaded: https://maven.repository.redhat.com/ga/org/codehaus/plexus/plexus-utils/3.0.15/plexus-utils-3.0.15.jar (234 KB at 1823.1 KB/sec)

      [INFO] Installing /home/aw/wildflyTutorial/quickstart-11.x-new/helloworld/target/helloworld.war to /home/aw/.m2/repository/org/wildfly/quickstarts/helloworld/11.0.0-SNAPSHOT/helloworld-11.0.0-SNAPSHOT.war

      [INFO] Installing /home/aw/wildflyTutorial/quickstart-11.x-new/helloworld/pom.xml to /home/aw/.m2/repository/org/wildfly/quickstarts/helloworld/11.0.0-SNAPSHOT/helloworld-11.0.0-SNAPSHOT.pom

      [INFO] Installing /home/aw/wildflyTutorial/quickstart-11.x-new/helloworld/target/helloworld-sources.jar to /home/aw/.m2/repository/org/wildfly/quickstarts/helloworld/11.0.0-SNAPSHOT/helloworld-11.0.0-SNAPSHOT-sources.jar

      [INFO]

      [INFO] >>> wildfly-maven-plugin:1.2.0.Alpha2:deploy (default-cli) > package @ helloworld >>>

      [INFO]

      [INFO] --- maven-enforcer-plugin:1.4.1:enforce (enforce-java-version) @ helloworld ---

      [INFO]

      [INFO] --- maven-enforcer-plugin:1.4.1:enforce (enforce-maven-version) @ helloworld ---

      [INFO]

      [INFO] --- buildnumber-maven-plugin:1.4:create (get-scm-revision) @ helloworld ---

      [INFO]

      [INFO] --- maven-resources-plugin:3.0.1:resources (default-resources) @ helloworld ---

      [INFO] Using 'UTF-8' encoding to copy filtered resources.

      [INFO] skip non existing resourceDirectory /home/aw/wildflyTutorial/quickstart-11.x-new/helloworld/src/main/resources

      [INFO]

      [INFO] --- maven-compiler-plugin:3.6.0:compile (default-compile) @ helloworld ---

      [INFO] Nothing to compile - all classes are up to date

      [INFO]

      [INFO] --- maven-resources-plugin:3.0.1:testResources (default-testResources) @ helloworld ---

      [INFO] Using 'UTF-8' encoding to copy filtered resources.

      [INFO] skip non existing resourceDirectory /home/aw/wildflyTutorial/quickstart-11.x-new/helloworld/src/test/resources

      [INFO]

      [INFO] --- maven-compiler-plugin:3.6.0:testCompile (default-testCompile) @ helloworld ---

      [INFO] No sources to compile

      [INFO]

      [INFO] --- maven-surefire-plugin:2.19.1:test (default-test) @ helloworld ---

      [INFO] No tests to run.

      [INFO] Skipping execution of surefire because it has already been run for this configuration

      [INFO]

      [INFO] --- maven-war-plugin:3.0.0:war (default-war) @ helloworld ---

      [INFO] Packaging webapp

      [INFO] Assembling webapp [helloworld] in [/home/aw/wildflyTutorial/quickstart-11.x-new/helloworld/target/helloworld]

      [INFO] Processing war project

      [INFO] Copying webapp resources [/home/aw/wildflyTutorial/quickstart-11.x-new/helloworld/src/main/webapp]

      [INFO] Webapp assembled in [3 msecs]

      [INFO] Building war: /home/aw/wildflyTutorial/quickstart-11.x-new/helloworld/target/helloworld.war

      [INFO]

      [INFO] --- maven-source-plugin:3.0.1:jar-no-fork (attach-sources) @ helloworld ---

      [INFO] Building jar: /home/aw/wildflyTutorial/quickstart-11.x-new/helloworld/target/helloworld-sources.jar

      [INFO]

      [INFO] <<< wildfly-maven-plugin:1.2.0.Alpha2:deploy (default-cli) < package @ helloworld <<<

      [INFO]

      [INFO] --- wildfly-maven-plugin:1.2.0.Alpha2:deploy (default-cli) @ helloworld ---

      Downloading: https://maven.repository.redhat.com/ga/org/apache/commons/commons-compress/1.13/commons-compress-1.13.pom

      Downloading: https://maven.repository.redhat.com/earlyaccess/all/org/apache/commons/commons-compress/1.13/commons-compress-1.13.pom

      Downloading: https://repository.jboss.org/nexus/content/groups/public/org/apache/commons/commons-compress/1.13/commons-compress-1.13.pom

      Downloading: https://repo.maven.apache.org/maven2/org/apache/commons/commons-compress/1.13/commons-compress-1.13.pom

      Downloaded: https://repo.maven.apache.org/maven2/org/apache/commons/commons-compress/1.13/commons-compress-1.13.pom (14 KB at 264.3 KB/sec)

      Downloading: https://maven.repository.redhat.com/ga/org/apache/commons/commons-parent/41/commons-parent-41.pom

      Downloading: https://maven.repository.redhat.com/earlyaccess/all/org/apache/commons/commons-parent/41/commons-parent-41.pom

      Downloading: https://repository.jboss.org/nexus/content/groups/public/org/apache/commons/commons-parent/41/commons-parent-41.pom

      Downloading: https://repo.maven.apache.org/maven2/org/apache/commons/commons-parent/41/commons-parent-41.pom

      Downloaded: https://repo.maven.apache.org/maven2/org/apache/commons/commons-parent/41/commons-parent-41.pom (64 KB at 1073.2 KB/sec)

      Downloading: https://maven.repository.redhat.com/ga/org/apache/maven/maven-core/3.3.1/maven-core-3.3.1.pom

      Downloading: https://maven.repository.redhat.com/earlyaccess/all/org/apache/maven/maven-core/3.3.1/maven-core-3.3.1.pom

      Downloading: https://repository.jboss.org/nexus/content/groups/public/org/apache/maven/maven-core/3.3.1/maven-core-3.3.1.pom

      Downloading: https://repo.maven.apache.org/maven2/org/apache/maven/maven-core/3.3.1/maven-core-3.3.1.pom

      Downloaded: https://repo.maven.apache.org/maven2/org/apache/maven/maven-core/3.3.1/maven-core-3.3.1.pom (9 KB at 90.3 KB/sec)

      Downloading: https://maven.repository.redhat.com/ga/org/apache/maven/maven/3.3.1/maven-3.3.1.pom

      Downloading: https://maven.repository.redhat.com/earlyaccess/all/org/apache/maven/maven/3.3.1/maven-3.3.1.pom

      Downloading: https://repository.jboss.org/nexus/content/groups/public/org/apache/maven/maven/3.3.1/maven-3.3.1.pom

      Downloading: https://repo.maven.apache.org/maven2/org/apache/maven/maven/3.3.1/maven-3.3.1.pom

      Downloaded: https://repo.maven.apache.org/maven2/org/apache/maven/maven/3.3.1/maven-3.3.1.pom (23 KB at 240.4 KB/sec)

      Downloading: https://maven.repository.redhat.com/ga/org/apache/maven/maven-model/3.3.1/maven-model-3.3.1.pom

      Downloading: https://maven.repository.redhat.com/earlyaccess/all/org/apache/maven/maven-model/3.3.1/maven-model-3.3.1.pom

      Downloading: https://repository.jboss.org/nexus/content/groups/public/org/apache/maven/maven-model/3.3.1/maven-model-3.3.1.pom

      Downloading: https://repo.maven.apache.org/maven2/org/apache/maven/maven-model/3.3.1/maven-model-3.3.1.pom

      Downloaded: https://repo.maven.apache.org/maven2/org/apache/maven/maven-model/3.3.1/maven-model-3.3.1.pom (5 KB at 21.4 KB/sec)

      Downloading: https://maven.repository.redhat.com/ga/org/apache/maven/maven-settings/3.3.1/maven-settings-3.3.1.pom

      Downloading: https://maven.repository.redhat.com/earlyaccess/all/org/apache/maven/maven-settings/3.3.1/maven-settings-3.3.1.pom

      Downloading: https://repository.jboss.org/nexus/content/groups/public/org/apache/maven/maven-settings/3.3.1/maven-settings-3.3.1.pom

      Downloading: https://repo.maven.apache.org/maven2/org/apache/maven/maven-settings/3.3.1/maven-settings-3.3.1.pom

      Downloaded: https://repo.maven.apache.org/maven2/org/apache/maven/maven-settings/3.3.1/maven-settings-3.3.1.pom (3 KB at 20.4 KB/sec)

      Downloading: https://maven.repository.redhat.com/ga/org/apache/maven/maven-settings-builder/3.3.1/maven-settings-builder-3.3.1.pom

      Downloading: https://maven.repository.redhat.com/earlyaccess/all/org/apache/maven/maven-settings-builder/3.3.1/maven-settings-builder-3.3.1.pom

      Downloading: https://repository.jboss.org/nexus/content/groups/public/org/apache/maven/maven-settings-builder/3.3.1/maven-settings-builder-3.3.1.pom

      Downloading: https://repo.maven.apache.org/maven2/org/apache/maven/maven-settings-builder/3.3.1/maven-settings-builder-3.3.1.pom

      Downloaded: https://repo.maven.apache.org/maven2/org/apache/maven/maven-settings-builder/3.3.1/maven-settings-builder-3.3.1.pom (3 KB at 26.7 KB/sec)

      Downloading: https://maven.repository.redhat.com/ga/org/apache/maven/maven-builder-support/3.3.1/maven-builder-support-3.3.1.pom

      Downloading: https://maven.repository.redhat.com/earlyaccess/all/org/apache/maven/maven-builder-support/3.3.1/maven-builder-support-3.3.1.pom

      Downloading: https://repository.jboss.org/nexus/content/groups/public/org/apache/maven/maven-builder-support/3.3.1/maven-builder-support-3.3.1.pom

      Downloading: https://repo.maven.apache.org/maven2/org/apache/maven/maven-builder-support/3.3.1/maven-builder-support-3.3.1.pom

      Downloaded: https://repo.maven.apache.org/maven2/org/apache/maven/maven-builder-support/3.3.1/maven-builder-support-3.3.1.pom (2 KB at 13.4 KB/sec)

      Downloading: https://maven.repository.redhat.com/ga/org/apache/maven/maven-repository-metadata/3.3.1/maven-repository-metadata-3.3.1.pom

      Downloading: https://maven.repository.redhat.com/earlyaccess/all/org/apache/maven/maven-repository-metadata/3.3.1/maven-repository-metadata-3.3.1.pom

      Downloading: https://repository.jboss.org/nexus/content/groups/public/org/apache/maven/maven-repository-metadata/3.3.1/maven-repository-metadata-3.3.1.pom

      Downloading: https://repo.maven.apache.org/maven2/org/apache/maven/maven-repository-metadata/3.3.1/maven-repository-metadata-3.3.1.pom

      Downloaded: https://repo.maven.apache.org/maven2/org/apache/maven/maven-repository-metadata/3.3.1/maven-repository-metadata-3.3.1.pom (3 KB at 20.7 KB/sec)

      Downloading: https://maven.repository.redhat.com/ga/org/apache/maven/maven-artifact/3.3.1/maven-artifact-3.3.1.pom

      Downloading: https://maven.repository.redhat.com/earlyaccess/all/org/apache/maven/maven-artifact/3.3.1/maven-artifact-3.3.1.pom

      Downloading: https://repository.jboss.org/nexus/content/groups/public/org/apache/maven/maven-artifact/3.3.1/maven-artifact-3.3.1.pom

      Downloading: https://repo.maven.apache.org/maven2/org/apache/maven/maven-artifact/3.3.1/maven-artifact-3.3.1.pom

      Downloaded: https://repo.maven.apache.org/maven2/org/apache/maven/maven-artifact/3.3.1/maven-artifact-3.3.1.pom (3 KB at 17.5 KB/sec)

      Downloading: https://maven.repository.redhat.com/ga/org/apache/maven/maven-plugin-api/3.3.1/maven-plugin-api-3.3.1.pom

      Downloading: https://maven.repository.redhat.com/earlyaccess/all/org/apache/maven/maven-plugin-api/3.3.1/maven-plugin-api-3.3.1.pom

      Downloading: https://repository.jboss.org/nexus/content/groups/public/org/apache/maven/maven-plugin-api/3.3.1/maven-plugin-api-3.3.1.pom

      Downloading: https://repo.maven.apache.org/maven2/org/apache/maven/maven-plugin-api/3.3.1/maven-plugin-api-3.3.1.pom

      Downloaded: https://repo.maven.apache.org/maven2/org/apache/maven/maven-plugin-api/3.3.1/maven-plugin-api-3.3.1.pom (3 KB at 29.0 KB/sec)

      Downloading: https://maven.repository.redhat.com/ga/org/eclipse/sisu/org.eclipse.sisu.plexus/0.3.0/org.eclipse.sisu.plexus-0.3.0.pom

      Downloaded: https://maven.repository.redhat.com/ga/org/eclipse/sisu/org.eclipse.sisu.plexus/0.3.0/org.eclipse.sisu.plexus-0.3.0.pom (5 KB at 7.9 KB/sec)

      Downloading: https://maven.repository.redhat.com/ga/org/eclipse/sisu/sisu-plexus/0.3.0/sisu-plexus-0.3.0.pom

      Downloaded: https://maven.repository.redhat.com/ga/org/eclipse/sisu/sisu-plexus/0.3.0/sisu-plexus-0.3.0.pom (14 KB at 36.0 KB/sec)

      Downloading: https://maven.repository.redhat.com/ga/org/sonatype/oss/oss-parent/9/oss-parent-9.pom

      Downloaded: https://maven.repository.redhat.com/ga/org/sonatype/oss/oss-parent/9/oss-parent-9.pom (7 KB at 12.8 KB/sec)

      Downloading: https://maven.repository.redhat.com/ga/javax/enterprise/cdi-api/1.0/cdi-api-1.0.pom

      Downloaded: https://maven.repository.redhat.com/ga/javax/enterprise/cdi-api/1.0/cdi-api-1.0.pom (2 KB at 3.2 KB/sec)

      Downloading: https://maven.repository.redhat.com/ga/org/jboss/weld/weld-api-parent/1.0/weld-api-parent-1.0.pom

      Downloaded: https://maven.repository.redhat.com/ga/org/jboss/weld/weld-api-parent/1.0/weld-api-parent-1.0.pom (3 KB at 5.3 KB/sec)

      Downloading: https://maven.repository.redhat.com/ga/org/jboss/weld/weld-api-bom/1.0/weld-api-bom-1.0.pom

      Downloaded: https://maven.repository.redhat.com/ga/org/jboss/weld/weld-api-bom/1.0/weld-api-bom-1.0.pom (8 KB at 25.2 KB/sec)

      Downloading: https://maven.repository.redhat.com/ga/org/jboss/weld/weld-parent/6/weld-parent-6.pom

      Downloaded: https://maven.repository.redhat.com/ga/org/jboss/weld/weld-parent/6/weld-parent-6.pom (21 KB at 58.2 KB/sec)

      Downloading: https://maven.repository.redhat.com/ga/javax/annotation/jsr250-api/1.0/jsr250-api-1.0.pom

      Downloaded: https://maven.repository.redhat.com/ga/javax/annotation/jsr250-api/1.0/jsr250-api-1.0.pom (165 B at 0.5 KB/sec)

      Downloading: https://maven.repository.redhat.com/ga/org/eclipse/sisu/org.eclipse.sisu.inject/0.3.0/org.eclipse.sisu.inject-0.3.0.pom

      Downloaded: https://maven.repository.redhat.com/ga/org/eclipse/sisu/org.eclipse.sisu.inject/0.3.0/org.eclipse.sisu.inject-0.3.0.pom (3 KB at 5.6 KB/sec)

      Downloading: https://maven.repository.redhat.com/ga/org/eclipse/sisu/sisu-inject/0.3.0/sisu-inject-0.3.0.pom

      Downloaded: https://maven.repository.redhat.com/ga/org/eclipse/sisu/sisu-inject/0.3.0/sisu-inject-0.3.0.pom (15 KB at 40.1 KB/sec)

      Downloading: https://maven.repository.redhat.com/ga/org/codehaus/plexus/plexus-classworlds/2.5.2/plexus-classworlds-2.5.2.pom

      Downloaded: https://maven.repository.redhat.com/ga/org/codehaus/plexus/plexus-classworlds/2.5.2/plexus-classworlds-2.5.2.pom (8 KB at 15.1 KB/sec)

      Downloading: https://maven.repository.redhat.com/ga/org/codehaus/plexus/plexus-utils/3.0.17/plexus-utils-3.0.17.pom

      Downloaded: https://maven.repository.redhat.com/ga/org/codehaus/plexus/plexus-utils/3.0.17/plexus-utils-3.0.17.pom (4 KB at 8.4 KB/sec)

      Downloading: https://maven.repository.redhat.com/ga/org/apache/maven/maven-model-builder/3.3.1/maven-model-builder-3.3.1.pom

      Downloading: https://maven.repository.redhat.com/earlyaccess/all/org/apache/maven/maven-model-builder/3.3.1/maven-model-builder-3.3.1.pom

      Downloading: https://repository.jboss.org/nexus/content/groups/public/org/apache/maven/maven-model-builder/3.3.1/maven-model-builder-3.3.1.pom

      Downloading: https://repo.maven.apache.org/maven2/org/apache/maven/maven-model-builder/3.3.1/maven-model-builder-3.3.1.pom

      Downloaded: https://repo.maven.apache.org/maven2/org/apache/maven/maven-model-builder/3.3.1/maven-model-builder-3.3.1.pom (4 KB at 31.6 KB/sec)

      Downloading: https://maven.repository.redhat.com/ga/com/google/guava/guava/18.0/guava-18.0.pom

      Downloaded: https://maven.repository.redhat.com/ga/com/google/guava/guava/18.0/guava-18.0.pom (6 KB at 33.5 KB/sec)

      Downloading: https://maven.repository.redhat.com/ga/com/google/guava/guava-parent/18.0/guava-parent-18.0.pom

      Downloaded: https://maven.repository.redhat.com/ga/com/google/guava/guava-parent/18.0/guava-parent-18.0.pom (8 KB at 64.7 KB/sec)

      Downloading: https://maven.repository.redhat.com/ga/org/apache/maven/maven-aether-provider/3.3.1/maven-aether-provider-3.3.1.pom

      Downloading: https://maven.repository.redhat.com/earlyaccess/all/org/apache/maven/maven-aether-provider/3.3.1/maven-aether-provider-3.3.1.pom

      Downloading: https://repository.jboss.org/nexus/content/groups/public/org/apache/maven/maven-aether-provider/3.3.1/maven-aether-provider-3.3.1.pom

      Downloading: https://repo.maven.apache.org/maven2/org/apache/maven/maven-aether-provider/3.3.1/maven-aether-provider-3.3.1.pom

      Downloaded: https://repo.maven.apache.org/maven2/org/apache/maven/maven-aether-provider/3.3.1/maven-aether-provider-3.3.1.pom (5 KB at 44.2 KB/sec)

      Downloading: https://maven.repository.redhat.com/ga/org/eclipse/aether/aether-api/1.1.0/aether-api-1.1.0.pom

      Downloading: https://maven.repository.redhat.com/earlyaccess/all/org/eclipse/aether/aether-api/1.1.0/aether-api-1.1.0.pom

      Downloading: https://repository.jboss.org/nexus/content/groups/public/org/eclipse/aether/aether-api/1.1.0/aether-api-1.1.0.pom

      Downloading: https://repo.maven.apache.org/maven2/org/eclipse/aether/aether-api/1.1.0/aether-api-1.1.0.pom

      Downloaded: https://repo.maven.apache.org/maven2/org/eclipse/aether/aether-api/1.1.0/aether-api-1.1.0.pom (2 KB at 35.6 KB/sec)

      Downloading: https://maven.repository.redhat.com/ga/org/eclipse/aether/aether/1.1.0/aether-1.1.0.pom

      Downloading: https://maven.repository.redhat.com/earlyaccess/all/org/eclipse/aether/aether/1.1.0/aether-1.1.0.pom

      Downloading: https://repository.jboss.org/nexus/content/groups/public/org/eclipse/aether/aether/1.1.0/aether-1.1.0.pom

      Downloading: https://repo.maven.apache.org/maven2/org/eclipse/aether/aether/1.1.0/aether-1.1.0.pom

      Downloaded: https://repo.maven.apache.org/maven2/org/eclipse/aether/aether/1.1.0/aether-1.1.0.pom (26 KB at 427.3 KB/sec)

      Downloading: https://maven.repository.redhat.com/ga/org/eclipse/aether/aether-spi/1.0.2.v20150114/aether-spi-1.0.2.v20150114.pom

      Downloaded: https://maven.repository.redhat.com/ga/org/eclipse/aether/aether-spi/1.0.2.v20150114/aether-spi-1.0.2.v20150114.pom (2 KB at 4.1 KB/sec)

      Downloading: https://maven.repository.redhat.com/ga/org/eclipse/aether/aether/1.0.2.v20150114/aether-1.0.2.v20150114.pom

      Downloaded: https://maven.repository.redhat.com/ga/org/eclipse/aether/aether/1.0.2.v20150114/aether-1.0.2.v20150114.pom (29 KB at 75.2 KB/sec)

      Downloading: https://maven.repository.redhat.com/ga/org/eclipse/aether/aether-util/1.0.2.v20150114/aether-util-1.0.2.v20150114.pom

      Downloaded: https://maven.repository.redhat.com/ga/org/eclipse/aether/aether-util/1.0.2.v20150114/aether-util-1.0.2.v20150114.pom (3 KB at 5.2 KB/sec)

      Downloading: https://maven.repository.redhat.com/ga/org/eclipse/aether/aether-impl/1.0.2.v20150114/aether-impl-1.0.2.v20150114.pom

      Downloaded: https://maven.repository.redhat.com/ga/org/eclipse/aether/aether-impl/1.0.2.v20150114/aether-impl-1.0.2.v20150114.pom (4 KB at 7.3 KB/sec)

      Downloading: https://maven.repository.redhat.com/ga/org/sonatype/sisu/sisu-guice/3.2.5/sisu-guice-3.2.5.pom

      Downloaded: https://maven.repository.redhat.com/ga/org/sonatype/sisu/sisu-guice/3.2.5/sisu-guice-3.2.5.pom (11 KB at 26.3 KB/sec)

      Downloading: https://maven.repository.redhat.com/ga/org/sonatype/sisu/inject/guice-parent/3.2.5/guice-parent-3.2.5.pom

      Downloaded: https://maven.repository.redhat.com/ga/org/sonatype/sisu/inject/guice-parent/3.2.5/guice-parent-3.2.5.pom (15 KB at 41.2 KB/sec)

      Downloading: https://maven.repository.redhat.com/ga/org/sonatype/forge/forge-parent/38/forge-parent-38.pom

      Downloaded: https://maven.repository.redhat.com/ga/org/sonatype/forge/forge-parent/38/forge-parent-38.pom (19 KB at 45.2 KB/sec)

      Downloading: https://maven.repository.redhat.com/ga/aopalliance/aopalliance/1.0/aopalliance-1.0.pom

      Downloaded: https://maven.repository.redhat.com/ga/aopalliance/aopalliance/1.0/aopalliance-1.0.pom (363 B at 8.2 KB/sec)

      Downloading: https://maven.repository.redhat.com/ga/com/google/guava/guava/16.0.1/guava-16.0.1.pom

      Downloaded: https://maven.repository.redhat.com/ga/com/google/guava/guava/16.0.1/guava-16.0.1.pom (6 KB at 11.0 KB/sec)

      Downloading: https://maven.repository.redhat.com/ga/com/google/guava/guava-parent/16.0.1/guava-parent-16.0.1.pom

      Downloaded: https://maven.repository.redhat.com/ga/com/google/guava/guava-parent/16.0.1/guava-parent-16.0.1.pom (8 KB at 15.6 KB/sec)

      Downloading: https://maven.repository.redhat.com/ga/org/jboss/jdf/stacks-client/1.0.3.Final/stacks-client-1.0.3.Final.pom

      Downloading: https://maven.repository.redhat.com/earlyaccess/all/org/jboss/jdf/stacks-client/1.0.3.Final/stacks-client-1.0.3.Final.pom

      Downloading: https://repository.jboss.org/nexus/content/groups/public/org/jboss/jdf/stacks-client/1.0.3.Final/stacks-client-1.0.3.Final.pom

      Downloaded: https://repository.jboss.org/nexus/content/groups/public/org/jboss/jdf/stacks-client/1.0.3.Final/stacks-client-1.0.3.Final.pom (8 KB at 12.8 KB/sec)

      Downloading: https://maven.repository.redhat.com/ga/org/yaml/snakeyaml/1.13/snakeyaml-1.13.pom

      Downloaded: https://maven.repository.redhat.com/ga/org/yaml/snakeyaml/1.13/snakeyaml-1.13.pom (22 KB at 16.9 KB/sec)

      Downloading: https://maven.repository.redhat.com/ga/org/wildfly/core/wildfly-cli/3.0.0.Alpha24/wildfly-cli-3.0.0.Alpha24.pom

      Downloading: https://maven.repository.redhat.com/earlyaccess/all/org/wildfly/core/wildfly-cli/3.0.0.Alpha24/wildfly-cli-3.0.0.Alpha24.pom

      Downloading: https://repository.jboss.org/nexus/content/groups/public/org/wildfly/core/wildfly-cli/3.0.0.Alpha24/wildfly-cli-3.0.0.Alpha24.pom

      Downloaded: https://repository.jboss.org/nexus/content/groups/public/org/wildfly/core/wildfly-cli/3.0.0.Alpha24/wildfly-cli-3.0.0.Alpha24.pom (11 KB at 33.0 KB/sec)

      Downloading: https://maven.repository.redhat.com/ga/org/wildfly/core/wildfly-core-parent/3.0.0.Alpha24/wildfly-core-parent-3.0.0.Alpha24.pom

      Downloading: https://maven.repository.redhat.com/earlyaccess/all/org/wildfly/core/wildfly-core-parent/3.0.0.Alpha24/wildfly-core-parent-3.0.0.Alpha24.pom

      Downloading: https://repository.jboss.org/nexus/content/groups/public/org/wildfly/core/wildfly-core-parent/3.0.0.Alpha24/wildfly-core-parent-3.0.0.Alpha24.pom

      Downloaded: https://repository.jboss.org/nexus/content/groups/public/org/wildfly/core/wildfly-core-parent/3.0.0.Alpha24/wildfly-core-parent-3.0.0.Alpha24.pom (78 KB at 141.0 KB/sec)

      Downloading: https://maven.repository.redhat.com/ga/org/jboss/aesh/aesh/0.66.14/aesh-0.66.14.pom

      Downloading: https://maven.repository.redhat.com/earlyaccess/all/org/jboss/aesh/aesh/0.66.14/aesh-0.66.14.pom

      Downloading: https://repository.jboss.org/nexus/content/groups/public/org/jboss/aesh/aesh/0.66.14/aesh-0.66.14.pom

      Downloaded: https://repository.jboss.org/nexus/content/groups/public/org/jboss/aesh/aesh/0.66.14/aesh-0.66.14.pom (4 KB at 9.3 KB/sec)

      Downloading: https://maven.repository.redhat.com/ga/org/fusesource/jansi/jansi/1.11/jansi-1.11.pom

      Downloaded: https://maven.repository.redhat.com/ga/org/fusesource/jansi/jansi/1.11/jansi-1.11.pom (4 KB at 4.8 KB/sec)

      Downloading: https://maven.repository.redhat.com/ga/org/fusesource/jansi/jansi-project/1.11/jansi-project-1.11.pom

      Downloaded: https://maven.repository.redhat.com/ga/org/fusesource/jansi/jansi-project/1.11/jansi-project-1.11.pom (12 KB at 8.5 KB/sec)

      Downloading: https://maven.repository.redhat.com/ga/org/jboss/staxmapper/1.3.0.Final/staxmapper-1.3.0.Final.pom

      Downloading: https://maven.repository.redhat.com/earlyaccess/all/org/jboss/staxmapper/1.3.0.Final/staxmapper-1.3.0.Final.pom

      Downloading: https://repository.jboss.org/nexus/content/groups/public/org/jboss/staxmapper/1.3.0.Final/staxmapper-1.3.0.Final.pom

      Downloaded: https://repository.jboss.org/nexus/content/groups/public/org/jboss/staxmapper/1.3.0.Final/staxmapper-1.3.0.Final.pom (4 KB at 9.3 KB/sec)

      Downloading: https://maven.repository.redhat.com/ga/org/jboss/modules/jboss-modules/1.6.0.Beta4/jboss-modules-1.6.0.Beta4.pom

      Downloading: https://maven.repository.redhat.com/earlyaccess/all/org/jboss/modules/jboss-modules/1.6.0.Beta4/jboss-modules-1.6.0.Beta4.pom

      Downloading: https://repository.jboss.org/nexus/content/groups/public/org/jboss/modules/jboss-modules/1.6.0.Beta4/jboss-modules-1.6.0.Beta4.pom

      Downloaded: https://repository.jboss.org/nexus/content/groups/public/org/jboss/modules/jboss-modules/1.6.0.Beta4/jboss-modules-1.6.0.Beta4.pom (9 KB at 21.1 KB/sec)

      Downloading: https://maven.repository.redhat.com/ga/org/wildfly/core/wildfly-controller-client/3.0.0.Alpha24/wildfly-controller-client-3.0.0.Alpha24.pom

      Downloading: https://maven.repository.redhat.com/earlyaccess/all/org/wildfly/core/wildfly-controller-client/3.0.0.Alpha24/wildfly-controller-client-3.0.0.Alpha24.pom

      Downloading: https://repository.jboss.org/nexus/content/groups/public/org/wildfly/core/wildfly-controller-client/3.0.0.Alpha24/wildfly-controller-client-3.0.0.Alpha24.pom

      Downloaded: https://repository.jboss.org/nexus/content/groups/public/org/wildfly/core/wildfly-controller-client/3.0.0.Alpha24/wildfly-controller-client-3.0.0.Alpha24.pom (4 KB at 8.3 KB/sec)

      Downloading: https://maven.repository.redhat.com/ga/org/wildfly/core/wildfly-protocol/3.0.0.Alpha24/wildfly-protocol-3.0.0.Alpha24.pom

      Downloading: https://maven.repository.redhat.com/earlyaccess/all/org/wildfly/core/wildfly-protocol/3.0.0.Alpha24/wildfly-protocol-3.0.0.Alpha24.pom

      Downloading: https://repository.jboss.org/nexus/content/groups/public/org/wildfly/core/wildfly-protocol/3.0.0.Alpha24/wildfly-protocol-3.0.0.Alpha24.pom

      Downloaded: https://repository.jboss.org/nexus/content/groups/public/org/wildfly/core/wildfly-protocol/3.0.0.Alpha24/wildfly-protocol-3.0.0.Alpha24.pom (4 KB at 9.9 KB/sec)

      Downloading: https://maven.repository.redhat.com/ga/org/jboss/logging/jboss-logging/3.3.0.Final/jboss-logging-3.3.0.Final.pom

      Downloaded: https://maven.repository.redhat.com/ga/org/jboss/logging/jboss-logging/3.3.0.Final/jboss-logging-3.3.0.Final.pom (6 KB at 41.2 KB/sec)

      Downloading: https://maven.repository.redhat.com/ga/org/jboss/jboss-parent/15/jboss-parent-15.pom

      Downloaded: https://maven.repository.redhat.com/ga/org/jboss/jboss-parent/15/jboss-parent-15.pom (31 KB at 410.4 KB/sec)

      Downloading: https://maven.repository.redhat.com/ga/org/jboss/remoting/jboss-remoting/5.0.0.Beta16/jboss-remoting-5.0.0.Beta16.pom

      Downloading: https://maven.repository.redhat.com/earlyaccess/all/org/jboss/remoting/jboss-remoting/5.0.0.Beta16/jboss-remoting-5.0.0.Beta16.pom

      Downloading: https://repository.jboss.org/nexus/content/groups/public/org/jboss/remoting/jboss-remoting/5.0.0.Beta16/jboss-remoting-5.0.0.Beta16.pom

      Downloaded: https://repository.jboss.org/nexus/content/groups/public/org/jboss/remoting/jboss-remoting/5.0.0.Beta16/jboss-remoting-5.0.0.Beta16.pom (15 KB at 39.2 KB/sec)

      Downloading: https://maven.repository.redhat.com/ga/org/jboss/jboss-parent/20/jboss-parent-20.pom

      Downloaded: https://maven.repository.redhat.com/ga/org/jboss/jboss-parent/20/jboss-parent-20.pom (34 KB at 159.4 KB/sec)

      Downloading: https://maven.repository.redhat.com/ga/org/jboss/xnio/xnio-api/3.5.0.Beta1/xnio-api-3.5.0.Beta1.pom

      Downloading: https://maven.repository.redhat.com/earlyaccess/all/org/jboss/xnio/xnio-api/3.5.0.Beta1/xnio-api-3.5.0.Beta1.pom

      Downloading: https://repository.jboss.org/nexus/content/groups/public/org/jboss/xnio/xnio-api/3.5.0.Beta1/xnio-api-3.5.0.Beta1.pom

      Downloaded: https://repository.jboss.org/nexus/content/groups/public/org/jboss/xnio/xnio-api/3.5.0.Beta1/xnio-api-3.5.0.Beta1.pom (9 KB at 28.3 KB/sec)

      Downloading: https://maven.repository.redhat.com/ga/org/jboss/xnio/xnio-all/3.5.0.Beta1/xnio-all-3.5.0.Beta1.pom

      Downloading: https://maven.repository.redhat.com/earlyaccess/all/org/jboss/xnio/xnio-all/3.5.0.Beta1/xnio-all-3.5.0.Beta1.pom

      Downloading: https://repository.jboss.org/nexus/content/groups/public/org/jboss/xnio/xnio-all/3.5.0.Beta1/xnio-all-3.5.0.Beta1.pom

      Downloaded: https://repository.jboss.org/nexus/content/groups/public/org/jboss/xnio/xnio-all/3.5.0.Beta1/xnio-all-3.5.0.Beta1.pom (7 KB at 15.4 KB/sec)

      Downloading: https://maven.repository.redhat.com/ga/org/wildfly/common/wildfly-common/1.2.0.Beta5/wildfly-common-1.2.0.Beta5.pom

      Downloading: https://maven.repository.redhat.com/earlyaccess/all/org/wildfly/common/wildfly-common/1.2.0.Beta5/wildfly-common-1.2.0.Beta5.pom

      Downloading: https://repository.jboss.org/nexus/content/groups/public/org/wildfly/common/wildfly-common/1.2.0.Beta5/wildfly-common-1.2.0.Beta5.pom

      Downloaded: https://repository.jboss.org/nexus/content/groups/public/org/wildfly/common/wildfly-common/1.2.0.Beta5/wildfly-common-1.2.0.Beta5.pom (4 KB at 8.6 KB/sec)

      Downloading: https://maven.repository.redhat.com/ga/org/wildfly/client/wildfly-client-config/1.0.0.Beta1/wildfly-client-config-1.0.0.Beta1.pom

      Downloading: https://maven.repository.redhat.com/earlyaccess/all/org/wildfly/client/wildfly-client-config/1.0.0.Beta1/wildfly-client-config-1.0.0.Beta1.pom

      Downloading: https://repository.jboss.org/nexus/content/groups/public/org/wildfly/client/wildfly-client-config/1.0.0.Beta1/wildfly-client-config-1.0.0.Beta1.pom

      Downloaded: https://repository.jboss.org/nexus/content/groups/public/org/wildfly/client/wildfly-client-config/1.0.0.Beta1/wildfly-client-config-1.0.0.Beta1.pom (6 KB at 15.5 KB/sec)

      Downloading: https://maven.repository.redhat.com/ga/org/wildfly/security/wildfly-elytron/1.1.0.Beta23/wildfly-elytron-1.1.0.Beta23.pom

      Downloading: https://maven.repository.redhat.com/earlyaccess/all/org/wildfly/security/wildfly-elytron/1.1.0.Beta23/wildfly-elytron-1.1.0.Beta23.pom

      Downloading: https://repository.jboss.org/nexus/content/groups/public/org/wildfly/security/wildfly-elytron/1.1.0.Beta23/wildfly-elytron-1.1.0.Beta23.pom

      Downloaded: https://repository.jboss.org/nexus/content/groups/public/org/wildfly/security/wildfly-elytron/1.1.0.Beta23/wildfly-elytron-1.1.0.Beta23.pom (21 KB at 68.5 KB/sec)

      Downloading: https://maven.repository.redhat.com/ga/org/jboss/threads/jboss-threads/2.2.1.Final/jboss-threads-2.2.1.Final.pom

      Downloading: https://maven.repository.redhat.com/earlyaccess/all/org/jboss/threads/jboss-threads/2.2.1.Final/jboss-threads-2.2.1.Final.pom

      Downloading: https://repository.jboss.org/nexus/content/groups/public/org/jboss/threads/jboss-threads/2.2.1.Final/jboss-threads-2.2.1.Final.pom

      Downloaded: https://repository.jboss.org/nexus/content/groups/public/org/jboss/threads/jboss-threads/2.2.1.Final/jboss-threads-2.2.1.Final.pom (4 KB at 10.8 KB/sec)

      Downloading: https://maven.repository.redhat.com/ga/org/jboss/jboss-parent/13/jboss-parent-13.pom

      Downloading: https://maven.repository.redhat.com/earlyaccess/all/org/jboss/jboss-parent/13/jboss-parent-13.pom

      Downloading: https://repository.jboss.org/nexus/content/groups/public/org/jboss/jboss-parent/13/jboss-parent-13.pom

      Downloaded: https://repository.jboss.org/nexus/content/groups/public/org/jboss/jboss-parent/13/jboss-parent-13.pom (32 KB at 108.0 KB/sec)

      Downloading: https://maven.repository.redhat.com/ga/org/jboss/xnio/xnio-nio/3.5.0.Beta1/xnio-nio-3.5.0.Beta1.pom

      Downloading: https://maven.repository.redhat.com/earlyaccess/all/org/jboss/xnio/xnio-nio/3.5.0.Beta1/xnio-nio-3.5.0.Beta1.pom

      Downloading: https://repository.jboss.org/nexus/content/groups/public/org/jboss/xnio/xnio-nio/3.5.0.Beta1/xnio-nio-3.5.0.Beta1.pom

      Downloaded: https://repository.jboss.org/nexus/content/groups/public/org/jboss/xnio/xnio-nio/3.5.0.Beta1/xnio-nio-3.5.0.Beta1.pom (8 KB at 19.8 KB/sec)

      Downloading: https://maven.repository.redhat.com/ga/org/jboss/jboss-dmr/1.4.0.Beta1/jboss-dmr-1.4.0.Beta1.pom

      Downloading: https://maven.repository.redhat.com/earlyaccess/all/org/jboss/jboss-dmr/1.4.0.Beta1/jboss-dmr-1.4.0.Beta1.pom

      Downloading: https://repository.jboss.org/nexus/content/groups/public/org/jboss/jboss-dmr/1.4.0.Beta1/jboss-dmr-1.4.0.Beta1.pom

      Downloaded: https://repository.jboss.org/nexus/content/groups/public/org/jboss/jboss-dmr/1.4.0.Beta1/jboss-dmr-1.4.0.Beta1.pom (6 KB at 10.9 KB/sec)

      Downloading: https://maven.repository.redhat.com/ga/org/wildfly/core/wildfly-embedded/3.0.0.Alpha24/wildfly-embedded-3.0.0.Alpha24.pom

      Downloading: https://maven.repository.redhat.com/earlyaccess/all/org/wildfly/core/wildfly-embedded/3.0.0.Alpha24/wildfly-embedded-3.0.0.Alpha24.pom

      Downloading: https://repository.jboss.org/nexus/content/groups/public/org/wildfly/core/wildfly-embedded/3.0.0.Alpha24/wildfly-embedded-3.0.0.Alpha24.pom

      Downloaded: https://repository.jboss.org/nexus/content/groups/public/org/wildfly/core/wildfly-embedded/3.0.0.Alpha24/wildfly-embedded-3.0.0.Alpha24.pom (4 KB at 10.4 KB/sec)

      Downloading: https://maven.repository.redhat.com/ga/org/jboss/msc/jboss-msc/1.2.7.SP1/jboss-msc-1.2.7.SP1.pom

      Downloading: https://maven.repository.redhat.com/earlyaccess/all/org/jboss/msc/jboss-msc/1.2.7.SP1/jboss-msc-1.2.7.SP1.pom

      Downloading: https://repository.jboss.org/nexus/content/groups/public/org/jboss/msc/jboss-msc/1.2.7.SP1/jboss-msc-1.2.7.SP1.pom

      Downloaded: https://repository.jboss.org/nexus/content/groups/public/org/jboss/msc/jboss-msc/1.2.7.SP1/jboss-msc-1.2.7.SP1.pom (11 KB at 36.9 KB/sec)

      Downloading: https://maven.repository.redhat.com/ga/org/jboss/remotingjmx/remoting-jmx/3.0.0.Beta3/remoting-jmx-3.0.0.Beta3.pom

      Downloading: https://maven.repository.redhat.com/earlyaccess/all/org/jboss/remotingjmx/remoting-jmx/3.0.0.Beta3/remoting-jmx-3.0.0.Beta3.pom

      Downloading: https://repository.jboss.org/nexus/content/groups/public/org/jboss/remotingjmx/remoting-jmx/3.0.0.Beta3/remoting-jmx-3.0.0.Beta3.pom

      Downloaded: https://repository.jboss.org/nexus/content/groups/public/org/jboss/remotingjmx/remoting-jmx/3.0.0.Beta3/remoting-jmx-3.0.0.Beta3.pom (10 KB at 34.1 KB/sec)

      Downloading: https://maven.repository.redhat.com/ga/org/jboss/marshalling/jboss-marshalling/2.0.0.Beta4/jboss-marshalling-2.0.0.Beta4.pom

      Downloading: https://maven.repository.redhat.com/earlyaccess/all/org/jboss/marshalling/jboss-marshalling/2.0.0.Beta4/jboss-marshalling-2.0.0.Beta4.pom

      Downloading: https://repository.jboss.org/nexus/content/groups/public/org/jboss/marshalling/jboss-marshalling/2.0.0.Beta4/jboss-marshalling-2.0.0.Beta4.pom

      Downloaded: https://repository.jboss.org/nexus/content/groups/public/org/jboss/marshalling/jboss-marshalling/2.0.0.Beta4/jboss-marshalling-2.0.0.Beta4.pom (3 KB at 6.6 KB/sec)

      Downloading: https://maven.repository.redhat.com/ga/org/jboss/marshalling/jboss-marshalling-parent/2.0.0.Beta4/jboss-marshalling-parent-2.0.0.Beta4.pom

      Downloading: https://maven.repository.redhat.com/earlyaccess/all/org/jboss/marshalling/jboss-marshalling-parent/2.0.0.Beta4/jboss-marshalling-parent-2.0.0.Beta4.pom

      Downloading: https://repository.jboss.org/nexus/content/groups/public/org/jboss/marshalling/jboss-marshalling-parent/2.0.0.Beta4/jboss-marshalling-parent-2.0.0.Beta4.pom

      Downloaded: https://repository.jboss.org/nexus/content/groups/public/org/jboss/marshalling/jboss-marshalling-parent/2.0.0.Beta4/jboss-marshalling-parent-2.0.0.Beta4.pom (7 KB at 15.3 KB/sec)

      Downloading: https://maven.repository.redhat.com/ga/org/jboss/marshalling/jboss-marshalling-river/2.0.0.Beta4/jboss-marshalling-river-2.0.0.Beta4.pom

      Downloading: https://maven.repository.redhat.com/earlyaccess/all/org/jboss/marshalling/jboss-marshalling-river/2.0.0.Beta4/jboss-marshalling-river-2.0.0.Beta4.pom

      Downloading: https://repository.jboss.org/nexus/content/groups/public/org/jboss/marshalling/jboss-marshalling-river/2.0.0.Beta4/jboss-marshalling-river-2.0.0.Beta4.pom

      Downloaded: https://repository.jboss.org/nexus/content/groups/public/org/jboss/marshalling/jboss-marshalling-river/2.0.0.Beta4/jboss-marshalling-river-2.0.0.Beta4.pom (2 KB at 3.1 KB/sec)

      Downloading: https://maven.repository.redhat.com/ga/org/jboss/remoting/jboss-remoting/5.0.0.Beta15/jboss-remoting-5.0.0.Beta15.pom

      Downloading: https://maven.repository.redhat.com/earlyaccess/all/org/jboss/remoting/jboss-remoting/5.0.0.Beta15/jboss-remoting-5.0.0.Beta15.pom

      Downloading: https://repository.jboss.org/nexus/content/groups/public/org/jboss/remoting/jboss-remoting/5.0.0.Beta15/jboss-remoting-5.0.0.Beta15.pom

      Downloaded: https://repository.jboss.org/nexus/content/groups/public/org/jboss/remoting/jboss-remoting/5.0.0.Beta15/jboss-remoting-5.0.0.Beta15.pom (15 KB at 48.5 KB/sec)

      Downloading: https://maven.repository.redhat.com/ga/org/jboss/xnio/xnio-api/3.4.0.Beta3/xnio-api-3.4.0.Beta3.pom

      Downloading: https://maven.repository.redhat.com/earlyaccess/all/org/jboss/xnio/xnio-api/3.4.0.Beta3/xnio-api-3.4.0.Beta3.pom

      Downloading: https://repository.jboss.org/nexus/content/groups/public/org/jboss/xnio/xnio-api/3.4.0.Beta3/xnio-api-3.4.0.Beta3.pom

      Downloaded: https://repository.jboss.org/nexus/content/groups/public/org/jboss/xnio/xnio-api/3.4.0.Beta3/xnio-api-3.4.0.Beta3.pom (7 KB at 18.1 KB/sec)

      Downloading: https://maven.repository.redhat.com/ga/org/jboss/xnio/xnio-all/3.4.0.Beta3/xnio-all-3.4.0.Beta3.pom

      Downloading: https://maven.repository.redhat.com/earlyaccess/all/org/jboss/xnio/xnio-all/3.4.0.Beta3/xnio-all-3.4.0.Beta3.pom

      Downloading: https://repository.jboss.org/nexus/content/groups/public/org/jboss/xnio/xnio-all/3.4.0.Beta3/xnio-all-3.4.0.Beta3.pom

      Downloaded: https://repository.jboss.org/nexus/content/groups/public/org/jboss/xnio/xnio-all/3.4.0.Beta3/xnio-all-3.4.0.Beta3.pom (6 KB at 18.7 KB/sec)

      Downloading: https://maven.repository.redhat.com/ga/org/jboss/jboss-vfs/3.2.12.Final/jboss-vfs-3.2.12.Final.pom

      Downloading: https://maven.repository.redhat.com/earlyaccess/all/org/jboss/jboss-vfs/3.2.12.Final/jboss-vfs-3.2.12.Final.pom

      Downloading: https://repository.jboss.org/nexus/content/groups/public/org/jboss/jboss-vfs/3.2.12.Final/jboss-vfs-3.2.12.Final.pom

      Downloaded: https://repository.jboss.org/nexus/content/groups/public/org/jboss/jboss-vfs/3.2.12.Final/jboss-vfs-3.2.12.Final.pom (8 KB at 19.3 KB/sec)

      Downloading: https://maven.repository.redhat.com/ga/org/jboss/stdio/jboss-stdio/1.0.2.GA/jboss-stdio-1.0.2.GA.pom

      Downloading: https://maven.repository.redhat.com/earlyaccess/all/org/jboss/stdio/jboss-stdio/1.0.2.GA/jboss-stdio-1.0.2.GA.pom

      Downloaded: https://maven.repository.redhat.com/earlyaccess/all/org/jboss/stdio/jboss-stdio/1.0.2.GA/jboss-stdio-1.0.2.GA.pom (3 KB at 3.9 KB/sec)

      Downloading: https://maven.repository.redhat.com/ga/org/jboss/logmanager/jboss-logmanager/2.0.4.Final/jboss-logmanager-2.0.4.Final.pom

      Downloading: https://maven.repository.redhat.com/earlyaccess/all/org/jboss/logmanager/jboss-logmanager/2.0.4.Final/jboss-logmanager-2.0.4.Final.pom

      Downloading: https://repository.jboss.org/nexus/content/groups/public/org/jboss/logmanager/jboss-logmanager/2.0.4.Final/jboss-logmanager-2.0.4.Final.pom

      Downloaded: https://repository.jboss.org/nexus/content/groups/public/org/jboss/logmanager/jboss-logmanager/2.0.4.Final/jboss-logmanager-2.0.4.Final.pom (6 KB at 19.6 KB/sec)

      Downloading: https://maven.repository.redhat.com/ga/org/wildfly/core/wildfly-launcher/3.0.0.Alpha24/wildfly-launcher-3.0.0.Alpha24.pom

      Downloading: https://maven.repository.redhat.com/earlyaccess/all/org/wildfly/core/wildfly-launcher/3.0.0.Alpha24/wildfly-launcher-3.0.0.Alpha24.pom

      Downloading: https://repository.jboss.org/nexus/content/groups/public/org/wildfly/core/wildfly-launcher/3.0.0.Alpha24/wildfly-launcher-3.0.0.Alpha24.pom

      Downloaded: https://repository.jboss.org/nexus/content/groups/public/org/wildfly/core/wildfly-launcher/3.0.0.Alpha24/wildfly-launcher-3.0.0.Alpha24.pom (5 KB at 12.7 KB/sec)

      Downloading: https://maven.repository.redhat.com/ga/org/wildfly/plugins/wildfly-plugin-core/1.2.0.Alpha2/wildfly-plugin-core-1.2.0.Alpha2.pom

      Downloading: https://maven.repository.redhat.com/earlyaccess/all/org/wildfly/plugins/wildfly-plugin-core/1.2.0.Alpha2/wildfly-plugin-core-1.2.0.Alpha2.pom

      Downloading: https://repository.jboss.org/nexus/content/groups/public/org/wildfly/plugins/wildfly-plugin-core/1.2.0.Alpha2/wildfly-plugin-core-1.2.0.Alpha2.pom

      Downloaded: https://repository.jboss.org/nexus/content/groups/public/org/wildfly/plugins/wildfly-plugin-core/1.2.0.Alpha2/wildfly-plugin-core-1.2.0.Alpha2.pom (6 KB at 14.7 KB/sec)

      Downloading: https://maven.repository.redhat.com/ga/org/apache/commons/commons-compress/1.13/commons-compress-1.13.jar

      Downloading: https://maven.repository.redhat.com/ga/org/apache/maven/maven-settings-builder/3.3.1/maven-settings-builder-3.3.1.jar

      Downloading: https://maven.repository.redhat.com/ga/org/apache/maven/maven-core/3.3.1/maven-core-3.3.1.jar

      Downloading: https://maven.repository.redhat.com/ga/org/apache/maven/maven-settings/3.3.1/maven-settings-3.3.1.jar

      Downloading: https://maven.repository.redhat.com/ga/org/apache/maven/maven-model/3.3.1/maven-model-3.3.1.jar

      Downloading: https://maven.repository.redhat.com/ga/org/apache/maven/maven-builder-support/3.3.1/maven-builder-support-3.3.1.jar

      Downloading: https://maven.repository.redhat.com/ga/org/apache/maven/maven-repository-metadata/3.3.1/maven-repository-metadata-3.3.1.jar

      Downloading: https://maven.repository.redhat.com/ga/org/apache/maven/maven-artifact/3.3.1/maven-artifact-3.3.1.jar

      Downloading: https://maven.repository.redhat.com/ga/org/apache/maven/maven-model-builder/3.3.1/maven-model-builder-3.3.1.jar

      Downloading: https://maven.repository.redhat.com/ga/com/google/guava/guava/18.0/guava-18.0.jar

      Downloading: https://maven.repository.redhat.com/ga/org/apache/maven/maven-aether-provider/3.3.1/maven-aether-provider-3.3.1.jar

      Downloading: https://maven.repository.redhat.com/ga/org/eclipse/aether/aether-spi/1.0.2.v20150114/aether-spi-1.0.2.v20150114.jar

      Downloading: https://maven.repository.redhat.com/ga/org/eclipse/aether/aether-impl/1.0.2.v20150114/aether-impl-1.0.2.v20150114.jar

      Downloading: https://maven.repository.redhat.com/ga/org/eclipse/aether/aether-util/1.0.2.v20150114/aether-util-1.0.2.v20150114.jar

      Downloaded: https://maven.repository.redhat.com/ga/org/eclipse/aether/aether-spi/1.0.2.v20150114/aether-spi-1.0.2.v20150114.jar (30 KB at 34.0 KB/sec)

      Downloading: https://maven.repository.redhat.com/ga/org/eclipse/sisu/org.eclipse.sisu.plexus/0.3.0/org.eclipse.sisu.plexus-0.3.0.jar

      Downloaded: https://maven.repository.redhat.com/ga/org/eclipse/aether/aether-impl/1.0.2.v20150114/aether-impl-1.0.2.v20150114.jar (169 KB at 179.0 KB/sec)

      Downloaded: https://maven.repository.redhat.com/ga/org/eclipse/aether/aether-util/1.0.2.v20150114/aether-util-1.0.2.v20150114.jar (144 KB at 151.9 KB/sec)

      Downloading: https://maven.repository.redhat.com/ga/javax/enterprise/cdi-api/1.0/cdi-api-1.0.jar

      Downloading: https://maven.repository.redhat.com/ga/javax/annotation/jsr250-api/1.0/jsr250-api-1.0.jar

      Downloading: https://maven.repository.redhat.com/ga/org/eclipse/sisu/org.eclipse.sisu.inject/0.3.0/org.eclipse.sisu.inject-0.3.0.jar

      Downloaded: https://maven.repository.redhat.com/ga/com/google/guava/guava/18.0/guava-18.0.jar (2204 KB at 2232.4 KB/sec)

      Downloading: https://maven.repository.redhat.com/ga/org/sonatype/sisu/sisu-guice/3.2.5/sisu-guice-3.2.5-no_aop.jar

      Downloaded: https://maven.repository.redhat.com/ga/javax/annotation/jsr250-api/1.0/jsr250-api-1.0.jar (6 KB at 5.4 KB/sec)

      Downloading: https://maven.repository.redhat.com/ga/aopalliance/aopalliance/1.0/aopalliance-1.0.jar

      Downloaded: https://maven.repository.redhat.com/ga/javax/enterprise/cdi-api/1.0/cdi-api-1.0.jar (44 KB at 41.1 KB/sec)

      Downloading: https://maven.repository.redhat.com/ga/org/codehaus/plexus/plexus-interpolation/1.21/plexus-interpolation-1.21.jar

      Downloaded: https://maven.repository.redhat.com/ga/aopalliance/aopalliance/1.0/aopalliance-1.0.jar (5 KB at 3.9 KB/sec)

      Downloading: https://maven.repository.redhat.com/ga/org/codehaus/plexus/plexus-classworlds/2.5.2/plexus-classworlds-2.5.2.jar

      Downloaded: https://maven.repository.redhat.com/ga/org/codehaus/plexus/plexus-interpolation/1.21/plexus-interpolation-1.21.jar (61 KB at 54.2 KB/sec)

      Downloading: https://maven.repository.redhat.com/ga/org/apache/maven/maven-plugin-api/3.3.1/maven-plugin-api-3.3.1.jar

      Downloaded: https://maven.repository.redhat.com/ga/org/eclipse/sisu/org.eclipse.sisu.plexus/0.3.0/org.eclipse.sisu.plexus-0.3.0.jar (201 KB at 166.3 KB/sec)

      Downloading: https://maven.repository.redhat.com/ga/org/eclipse/aether/aether-api/1.1.0/aether-api-1.1.0.jar

      Downloaded: https://maven.repository.redhat.com/ga/org/eclipse/sisu/org.eclipse.sisu.inject/0.3.0/org.eclipse.sisu.inject-0.3.0.jar (367 KB at 276.8 KB/sec)

      Downloading: https://maven.repository.redhat.com/ga/org/jboss/jdf/stacks-client/1.0.3.Final/stacks-client-1.0.3.Final.jar

      Downloading: https://maven.repository.redhat.com/ga/org/yaml/snakeyaml/1.13/snakeyaml-1.13.jar

      Downloaded: https://maven.repository.redhat.com/ga/org/codehaus/plexus/plexus-classworlds/2.5.2/plexus-classworlds-2.5.2.jar (52 KB at 37.3 KB/sec)

      Downloading: https://maven.repository.redhat.com/ga/org/wildfly/core/wildfly-cli/3.0.0.Alpha24/wildfly-cli-3.0.0.Alpha24.jar

      Downloading: https://maven.repository.redhat.com/ga/org/jboss/aesh/aesh/0.66.14/aesh-0.66.14.jar

      Downloaded: https://maven.repository.redhat.com/ga/org/sonatype/sisu/sisu-guice/3.2.5/sisu-guice-3.2.5-no_aop.jar (391 KB at 264.1 KB/sec)

      Downloading: https://maven.repository.redhat.com/ga/org/fusesource/jansi/jansi/1.11/jansi-1.11.jar

      Downloading: https://maven.repository.redhat.com/ga/org/jboss/staxmapper/1.3.0.Final/staxmapper-1.3.0.Final.jar

      Downloading: https://maven.repository.redhat.com/ga/org/jboss/modules/jboss-modules/1.6.0.Beta4/jboss-modules-1.6.0.Beta4.jar

      Downloading: https://maven.repository.redhat.com/ga/org/wildfly/core/wildfly-embedded/3.0.0.Alpha24/wildfly-embedded-3.0.0.Alpha24.jar

      Downloaded: https://maven.repository.redhat.com/ga/org/fusesource/jansi/jansi/1.11/jansi-1.11.jar (112 KB at 59.6 KB/sec)

      Downloading: https://maven.repository.redhat.com/ga/org/jboss/msc/jboss-msc/1.2.7.SP1/jboss-msc-1.2.7.SP1.jar

      Downloading: https://maven.repository.redhat.com/ga/org/jboss/logging/jboss-logging/3.3.0.Final/jboss-logging-3.3.0.Final.jar

      Downloading: https://maven.repository.redhat.com/ga/org/jboss/remoting/jboss-remoting/5.0.0.Beta16/jboss-remoting-5.0.0.Beta16.jar

      Downloading: https://maven.repository.redhat.com/ga/org/wildfly/client/wildfly-client-config/1.0.0.Beta1/wildfly-client-config-1.0.0.Beta1.jar

      Downloaded: https://maven.repository.redhat.com/ga/org/yaml/snakeyaml/1.13/snakeyaml-1.13.jar (268 KB at 134.2 KB/sec)

      Downloading: https://maven.repository.redhat.com/ga/org/jboss/remotingjmx/remoting-jmx/3.0.0.Beta3/remoting-jmx-3.0.0.Beta3.jar

      Downloaded: https://maven.repository.redhat.com/ga/org/jboss/logging/jboss-logging/3.3.0.Final/jboss-logging-3.3.0.Final.jar (66 KB at 31.4 KB/sec)

      Downloading: https://maven.repository.redhat.com/ga/org/jboss/marshalling/jboss-marshalling/2.0.0.Beta4/jboss-marshalling-2.0.0.Beta4.jar

      Downloading: https://maven.repository.redhat.com/ga/org/jboss/marshalling/jboss-marshalling-river/2.0.0.Beta4/jboss-marshalling-river-2.0.0.Beta4.jar

      Downloading: https://maven.repository.redhat.com/ga/org/jboss/jboss-vfs/3.2.12.Final/jboss-vfs-3.2.12.Final.jar

      Downloading: https://maven.repository.redhat.com/ga/org/jboss/stdio/jboss-stdio/1.0.2.GA/jboss-stdio-1.0.2.GA.jar

      Downloading: https://maven.repository.redhat.com/ga/org/jboss/logmanager/jboss-logmanager/2.0.4.Final/jboss-logmanager-2.0.4.Final.jar

      Downloading: https://maven.repository.redhat.com/ga/org/wildfly/core/wildfly-controller-client/3.0.0.Alpha24/wildfly-controller-client-3.0.0.Alpha24.jar

      Downloading: https://maven.repository.redhat.com/ga/org/jboss/jboss-dmr/1.4.0.Beta1/jboss-dmr-1.4.0.Beta1.jar

      Downloading: https://maven.repository.redhat.com/ga/org/jboss/threads/jboss-threads/2.2.1.Final/jboss-threads-2.2.1.Final.jar

      Downloading: https://maven.repository.redhat.com/ga/org/wildfly/core/wildfly-launcher/3.0.0.Alpha24/wildfly-launcher-3.0.0.Alpha24.jar

      Downloading: https://maven.repository.redhat.com/ga/org/wildfly/core/wildfly-protocol/3.0.0.Alpha24/wildfly-protocol-3.0.0.Alpha24.jar

      Downloading: https://maven.repository.redhat.com/ga/org/jboss/xnio/xnio-api/3.5.0.Beta1/xnio-api-3.5.0.Beta1.jar

      Downloading: https://maven.repository.redhat.com/ga/org/jboss/xnio/xnio-nio/3.5.0.Beta1/xnio-nio-3.5.0.Beta1.jar

      Downloading: https://maven.repository.redhat.com/ga/org/wildfly/plugins/wildfly-plugin-core/1.2.0.Alpha2/wildfly-plugin-core-1.2.0.Alpha2.jar

      Downloading: https://maven.repository.redhat.com/ga/org/wildfly/common/wildfly-common/1.2.0.Beta5/wildfly-common-1.2.0.Beta5.jar

      Downloading: https://maven.repository.redhat.com/ga/org/wildfly/security/wildfly-elytron/1.1.0.Beta23/wildfly-elytron-1.1.0.Beta23.jar

      Downloading: https://maven.repository.redhat.com/earlyaccess/all/org/apache/commons/commons-compress/1.13/commons-compress-1.13.jar

      Downloading: https://maven.repository.redhat.com/earlyaccess/all/org/apache/maven/maven-settings/3.3.1/maven-settings-3.3.1.jar

      Downloading: https://maven.repository.redhat.com/earlyaccess/all/org/apache/maven/maven-core/3.3.1/maven-core-3.3.1.jar

      Downloading: https://maven.repository.redhat.com/earlyaccess/all/org/apache/maven/maven-model/3.3.1/maven-model-3.3.1.jar

      Downloading: https://maven.repository.redhat.com/earlyaccess/all/org/apache/maven/maven-settings-builder/3.3.1/maven-settings-builder-3.3.1.jar

      Downloading: https://maven.repository.redhat.com/earlyaccess/all/org/apache/maven/maven-builder-support/3.3.1/maven-builder-support-3.3.1.jar

      Downloading: https://maven.repository.redhat.com/earlyaccess/all/org/apache/maven/maven-repository-metadata/3.3.1/maven-repository-metadata-3.3.1.jar

      Downloading: https://maven.repository.redhat.com/earlyaccess/all/org/apache/maven/maven-artifact/3.3.1/maven-artifact-3.3.1.jar

      Downloading: https://maven.repository.redhat.com/earlyaccess/all/org/apache/maven/maven-model-builder/3.3.1/maven-model-builder-3.3.1.jar

      Downloading: https://maven.repository.redhat.com/earlyaccess/all/org/apache/maven/maven-aether-provider/3.3.1/maven-aether-provider-3.3.1.jar

      Downloading: https://maven.repository.redhat.com/earlyaccess/all/org/apache/maven/maven-plugin-api/3.3.1/maven-plugin-api-3.3.1.jar

      Downloading: https://maven.repository.redhat.com/earlyaccess/all/org/eclipse/aether/aether-api/1.1.0/aether-api-1.1.0.jar

      Downloading: https://maven.repository.redhat.com/earlyaccess/all/org/jboss/jdf/stacks-client/1.0.3.Final/stacks-client-1.0.3.Final.jar

      Downloading: https://maven.repository.redhat.com/earlyaccess/all/org/wildfly/core/wildfly-cli/3.0.0.Alpha24/wildfly-cli-3.0.0.Alpha24.jar

      Downloading: https://maven.repository.redhat.com/earlyaccess/all/org/jboss/aesh/aesh/0.66.14/aesh-0.66.14.jar

      Downloading: https://maven.repository.redhat.com/earlyaccess/all/org/jboss/staxmapper/1.3.0.Final/staxmapper-1.3.0.Final.jar

      Downloading: https://maven.repository.redhat.com/earlyaccess/all/org/jboss/modules/jboss-modules/1.6.0.Beta4/jboss-modules-1.6.0.Beta4.jar

      Downloading: https://maven.repository.redhat.com/earlyaccess/all/org/wildfly/core/wildfly-embedded/3.0.0.Alpha24/wildfly-embedded-3.0.0.Alpha24.jar

      Downloading: https://maven.repository.redhat.com/earlyaccess/all/org/jboss/msc/jboss-msc/1.2.7.SP1/jboss-msc-1.2.7.SP1.jar

      Downloading: https://maven.repository.redhat.com/earlyaccess/all/org/jboss/remoting/jboss-remoting/5.0.0.Beta16/jboss-remoting-5.0.0.Beta16.jar

      Downloading: https://maven.repository.redhat.com/earlyaccess/all/org/wildfly/client/wildfly-client-config/1.0.0.Beta1/wildfly-client-config-1.0.0.Beta1.jar

      Downloading: https://maven.repository.redhat.com/earlyaccess/all/org/jboss/remotingjmx/remoting-jmx/3.0.0.Beta3/remoting-jmx-3.0.0.Beta3.jar

      Downloading: https://maven.repository.redhat.com/earlyaccess/all/org/jboss/marshalling/jboss-marshalling/2.0.0.Beta4/jboss-marshalling-2.0.0.Beta4.jar

      Downloading: https://maven.repository.redhat.com/earlyaccess/all/org/jboss/marshalling/jboss-marshalling-river/2.0.0.Beta4/jboss-marshalling-river-2.0.0.Beta4.jar

      Downloading: https://maven.repository.redhat.com/earlyaccess/all/org/jboss/jboss-vfs/3.2.12.Final/jboss-vfs-3.2.12.Final.jar

      Downloading: https://maven.repository.redhat.com/earlyaccess/all/org/jboss/stdio/jboss-stdio/1.0.2.GA/jboss-stdio-1.0.2.GA.jar

      Downloading: https://maven.repository.redhat.com/earlyaccess/all/org/jboss/logmanager/jboss-logmanager/2.0.4.Final/jboss-logmanager-2.0.4.Final.jar

      Downloading: https://maven.repository.redhat.com/earlyaccess/all/org/wildfly/core/wildfly-controller-client/3.0.0.Alpha24/wildfly-controller-client-3.0.0.Alpha24.jar

      Downloading: https://maven.repository.redhat.com/earlyaccess/all/org/jboss/jboss-dmr/1.4.0.Beta1/jboss-dmr-1.4.0.Beta1.jar

      Downloading: https://maven.repository.redhat.com/earlyaccess/all/org/jboss/threads/jboss-threads/2.2.1.Final/jboss-threads-2.2.1.Final.jar

      Downloaded: https://maven.repository.redhat.com/earlyaccess/all/org/jboss/stdio/jboss-stdio/1.0.2.GA/jboss-stdio-1.0.2.GA.jar (19 KB at 10.4 KB/sec)

      Downloading: https://maven.repository.redhat.com/earlyaccess/all/org/wildfly/core/wildfly-launcher/3.0.0.Alpha24/wildfly-launcher-3.0.0.Alpha24.jar

      Downloading: https://maven.repository.redhat.com/earlyaccess/all/org/wildfly/core/wildfly-protocol/3.0.0.Alpha24/wildfly-protocol-3.0.0.Alpha24.jar

      Downloading: https://maven.repository.redhat.com/earlyaccess/all/org/jboss/xnio/xnio-api/3.5.0.Beta1/xnio-api-3.5.0.Beta1.jar

      Downloading: https://maven.repository.redhat.com/earlyaccess/all/org/jboss/xnio/xnio-nio/3.5.0.Beta1/xnio-nio-3.5.0.Beta1.jar

      Downloading: https://maven.repository.redhat.com/earlyaccess/all/org/wildfly/plugins/wildfly-plugin-core/1.2.0.Alpha2/wildfly-plugin-core-1.2.0.Alpha2.jar

      Downloading: https://maven.repository.redhat.com/earlyaccess/all/org/wildfly/common/wildfly-common/1.2.0.Beta5/wildfly-common-1.2.0.Beta5.jar

      Downloading: https://maven.repository.redhat.com/earlyaccess/all/org/wildfly/security/wildfly-elytron/1.1.0.Beta23/wildfly-elytron-1.1.0.Beta23.jar

      Downloading: https://repository.jboss.org/nexus/content/groups/public/org/apache/commons/commons-compress/1.13/commons-compress-1.13.jar

      Downloading: https://repository.jboss.org/nexus/content/groups/public/org/apache/maven/maven-core/3.3.1/maven-core-3.3.1.jar

      Downloading: https://repository.jboss.org/nexus/content/groups/public/org/apache/maven/maven-model/3.3.1/maven-model-3.3.1.jar

      Downloading: https://repository.jboss.org/nexus/content/groups/public/org/apache/maven/maven-settings/3.3.1/maven-settings-3.3.1.jar

      Downloading: https://repository.jboss.org/nexus/content/groups/public/org/apache/maven/maven-settings-builder/3.3.1/maven-settings-builder-3.3.1.jar

      Downloading: https://repository.jboss.org/nexus/content/groups/public/org/apache/maven/maven-builder-support/3.3.1/maven-builder-support-3.3.1.jar

      Downloading: https://repository.jboss.org/nexus/content/groups/public/org/apache/maven/maven-repository-metadata/3.3.1/maven-repository-metadata-3.3.1.jar

      Downloading: https://repository.jboss.org/nexus/content/groups/public/org/apache/maven/maven-artifact/3.3.1/maven-artifact-3.3.1.jar

      Downloading: https://repository.jboss.org/nexus/content/groups/public/org/apache/maven/maven-model-builder/3.3.1/maven-model-builder-3.3.1.jar

      Downloading: https://repository.jboss.org/nexus/content/groups/public/org/apache/maven/maven-aether-provider/3.3.1/maven-aether-provider-3.3.1.jar

      Downloading: https://repository.jboss.org/nexus/content/groups/public/org/apache/maven/maven-plugin-api/3.3.1/maven-plugin-api-3.3.1.jar

      Downloading: https://repository.jboss.org/nexus/content/groups/public/org/eclipse/aether/aether-api/1.1.0/aether-api-1.1.0.jar

      Downloading: https://repository.jboss.org/nexus/content/groups/public/org/jboss/jdf/stacks-client/1.0.3.Final/stacks-client-1.0.3.Final.jar

      Downloading: https://repository.jboss.org/nexus/content/groups/public/org/wildfly/core/wildfly-cli/3.0.0.Alpha24/wildfly-cli-3.0.0.Alpha24.jar

      Downloading: https://repository.jboss.org/nexus/content/groups/public/org/jboss/aesh/aesh/0.66.14/aesh-0.66.14.jar

      Downloading: https://repository.jboss.org/nexus/content/groups/public/org/jboss/staxmapper/1.3.0.Final/staxmapper-1.3.0.Final.jar

      Downloading: https://repository.jboss.org/nexus/content/groups/public/org/jboss/modules/jboss-modules/1.6.0.Beta4/jboss-modules-1.6.0.Beta4.jar

      Downloaded: https://repository.jboss.org/nexus/content/groups/public/org/jboss/jdf/stacks-client/1.0.3.Final/stacks-client-1.0.3.Final.jar (36 KB at 19.9 KB/sec)

      Downloading: https://repository.jboss.org/nexus/content/groups/public/org/wildfly/core/wildfly-embedded/3.0.0.Alpha24/wildfly-embedded-3.0.0.Alpha24.jar

      Downloaded: https://repository.jboss.org/nexus/content/groups/public/org/jboss/staxmapper/1.3.0.Final/staxmapper-1.3.0.Final.jar (37 KB at 20.1 KB/sec)

      Downloading: https://repository.jboss.org/nexus/content/groups/public/org/jboss/msc/jboss-msc/1.2.7.SP1/jboss-msc-1.2.7.SP1.jar

      Downloaded: https://repository.jboss.org/nexus/content/groups/public/org/wildfly/core/wildfly-embedded/3.0.0.Alpha24/wildfly-embedded-3.0.0.Alpha24.jar (50 KB at 22.5 KB/sec)

      Downloading: https://repository.jboss.org/nexus/content/groups/public/org/jboss/remoting/jboss-remoting/5.0.0.Beta16/jboss-remoting-5.0.0.Beta16.jar

      Downloaded: https://repository.jboss.org/nexus/content/groups/public/org/jboss/aesh/aesh/0.66.14/aesh-0.66.14.jar (411 KB at 166.0 KB/sec)

      Downloading: https://repository.jboss.org/nexus/content/groups/public/org/wildfly/client/wildfly-client-config/1.0.0.Beta1/wildfly-client-config-1.0.0.Beta1.jar

      Downloaded: https://repository.jboss.org/nexus/content/groups/public/org/jboss/msc/jboss-msc/1.2.7.SP1/jboss-msc-1.2.7.SP1.jar (230 KB at 88.5 KB/sec)

      Downloading: https://repository.jboss.org/nexus/content/groups/public/org/jboss/remotingjmx/remoting-jmx/3.0.0.Beta3/remoting-jmx-3.0.0.Beta3.jar

      Downloaded: https://repository.jboss.org/nexus/content/groups/public/org/wildfly/client/wildfly-client-config/1.0.0.Beta1/wildfly-client-config-1.0.0.Beta1.jar (41 KB at 14.7 KB/sec)

      Downloading: https://repository.jboss.org/nexus/content/groups/public/org/jboss/marshalling/jboss-marshalling/2.0.0.Beta4/jboss-marshalling-2.0.0.Beta4.jar

      Downloaded: https://repository.jboss.org/nexus/content/groups/public/org/wildfly/core/wildfly-cli/3.0.0.Alpha24/wildfly-cli-3.0.0.Alpha24.jar (1114 KB at 390.6 KB/sec)

      Downloading: https://repository.jboss.org/nexus/content/groups/public/org/jboss/marshalling/jboss-marshalling-river/2.0.0.Beta4/jboss-marshalling-river-2.0.0.Beta4.jar

      Downloaded: https://repository.jboss.org/nexus/content/groups/public/org/jboss/remoting/jboss-remoting/5.0.0.Beta16/jboss-remoting-5.0.0.Beta16.jar (279 KB at 96.3 KB/sec)

      Downloading: https://repository.jboss.org/nexus/content/groups/public/org/jboss/jboss-vfs/3.2.12.Final/jboss-vfs-3.2.12.Final.jar

      Downloaded: https://repository.jboss.org/nexus/content/groups/public/org/jboss/modules/jboss-modules/1.6.0.Beta4/jboss-modules-1.6.0.Beta4.jar (377 KB at 129.0 KB/sec)

      Downloading: https://repository.jboss.org/nexus/content/groups/public/org/jboss/logmanager/jboss-logmanager/2.0.4.Final/jboss-logmanager-2.0.4.Final.jar

      Downloaded: https://repository.jboss.org/nexus/content/groups/public/org/jboss/marshalling/jboss-marshalling-river/2.0.0.Beta4/jboss-marshalling-river-2.0.0.Beta4.jar (85 KB at 26.8 KB/sec)

      Downloading: https://repository.jboss.org/nexus/content/groups/public/org/wildfly/core/wildfly-controller-client/3.0.0.Alpha24/wildfly-controller-client-3.0.0.Alpha24.jar

      Downloaded: https://repository.jboss.org/nexus/content/groups/public/org/jboss/remotingjmx/remoting-jmx/3.0.0.Beta3/remoting-jmx-3.0.0.Beta3.jar (311 KB at 97.1 KB/sec)

      Downloading: https://repository.jboss.org/nexus/content/groups/public/org/jboss/jboss-dmr/1.4.0.Beta1/jboss-dmr-1.4.0.Beta1.jar

      Downloaded: https://repository.jboss.org/nexus/content/groups/public/org/jboss/marshalling/jboss-marshalling/2.0.0.Beta4/jboss-marshalling-2.0.0.Beta4.jar (201 KB at 62.0 KB/sec)

      Downloading: https://repository.jboss.org/nexus/content/groups/public/org/jboss/threads/jboss-threads/2.2.1.Final/jboss-threads-2.2.1.Final.jar

      Downloaded: https://repository.jboss.org/nexus/content/groups/public/org/jboss/jboss-vfs/3.2.12.Final/jboss-vfs-3.2.12.Final.jar (141 KB at 41.4 KB/sec)

      Downloading: https://repository.jboss.org/nexus/content/groups/public/org/wildfly/core/wildfly-launcher/3.0.0.Alpha24/wildfly-launcher-3.0.0.Alpha24.jar

      Downloaded: https://repository.jboss.org/nexus/content/groups/public/org/wildfly/core/wildfly-controller-client/3.0.0.Alpha24/wildfly-controller-client-3.0.0.Alpha24.jar (207 KB at 58.1 KB/sec)

      Downloading: https://repository.jboss.org/nexus/content/groups/public/org/wildfly/core/wildfly-protocol/3.0.0.Alpha24/wildfly-protocol-3.0.0.Alpha24.jar

      Downloaded: https://repository.jboss.org/nexus/content/groups/public/org/jboss/logmanager/jboss-logmanager/2.0.4.Final/jboss-logmanager-2.0.4.Final.jar (333 KB at 93.1 KB/sec)

      Downloading: https://repository.jboss.org/nexus/content/groups/public/org/jboss/xnio/xnio-api/3.5.0.Beta1/xnio-api-3.5.0.Beta1.jar

      Downloaded: https://repository.jboss.org/nexus/content/groups/public/org/jboss/threads/jboss-threads/2.2.1.Final/jboss-threads-2.2.1.Final.jar (122 KB at 33.1 KB/sec)

      Downloading: https://repository.jboss.org/nexus/content/groups/public/org/jboss/xnio/xnio-nio/3.5.0.Beta1/xnio-nio-3.5.0.Beta1.jar

      Downloaded: https://repository.jboss.org/nexus/content/groups/public/org/jboss/jboss-dmr/1.4.0.Beta1/jboss-dmr-1.4.0.Beta1.jar (137 KB at 37.1 KB/sec)

      Downloading: https://repository.jboss.org/nexus/content/groups/public/org/wildfly/plugins/wildfly-plugin-core/1.2.0.Alpha2/wildfly-plugin-core-1.2.0.Alpha2.jar

      Downloaded: https://repository.jboss.org/nexus/content/groups/public/org/wildfly/core/wildfly-launcher/3.0.0.Alpha24/wildfly-launcher-3.0.0.Alpha24.jar (41 KB at 10.9 KB/sec)

      Downloading: https://repository.jboss.org/nexus/content/groups/public/org/wildfly/common/wildfly-common/1.2.0.Beta5/wildfly-common-1.2.0.Beta5.jar

      Downloaded: https://repository.jboss.org/nexus/content/groups/public/org/wildfly/core/wildfly-protocol/3.0.0.Alpha24/wildfly-protocol-3.0.0.Alpha24.jar (94 KB at 24.1 KB/sec)

      Downloading: https://repository.jboss.org/nexus/content/groups/public/org/wildfly/security/wildfly-elytron/1.1.0.Beta23/wildfly-elytron-1.1.0.Beta23.jar

      Downloaded: https://repository.jboss.org/nexus/content/groups/public/org/wildfly/plugins/wildfly-plugin-core/1.2.0.Alpha2/wildfly-plugin-core-1.2.0.Alpha2.jar (49 KB at 12.1 KB/sec)

      Downloaded: https://repository.jboss.org/nexus/content/groups/public/org/wildfly/common/wildfly-common/1.2.0.Beta5/wildfly-common-1.2.0.Beta5.jar (106 KB at 25.9 KB/sec)

      Downloaded: https://repository.jboss.org/nexus/content/groups/public/org/jboss/xnio/xnio-nio/3.5.0.Beta1/xnio-nio-3.5.0.Beta1.jar (116 KB at 28.1 KB/sec)

      Downloaded: https://repository.jboss.org/nexus/content/groups/public/org/jboss/xnio/xnio-api/3.5.0.Beta1/xnio-api-3.5.0.Beta1.jar (534 KB at 125.5 KB/sec)

      Downloaded: https://repository.jboss.org/nexus/content/groups/public/org/wildfly/security/wildfly-elytron/1.1.0.Beta23/wildfly-elytron-1.1.0.Beta23.jar (1802 KB at 372.6 KB/sec)

      Downloading: https://repo.maven.apache.org/maven2/org/apache/commons/commons-compress/1.13/commons-compress-1.13.jar

      Downloading: https://repo.maven.apache.org/maven2/org/apache/maven/maven-core/3.3.1/maven-core-3.3.1.jar

      Downloading: https://repo.maven.apache.org/maven2/org/apache/maven/maven-model/3.3.1/maven-model-3.3.1.jar

      Downloading: https://repo.maven.apache.org/maven2/org/apache/maven/maven-settings/3.3.1/maven-settings-3.3.1.jar

      Downloading: https://repo.maven.apache.org/maven2/org/apache/maven/maven-settings-builder/3.3.1/maven-settings-builder-3.3.1.jar

      Downloaded: https://repo.maven.apache.org/maven2/org/apache/maven/maven-settings/3.3.1/maven-settings-3.3.1.jar (43 KB at 420.4 KB/sec)

      Downloading: https://repo.maven.apache.org/maven2/org/apache/maven/maven-builder-support/3.3.1/maven-builder-support-3.3.1.jar

      Downloaded: https://repo.maven.apache.org/maven2/org/apache/maven/maven-settings-builder/3.3.1/maven-settings-builder-3.3.1.jar (42 KB at 374.3 KB/sec)

      Downloading: https://repo.maven.apache.org/maven2/org/apache/maven/maven-repository-metadata/3.3.1/maven-repository-metadata-3.3.1.jar

      Downloaded: https://repo.maven.apache.org/maven2/org/apache/maven/maven-model/3.3.1/maven-model-3.3.1.jar (158 KB at 1276.9 KB/sec)

      Downloading: https://repo.maven.apache.org/maven2/org/apache/maven/maven-artifact/3.3.1/maven-artifact-3.3.1.jar

      Downloaded: https://repo.maven.apache.org/maven2/org/apache/commons/commons-compress/1.13/commons-compress-1.13.jar (457 KB at 2292.2 KB/sec)

      Downloading: https://repo.maven.apache.org/maven2/org/apache/maven/maven-model-builder/3.3.1/maven-model-builder-3.3.1.jar

      Downloaded: https://repo.maven.apache.org/maven2/org/apache/maven/maven-repository-metadata/3.3.1/maven-repository-metadata-3.3.1.jar (26 KB at 113.7 KB/sec)

      Downloading: https://repo.maven.apache.org/maven2/org/apache/maven/maven-aether-provider/3.3.1/maven-aether-provider-3.3.1.jar

      Downloaded: https://repo.maven.apache.org/maven2/org/apache/maven/maven-core/3.3.1/maven-core-3.3.1.jar (617 KB at 2559.9 KB/sec)

      Downloading: https://repo.maven.apache.org/maven2/org/apache/maven/maven-plugin-api/3.3.1/maven-plugin-api-3.3.1.jar

      Downloaded: https://repo.maven.apache.org/maven2/org/apache/maven/maven-artifact/3.3.1/maven-artifact-3.3.1.jar (54 KB at 224.2 KB/sec)

      Downloading: https://repo.maven.apache.org/maven2/org/eclipse/aether/aether-api/1.1.0/aether-api-1.1.0.jar

      Downloaded: https://repo.maven.apache.org/maven2/org/eclipse/aether/aether-api/1.1.0/aether-api-1.1.0.jar (134 KB at 420.1 KB/sec)

      Downloaded: https://repo.maven.apache.org/maven2/org/apache/maven/maven-aether-provider/3.3.1/maven-aether-provider-3.3.1.jar (65 KB at 199.4 KB/sec)

      Downloaded: https://repo.maven.apache.org/maven2/org/apache/maven/maven-builder-support/3.3.1/maven-builder-support-3.3.1.jar (15 KB at 43.5 KB/sec)

      Downloaded: https://repo.maven.apache.org/maven2/org/apache/maven/maven-plugin-api/3.3.1/maven-plugin-api-3.3.1.jar (46 KB at 130.5 KB/sec)

      Downloaded: https://repo.maven.apache.org/maven2/org/apache/maven/maven-model-builder/3.3.1/maven-model-builder-3.3.1.jar (173 KB at 495.1 KB/sec)

      May 03, 2017 6:59:54 AM org.xnio.Xnio <clinit>

      INFO: XNIO version 3.5.0.Beta1

      May 03, 2017 6:59:54 AM org.xnio.nio.NioXnio <clinit>

      INFO: XNIO NIO Implementation Version 3.5.0.Beta1

      May 03, 2017 6:59:54 AM org.jboss.remoting3.EndpointImpl <clinit>

      INFO: JBoss Remoting version 5.0.0.Beta16

      May 03, 2017 6:59:54 AM org.wildfly.security.Version <clinit>

      INFO: ELY00001: WildFly Elytron version 1.1.0.Beta23

      [INFO] ------------------------------------------------------------------------

      [INFO] BUILD FAILURE

      [INFO] ------------------------------------------------------------------------

      [INFO] Total time: 03:22 min

      [INFO] Finished at: 2017-05-03T06:59:54-04:00

      [INFO] Final Memory: 29M/175M

      [INFO] ------------------------------------------------------------------------

      [ERROR] Failed to execute goal org.wildfly.plugins:wildfly-maven-plugin:1.2.0.Alpha2:deploy (default-cli) on project helloworld: Failed to execute goal deploy. java.net.ConnectException: WFLYPRT0053: Could not connect to remote+http://localhost:9990. The connection failed: Connection refused -> [Help 1]

      [ERROR]

      [ERROR] To see the full stack trace of the errors, re-run Maven with the -e switch.

      [ERROR] Re-run Maven using the -X switch to enable full debug logging.

      [ERROR]

      [ERROR] For more information about the errors and possible solutions, please read the following articles:

      [ERROR] [Help 1] http://cwiki.apache.org/confluence/display/MAVEN/MojoFailureException

      $ mvn clean install wildfly:deploy

      [INFO] Scanning for projects...

      [INFO]                                                                       

      [INFO] ------------------------------------------------------------------------

      [INFO] Building WildFly Quickstart: helloworld 11.0.0-SNAPSHOT

      [INFO] ------------------------------------------------------------------------

      [INFO]

      [INFO] --- maven-clean-plugin:3.0.0:clean (default-clean) @ helloworld ---

      [INFO] Deleting /home/aw/wildflyTutorial/quickstart-11.x-new/helloworld/target

      [INFO]

      [INFO] --- maven-enforcer-plugin:1.4.1:enforce (enforce-java-version) @ helloworld ---

      [INFO]

      [INFO] --- maven-enforcer-plugin:1.4.1:enforce (enforce-maven-version) @ helloworld ---

      [INFO]

      [INFO] --- buildnumber-maven-plugin:1.4:create (get-scm-revision) @ helloworld ---

      [INFO] Executing: /bin/sh -c cd '/home/aw/wildflyTutorial/quickstart-11.x-new/helloworld' && 'git' 'rev-parse' '--verify' 'HEAD'

      [INFO] Working directory: /home/aw/wildflyTutorial/quickstart-11.x-new/helloworld

      [WARNING] Cannot get the revision information from the scm repository, proceeding with revision of UNKNOWN :

      Exception while executing SCM command.

      [INFO] Storing buildNumber: UNKNOWN at timestamp: 1493809536804

      [WARNING] Cannot get the branch information from the git repository:

      Error while executing command.

      [INFO] Executing: /bin/sh -c cd '/home/aw/wildflyTutorial/quickstart-11.x-new/helloworld' && 'git' 'rev-parse' '--verify' 'HEAD'

      [INFO] Working directory: /home/aw/wildflyTutorial/quickstart-11.x-new/helloworld

      [WARNING] Cannot get the branch information from the scm repository, proceeding with UNKNOWN_BRANCH :

      Exception while executing SCM command.

      [INFO] Storing buildScmBranch: UNKNOWN_BRANCH

      [INFO]

      [INFO] --- maven-resources-plugin:3.0.1:resources (default-resources) @ helloworld ---

      [INFO] Using 'UTF-8' encoding to copy filtered resources.

      [INFO] skip non existing resourceDirectory /home/aw/wildflyTutorial/quickstart-11.x-new/helloworld/src/main/resources

      [INFO]

      [INFO] --- maven-compiler-plugin:3.6.0:compile (default-compile) @ helloworld ---

      [INFO] Changes detected - recompiling the module!

      [INFO] Compiling 2 source files to /home/aw/wildflyTutorial/quickstart-11.x-new/helloworld/target/classes

      [INFO]

      [INFO] --- maven-resources-plugin:3.0.1:testResources (default-testResources) @ helloworld ---

      [INFO] Using 'UTF-8' encoding to copy filtered resources.

      [INFO] skip non existing resourceDirectory /home/aw/wildflyTutorial/quickstart-11.x-new/helloworld/src/test/resources

      [INFO]

      [INFO] --- maven-compiler-plugin:3.6.0:testCompile (default-testCompile) @ helloworld ---

      [INFO] No sources to compile

      [INFO]

      [INFO] --- maven-surefire-plugin:2.19.1:test (default-test) @ helloworld ---

      [INFO] No tests to run.

      [INFO]

      [INFO] --- maven-war-plugin:3.0.0:war (default-war) @ helloworld ---

      [INFO] Packaging webapp

      [INFO] Assembling webapp [helloworld] in [/home/aw/wildflyTutorial/quickstart-11.x-new/helloworld/target/helloworld]

      [INFO] Processing war project

      [INFO] Copying webapp resources [/home/aw/wildflyTutorial/quickstart-11.x-new/helloworld/src/main/webapp]

      [INFO] Webapp assembled in [35 msecs]

      [INFO] Building war: /home/aw/wildflyTutorial/quickstart-11.x-new/helloworld/target/helloworld.war

      [INFO]

      [INFO] --- maven-source-plugin:3.0.1:jar-no-fork (attach-sources) @ helloworld ---

      [INFO] Building jar: /home/aw/wildflyTutorial/quickstart-11.x-new/helloworld/target/helloworld-sources.jar

      [INFO]

      [INFO] --- maven-install-plugin:2.5.2:install (default-install) @ helloworld ---

      [INFO] Installing /home/aw/wildflyTutorial/quickstart-11.x-new/helloworld/target/helloworld.war to /home/aw/.m2/repository/org/wildfly/quickstarts/helloworld/11.0.0-SNAPSHOT/helloworld-11.0.0-SNAPSHOT.war

      [INFO] Installing /home/aw/wildflyTutorial/quickstart-11.x-new/helloworld/pom.xml to /home/aw/.m2/repository/org/wildfly/quickstarts/helloworld/11.0.0-SNAPSHOT/helloworld-11.0.0-SNAPSHOT.pom

      [INFO] Installing /home/aw/wildflyTutorial/quickstart-11.x-new/helloworld/target/helloworld-sources.jar to /home/aw/.m2/repository/org/wildfly/quickstarts/helloworld/11.0.0-SNAPSHOT/helloworld-11.0.0-SNAPSHOT-sources.jar

      [INFO]

      [INFO] >>> wildfly-maven-plugin:1.2.0.Alpha2:deploy (default-cli) > package @ helloworld >>>

      [INFO]

      [INFO] --- maven-enforcer-plugin:1.4.1:enforce (enforce-java-version) @ helloworld ---

      [INFO]

      [INFO] --- maven-enforcer-plugin:1.4.1:enforce (enforce-maven-version) @ helloworld ---

      [INFO]

      [INFO] --- buildnumber-maven-plugin:1.4:create (get-scm-revision) @ helloworld ---

      [INFO]

      [INFO] --- maven-resources-plugin:3.0.1:resources (default-resources) @ helloworld ---

      [INFO] Using 'UTF-8' encoding to copy filtered resources.

      [INFO] skip non existing resourceDirectory /home/aw/wildflyTutorial/quickstart-11.x-new/helloworld/src/main/resources

      [INFO]

      [INFO] --- maven-compiler-plugin:3.6.0:compile (default-compile) @ helloworld ---

      [INFO] Nothing to compile - all classes are up to date

      [INFO]

      [INFO] --- maven-resources-plugin:3.0.1:testResources (default-testResources) @ helloworld ---

      [INFO] Using 'UTF-8' encoding to copy filtered resources.

      [INFO] skip non existing resourceDirectory /home/aw/wildflyTutorial/quickstart-11.x-new/helloworld/src/test/resources

      [INFO]

      [INFO] --- maven-compiler-plugin:3.6.0:testCompile (default-testCompile) @ helloworld ---

      [INFO] No sources to compile

      [INFO]

      [INFO] --- maven-surefire-plugin:2.19.1:test (default-test) @ helloworld ---

      [INFO] No tests to run.

      [INFO] Skipping execution of surefire because it has already been run for this configuration

      [INFO]

      [INFO] --- maven-war-plugin:3.0.0:war (default-war) @ helloworld ---

      [INFO] Packaging webapp

      [INFO] Assembling webapp [helloworld] in [/home/aw/wildflyTutorial/quickstart-11.x-new/helloworld/target/helloworld]

      [INFO] Processing war project

      [INFO] Copying webapp resources [/home/aw/wildflyTutorial/quickstart-11.x-new/helloworld/src/main/webapp]

      [INFO] Webapp assembled in [3 msecs]

      [INFO] Building war: /home/aw/wildflyTutorial/quickstart-11.x-new/helloworld/target/helloworld.war

      [INFO]

      [INFO] --- maven-source-plugin:3.0.1:jar-no-fork (attach-sources) @ helloworld ---

      [INFO] Building jar: /home/aw/wildflyTutorial/quickstart-11.x-new/helloworld/target/helloworld-sources.jar

      [INFO]

      [INFO] <<< wildfly-maven-plugin:1.2.0.Alpha2:deploy (default-cli) < package @ helloworld <<<

      [INFO]

      [INFO] --- wildfly-maven-plugin:1.2.0.Alpha2:deploy (default-cli) @ helloworld ---

      May 03, 2017 7:05:39 AM org.xnio.Xnio <clinit>

      INFO: XNIO version 3.5.0.Beta1

      May 03, 2017 7:05:39 AM org.xnio.nio.NioXnio <clinit>

      INFO: XNIO NIO Implementation Version 3.5.0.Beta1

      May 03, 2017 7:05:39 AM org.jboss.remoting3.EndpointImpl <clinit>

      INFO: JBoss Remoting version 5.0.0.Beta16

      May 03, 2017 7:05:39 AM org.wildfly.security.Version <clinit>

      INFO: ELY00001: WildFly Elytron version 1.1.0.Beta23

      [INFO] ------------------------------------------------------------------------

      [INFO] BUILD SUCCESS

      [INFO] ------------------------------------------------------------------------

      [INFO] Total time: 5.842 s

      [INFO] Finished at: 2017-05-03T07:05:40-04:00

      [INFO] Final Memory: 33M/259M

      [INFO] ------------------------------------------------------------------------

      Exception in thread "Remoting "management-client" task-11" java.lang.NoClassDefFoundError: org/xnio/XnioWorker$2

          at org.xnio.XnioWorker.shutDownTaskPool(XnioWorker.java:769)

          at org.xnio.nio.NioXnioWorker.shutdown(NioXnioWorker.java:277)

          at org.jboss.remoting3.EndpointImpl.finishPhase1(EndpointImpl.java:257)

          at org.jboss.remoting3.EndpointImpl.closeTick1(EndpointImpl.java:240)

          at org.jboss.remoting3.EndpointImpl.access$200(EndpointImpl.java:93)

          at org.jboss.remoting3.EndpointImpl$TrackingExecutor.finishWork(EndpointImpl.java:820)

          at org.jboss.remoting3.EndpointImpl$TrackingExecutor.lambda$execute$0(EndpointImpl.java:807)

          at java.util.concurrent.ThreadPoolExecutor.runWorker(ThreadPoolExecutor.java:1142)

          at java.util.concurrent.ThreadPoolExecutor$Worker.run(ThreadPoolExecutor.java:617)

          at java.lang.Thread.run(Thread.java:748)

      Caused by: java.lang.ClassNotFoundException: org.xnio.XnioWorker$2

          at org.codehaus.plexus.classworlds.strategy.SelfFirstStrategy.loadClass(SelfFirstStrategy.java:50)

          at org.codehaus.plexus.classworlds.realm.ClassRealm.unsynchronizedLoadClass(ClassRealm.java:271)

          at org.codehaus.plexus.classworlds.realm.ClassRealm.loadClass(ClassRealm.java:247)

          at org.codehaus.plexus.classworlds.realm.ClassRealm.loadClass(ClassRealm.java:239)

          ... 10 more

      $