1 Reply Latest reply on Nov 26, 2007 1:21 PM by Sergey Smirnov

    RF Manual Build Error!

    sunyson zenf Newbie

      [INFO] statemgmt:resolve-late-bound-plugin
      org.apache.maven.plugin.MojoExecutionException: Failed to load late-bound plugin: org.apache.maven.plugins:maven-site-plugin
      at org.apache.maven.lifecycle.statemgmt.ResolveLateBoundPluginMojo.execute(ResolveLateBoundPluginMojo.java:52)
      at org.apache.maven.plugin.DefaultPluginManager.executeMojo(DefaultPluginManager.java:578)
      at org.apache.maven.lifecycle.DefaultLifecycleExecutor.executeGoalAndHandleFailures(DefaultLifecycleExecutor.java:508)
      at org.apache.maven.lifecycle.DefaultLifecycleExecutor.executeTaskSegments(DefaultLifecycleExecutor.java:328)
      at org.apache.maven.lifecycle.DefaultLifecycleExecutor.execute(DefaultLifecycleExecutor.java:151)
      at org.apache.maven.DefaultMaven.execute(DefaultMaven.java:220)
      at org.apache.maven.embedder.MavenEmbedder.execute(MavenEmbedder.java:813)
      at org.maven.ide.eclipse.embedder.Maven2Executor.main(Maven2Executor.java:85)
      Caused by: org.apache.maven.plugin.loader.PluginLoaderException: Failed to load plugin. Reason: Unable to build project information for plugin 'org.apache.maven.plugins:maven-site-plugin': POM 'org.apache.maven.plugins:maven-site-plugin' not found in repository: Unable to determine the latest version

      org.apache.maven.plugins:maven-site-plugin:pom:LATEST

      for project org.apache.maven.plugins:maven-site-plugin
      at org.apache.maven.plugin.loader.DefaultPluginLoader.loadPlugin(DefaultPluginLoader.java:230)
      at org.apache.maven.plugin.loader.DefaultPluginLoader.loadPlugin(DefaultPluginLoader.java:66)
      at org.apache.maven.lifecycle.statemgmt.ResolveLateBoundPluginMojo.execute(ResolveLateBoundPluginMojo.java:40)
      ... 7 more
      Caused by: org.apache.maven.plugin.InvalidPluginException: Unable to build project information for plugin 'org.apache.maven.plugins:maven-site-plugin': POM 'org.apache.maven.plugins:maven-site-plugin' not found in repository: Unable to determine the latest version

      org.apache.maven.plugins:maven-site-plugin:pom:LATEST

      for project org.apache.maven.plugins:maven-site-plugin
      at org.apache.maven.plugin.version.DefaultPluginVersionManager.resolveMetaVersion(DefaultPluginVersionManager.java:223)
      at org.apache.maven.plugin.version.DefaultPluginVersionManager.resolvePluginVersion(DefaultPluginVersionManager.java:113)
      at org.apache.maven.plugin.version.DefaultPluginVersionManager.resolvePluginVersion(DefaultPluginVersionManager.java:67)
      at org.apache.maven.plugin.DefaultPluginManager.verifyPlugin(DefaultPluginManager.java:174)
      at org.apache.maven.plugin.loader.DefaultPluginLoader.loadPlugin(DefaultPluginLoader.java:204)
      ... 9 more
      Caused by: org.apache.maven.project.ProjectBuildingException: POM 'org.apache.maven.plugins:maven-site-plugin' not found in repository: Unable to determine the latest version

      org.apache.maven.plugins:maven-site-plugin:pom:LATEST

      for project org.apache.maven.plugins:maven-site-plugin
      at org.apache.maven.project.DefaultMavenProjectBuilder.findModelFromRepository(DefaultMavenProjectBuilder.java:485)
      at org.apache.maven.project.DefaultMavenProjectBuilder.buildFromRepository(DefaultMavenProjectBuilder.java:210)
      at org.apache.maven.plugin.version.DefaultPluginVersionManager.resolveMetaVersion(DefaultPluginVersionManager.java:219)
      ... 13 more
      Caused by: org.apache.maven.artifact.resolver.ArtifactNotFoundException: Unable to determine the latest version

      org.apache.maven.plugins:maven-site-plugin:pom:LATEST


      at org.apache.maven.artifact.transform.LatestArtifactTransformation.transformForResolve(LatestArtifactTransformation.java:46)
      at org.apache.maven.artifact.transform.DefaultArtifactTransformationManager.transformForResolve(DefaultArtifactTransformationManager.java:81)
      at org.apache.maven.artifact.resolver.DefaultArtifactResolver.resolve(DefaultArtifactResolver.java:148)
      at org.apache.maven.artifact.resolver.DefaultArtifactResolver.resolve(DefaultArtifactResolver.java:83)
      at org.apache.maven.project.DefaultMavenProjectBuilder.findModelFromRepository(DefaultMavenProjectBuilder.java:447)
      ... 15 more
      [INFO] ----------------------------------------------------------------------------
      [ERROR] BUILD FAILURE org.richfaces:root:pom:3.2.0-SNAPSHOT ( task-segment: [install] )
      [INFO] ----------------------------------------------------------------------------
      [INFO] Failed to load late-bound plugin: org.apache.maven.plugins:maven-site-plugin
      [INFO] ----------------------------------------------------------------------------
      [INFO] Total time: 2 second
      [INFO] Finished at: Tue Nov 27 02:06:40 CST 2007
      [INFO] Memory 5M/13M
      [INFO] ----------------------------------------------------------------------------
      [INFO] ----------------------------------------------------------------------------
      [ERROR] BUILD FAILURE
      [INFO] ----------------------------------------------------------------------------
      [INFO] Failed to load late-bound plugin: org.apache.maven.plugins:maven-site-plugin
      [INFO] ----------------------------------------------------------------------------
      [INFO] Total time: 2 second
      [INFO] Finished at: Tue Nov 27 02:06:40 CST 2007
      [INFO] Memory 5M/13M
      [INFO] ----------------------------------------------------------------------------
      Sorry,I don't know why?Thanks for your attention.