4 Replies Latest reply on Aug 25, 2007 6:04 AM by Ronald van Kuijk

    BUILD ERROR

    Pedro Luppi Newbie

      I downloaded the jbpm.3 head source form cvs and in jbpm.3/designer/jpdl/org.jbpm.gd.jpdl.build/build.xml, I ran the "all" target. And get the error bellow. Someone can i help ? i do not change any code.

      Buildfile: C:\Users\usuario\workspace\jbpm.3\designer\jpdl\org.jbpm.gd.jpdl.build\build.xml
      check.project.dirs:
      [echo] checking file availability
      get.site:
      get.feature:
      get.main:
      get.projects:
      build:
      install.eclipse:
      prepare.workspace:
      run-eclipse-plugin-builder:
      [java] Buildfile: mainTargets.xml
      [java] main:
      [java] preBuild:
      [java] preSetup:
      [java] [echo] doing preSetup
      [java] getMapFiles:
      [java] [echo] doing getMapFiles
      [java] postSetup:
      [java] [echo] doing postSetup
      [java] fetch:
      [java] generate:
      [java] preGenerate:
      [java] [echo] doing preGenerate
      [java] [echo] baseLocation is c:/software/eclipse
      [java] allElements:
      [java] init:
      [java] generateScript:
      [java] postGenerate:
      [java] [echo] doing postGenerate
      [java] process:
      [java] preProcess:
      [java] [echo] doing preProcess
      [java] allElements:
      [java] init:
      [java] processElement:
      [java] init:
      [java] build.jars:
      [java] init:
      [java] all.features:
      [java] all.plugins:
      [java] properties:
      [java] init:
      [java] build.jars:
      [java] properties:
      [java] init:
      [java] ui.jar:
      [java] update.feature:
      [java] all.children:
      [java] postProcess:
      [java] [echo] doing postProcess
      [java] assemble:
      [java] preAssemble:
      [java] [echo] doing preAssemble
      [java] allElements:
      [java] init:
      [java] assembleElement:
      [java] main:
      [java] assemble.org.jbpm.gd.jpdl.feature:
      [java] main:
      [java] properties:
      [java] init:
      [java] gather.bin.parts:
      [java] init:
      [java] gather.bin.parts:
      [java] children:
      [java] rootFiles*_*_*:
      [java] BUILD FAILED
      [java] C:\Users\usuario\workspace\jbpm.3\designer\jpdl\org.jbpm.gd.jpdl.build\mainTargets.xml:25: The following error occurred while executing this line:
      [java] C:\Users\usuario\workspace\jbpm.3\designer\jpdl\org.jbpm.gd.jpdl.build\mainTargets.xml:90: The following error occurred while executing this line:
      [java] C:\Users\usuario\workspace\jbpm.3\designer\jpdl\org.jbpm.gd.jpdl.build\customTargets.xml:8: The following error occurred while executing this line:
      [java] C:\Users\usuario\workspace\jbpm.3\designer\jpdl\org.jbpm.gd.jpdl.build\genericTargets.xml:133: The following error occurred while executing this line:
      [java] C:\Users\usuario\workspace\jbpm.3\designer\jpdl\org.jbpm.gd.jpdl.build\target\workspace\assemble.org.jbpm.gd.jpdl.feature.all.xml:4: The following error occurred while executing this line:
      [java] C:\Users\usuario\workspace\jbpm.3\designer\jpdl\org.jbpm.gd.jpdl.build\customTargets.xml:22: The following error occurred while executing this line:
      [java] C:\Users\usuario\workspace\jbpm.3\designer\jpdl\org.jbpm.gd.jpdl.build\target\workspace\assemble.org.jbpm.gd.jpdl.feature.xml:54: Execute failed: java.io.IOException: Cannot run program "zip" (in directory "C:\Users\usuario\workspace\jbpm.3\designer\jpdl\org.jbpm.gd.jpdl.build\target\workspace\tmp"): CreateProcess error=2, O sistema não pode encontrar o arquivo especificado
      [java] Total time: 16 seconds
      [java] Java Result: 13
      create.manifest:
      build-feature:
      [get] Getting: http://repository.jboss.com/licenses/JBossORG-EULA.txt
      [get] To: C:\Users\usuario\workspace\jbpm.3\designer\jpdl\org.jbpm.gd.jpdl.build\target\temp\jboss.eula.txt

      BUILD FAILED
      C:\Users\usuario\workspace\jbpm.3\designer\jpdl\org.jbpm.gd.jpdl.build\build.xml:63: The following error occurred while executing this line:
      C:\Users\usuario\workspace\jbpm.3\designer\jpdl\org.jbpm.gd.jpdl.build\build.xml:221: Warning: Could not find file C:\Users\usuario\workspace\jbpm.3\designer\jpdl\org.jbpm.gd.jpdl.build\target\workspace\N.3.0.13.1\org.jbpm.gd.jpdl.feature-3.0.13.1.zip to copy.

      Total time: 23 seconds