8 Replies Latest reply on Oct 5, 2005 12:24 PM by drapierwimATgmailDOTcom

    Problem running provided tests in Eclipse

    drapierwimATgmailDOTcom Newbie

      I'm trying to run the test provided with the booking app by using the TestNG plugin in eclipse. I've added the embedded/conf to the classpath but still getting some nullpointers...

      FAILED: org.jboss.seam.example.booking.test.BookingTest.testBookHotel()
      java.lang.NullPointerException
       at org.jboss.seam.example.booking.test.BookingTest$1.updateModelValues(BookingTest.java:47)
       at org.jboss.seam.mock.SeamTest$Script.run(Unknown Source)
       at org.jboss.seam.example.booking.test.BookingTest.testBookHotel(BookingTest.java:67)
       at sun.reflect.NativeMethodAccessorImpl.invoke0(Native Method)
       at sun.reflect.NativeMethodAccessorImpl.invoke(NativeMethodAccessorImpl.java:39)
       at sun.reflect.DelegatingMethodAccessorImpl.invoke(DelegatingMethodAccessorImpl.java:25)
       at java.lang.reflect.Method.invoke(Method.java:585)
       at org.testng.internal.MethodHelper.invokeMethod(MethodHelper.java:306)
       at org.testng.internal.Invoker.invokeMethod(Invoker.java:343)
       at org.testng.internal.Invoker.invokeTestMethods(Invoker.java:490)
       at org.testng.internal.TestMethodWorker.run(TestMethodWorker.java:61)
       at org.testng.TestRunner.privateRun(TestRunner.java:585)
       at org.testng.TestRunner.run(TestRunner.java:480)
       at org.testng.SuiteRunner.privateRun(SuiteRunner.java:191)
       at org.testng.SuiteRunner.run(SuiteRunner.java:117)
       at org.testng.eclipse.runner.RemoteTestNG.run(RemoteTestNG.java:99)
       at org.testng.eclipse.runner.RemoteTestNG.main(RemoteTestNG.java:138)
      
      
      ===============================================
       org.jboss.seam.example.booking.test.BookingTest
       Tests run: 1, Failures: 1, Skips: 0
      ===============================================
      
      Creating C:\java\workspace\jboss-seam-1.0beta1\testng-failures.xml
      
      ===============================================
      org.jboss.seam.example.booking.test.BookingTest
      Total tests run: 1, Failures: 1, Skips: 0
      ===============================================
      


      any ideas?

        • 1. Re: Problem running provided tests in Eclipse
          Gavin King Master

          Post the Seam log, and check that the Seam components are actually being found.

          Is seam.properties in the classpath?

          • 2. Re: Problem running provided tests in Eclipse
            drapierwimATgmailDOTcom Newbie

            I can't find the Seam log and when I added the seam.properties(is blank) to the classpath my errors on the console changed to

            ERROR 03-10 17:03:37,644 (SchemaExport.java:execute:206) -schema export unsuccessful
            org.hibernate.JDBCException: Error during import script execution
             at org.hibernate.tool.hbm2ddl.SchemaExport.importScript(SchemaExport.java:242)
             at org.hibernate.tool.hbm2ddl.SchemaExport.execute(SchemaExport.java:196)
             at org.hibernate.tool.hbm2ddl.SchemaExport.create(SchemaExport.java:133)
             at org.hibernate.impl.SessionFactoryImpl.<init>(SessionFactoryImpl.java:299)
             at org.hibernate.cfg.Configuration.buildSessionFactory(Configuration.java:1127)
             at org.hibernate.ejb.Ejb3Configuration.createEntityManagerFactory(Ejb3Configuration.java:358)
             at org.hibernate.ejb.Ejb3Configuration.createEntityManagerFactory(Ejb3Configuration.java:484)
             at org.hibernate.ejb.Ejb3Configuration.createContainerEntityManagerFactory(Ejb3Configuration.java:202)
             at org.hibernate.ejb.HibernatePersistence.createContainerEntityManagerFactory(HibernatePersistence.java:78)
             at org.jboss.ejb3.Ejb3Deployment.initializeManagedEntityManagerFactory(Ejb3Deployment.java:512)
             at org.jboss.ejb3.Ejb3Deployment.create(Ejb3Deployment.java:253)
             at org.jboss.ejb3.embedded.EJB3StandaloneDeployer.create(EJB3StandaloneDeployer.java:390)
             at org.jboss.seam.core.Ejb.startup(Unknown Source)
             at sun.reflect.NativeMethodAccessorImpl.invoke0(Native Method)
             at sun.reflect.NativeMethodAccessorImpl.invoke(NativeMethodAccessorImpl.java:39)
             at sun.reflect.DelegatingMethodAccessorImpl.invoke(DelegatingMethodAccessorImpl.java:25)
             at java.lang.reflect.Method.invoke(Method.java:585)
             at org.jboss.seam.util.Reflections.invoke(Unknown Source)
             at org.jboss.seam.util.Reflections.invokeAndWrap(Unknown Source)
             at org.jboss.seam.Component.callCreateMethod(Unknown Source)
             at org.jboss.seam.Component.newInstance(Unknown Source)
             at org.jboss.seam.Component.getInstance(Unknown Source)
             at org.jboss.seam.contexts.Lifecycle.startup(Unknown Source)
             at org.jboss.seam.contexts.Lifecycle.endInitialization(Unknown Source)
             at org.jboss.seam.init.Initialization.init(Unknown Source)
             at org.jboss.seam.mock.SeamTest.init(Unknown Source)
             at sun.reflect.NativeMethodAccessorImpl.invoke0(Native Method)
             at sun.reflect.NativeMethodAccessorImpl.invoke(NativeMethodAccessorImpl.java:39)
             at sun.reflect.DelegatingMethodAccessorImpl.invoke(DelegatingMethodAccessorImpl.java:25)
             at java.lang.reflect.Method.invoke(Method.java:585)
             at org.testng.internal.MethodHelper.invokeMethod(MethodHelper.java:306)
             at org.testng.internal.Invoker.invokeConfigurationMethod(Invoker.java:282)
             at org.testng.internal.Invoker.invokeConfigurations(Invoker.java:151)
             at org.testng.TestRunner.invokeClassConfigurations(TestRunner.java:700)
             at org.testng.TestRunner.privateRun(TestRunner.java:504)
             at org.testng.TestRunner.run(TestRunner.java:480)
             at org.testng.SuiteRunner.privateRun(SuiteRunner.java:191)
             at org.testng.SuiteRunner.run(SuiteRunner.java:117)
             at org.testng.eclipse.runner.RemoteTestNG.run(RemoteTestNG.java:99)
             at org.testng.eclipse.runner.RemoteTestNG.main(RemoteTestNG.java:138)
            Caused by: java.sql.SQLException: Table not found: USER in statement [insert into User]
             at org.hsqldb.jdbc.jdbcUtil.sqlException(Unknown Source)
             at org.hsqldb.jdbc.jdbcStatement.fetchResult(Unknown Source)
             at org.hsqldb.jdbc.jdbcStatement.execute(Unknown Source)
             at org.jboss.resource.adapter.jdbc.WrappedStatement.execute(WrappedStatement.java:55)
             at org.hibernate.tool.hbm2ddl.SchemaExport.importScript(SchemaExport.java:239)
             ... 39 more
            FAILED: org.jboss.seam.example.booking.test.LoginTest.testLogin()
            java.lang.NullPointerException
             at org.jboss.seam.example.booking.test.LoginTest$1.invokeApplication(LoginTest.java:33)
             at org.jboss.seam.mock.SeamTest$Script.run(Unknown Source)
             at org.jboss.seam.example.booking.test.LoginTest.testLogin(LoginTest.java:45)
             at sun.reflect.NativeMethodAccessorImpl.invoke0(Native Method)
             at sun.reflect.NativeMethodAccessorImpl.invoke(NativeMethodAccessorImpl.java:39)
             at sun.reflect.DelegatingMethodAccessorImpl.invoke(DelegatingMethodAccessorImpl.java:25)
             at java.lang.reflect.Method.invoke(Method.java:585)
             at org.testng.internal.MethodHelper.invokeMethod(MethodHelper.java:306)
             at org.testng.internal.Invoker.invokeMethod(Invoker.java:343)
             at org.testng.internal.Invoker.invokeTestMethods(Invoker.java:490)
             at org.testng.internal.TestMethodWorker.run(TestMethodWorker.java:61)
             at org.testng.TestRunner.privateRun(TestRunner.java:585)
             at org.testng.TestRunner.run(TestRunner.java:480)
             at org.testng.SuiteRunner.privateRun(SuiteRunner.java:191)
             at org.testng.SuiteRunner.run(SuiteRunner.java:117)
             at org.testng.eclipse.runner.RemoteTestNG.run(RemoteTestNG.java:99)
             at org.testng.eclipse.runner.RemoteTestNG.main(RemoteTestNG.java:138)
            
            
            ===============================================
             Login
             Tests run: 1, Failures: 1, Skips: 0
            ===============================================
            
            ERROR 03-10 17:03:38,685 (SchemaExport.java:execute:206) -schema export unsuccessful
            org.hibernate.JDBCException: Error during import script execution
             at org.hibernate.tool.hbm2ddl.SchemaExport.importScript(SchemaExport.java:242)
             at org.hibernate.tool.hbm2ddl.SchemaExport.execute(SchemaExport.java:196)
             at org.hibernate.tool.hbm2ddl.SchemaExport.create(SchemaExport.java:133)
             at org.hibernate.impl.SessionFactoryImpl.<init>(SessionFactoryImpl.java:299)
             at org.hibernate.cfg.Configuration.buildSessionFactory(Configuration.java:1127)
             at org.hibernate.ejb.Ejb3Configuration.createEntityManagerFactory(Ejb3Configuration.java:358)
             at org.hibernate.ejb.Ejb3Configuration.createEntityManagerFactory(Ejb3Configuration.java:484)
             at org.hibernate.ejb.Ejb3Configuration.createContainerEntityManagerFactory(Ejb3Configuration.java:202)
             at org.hibernate.ejb.HibernatePersistence.createContainerEntityManagerFactory(HibernatePersistence.java:78)
             at org.jboss.ejb3.Ejb3Deployment.initializeManagedEntityManagerFactory(Ejb3Deployment.java:512)
             at org.jboss.ejb3.Ejb3Deployment.create(Ejb3Deployment.java:253)
             at org.jboss.ejb3.embedded.EJB3StandaloneDeployer.create(EJB3StandaloneDeployer.java:390)
             at org.jboss.seam.core.Ejb.startup(Unknown Source)
             at sun.reflect.NativeMethodAccessorImpl.invoke0(Native Method)
             at sun.reflect.NativeMethodAccessorImpl.invoke(NativeMethodAccessorImpl.java:39)
             at sun.reflect.DelegatingMethodAccessorImpl.invoke(DelegatingMethodAccessorImpl.java:25)
             at java.lang.reflect.Method.invoke(Method.java:585)
             at org.jboss.seam.util.Reflections.invoke(Unknown Source)
             at org.jboss.seam.util.Reflections.invokeAndWrap(Unknown Source)
             at org.jboss.seam.Component.callCreateMethod(Unknown Source)
             at org.jboss.seam.Component.newInstance(Unknown Source)
             at org.jboss.seam.Component.getInstance(Unknown Source)
             at org.jboss.seam.contexts.Lifecycle.startup(Unknown Source)
             at org.jboss.seam.contexts.Lifecycle.endInitialization(Unknown Source)
             at org.jboss.seam.init.Initialization.init(Unknown Source)
             at org.jboss.seam.mock.SeamTest.init(Unknown Source)
             at sun.reflect.NativeMethodAccessorImpl.invoke0(Native Method)
             at sun.reflect.NativeMethodAccessorImpl.invoke(NativeMethodAccessorImpl.java:39)
             at sun.reflect.DelegatingMethodAccessorImpl.invoke(DelegatingMethodAccessorImpl.java:25)
             at java.lang.reflect.Method.invoke(Method.java:585)
             at org.testng.internal.MethodHelper.invokeMethod(MethodHelper.java:306)
             at org.testng.internal.Invoker.invokeConfigurationMethod(Invoker.java:282)
             at org.testng.internal.Invoker.invokeConfigurations(Invoker.java:151)
             at org.testng.TestRunner.invokeClassConfigurations(TestRunner.java:700)
             at org.testng.TestRunner.privateRun(TestRunner.java:504)
             at org.testng.TestRunner.run(TestRunner.java:480)
             at org.testng.SuiteRunner.privateRun(SuiteRunner.java:191)
             at org.testng.SuiteRunner.run(SuiteRunner.java:117)
             at org.testng.eclipse.runner.RemoteTestNG.run(RemoteTestNG.java:99)
             at org.testng.eclipse.runner.RemoteTestNG.main(RemoteTestNG.java:138)
            Caused by: java.sql.SQLException: Table not found: USER in statement [insert into User]
             at org.hsqldb.jdbc.jdbcUtil.sqlException(Unknown Source)
             at org.hsqldb.jdbc.jdbcStatement.fetchResult(Unknown Source)
             at org.hsqldb.jdbc.jdbcStatement.execute(Unknown Source)
             at org.jboss.resource.adapter.jdbc.WrappedStatement.execute(WrappedStatement.java:55)
             at org.hibernate.tool.hbm2ddl.SchemaExport.importScript(SchemaExport.java:239)
             ... 39 more
            FAILED: org.jboss.seam.example.booking.test.BookingTest.testBookHotel()
            java.lang.NullPointerException
             at org.jboss.seam.example.booking.test.BookingTest$1.updateModelValues(BookingTest.java:47)
             at org.jboss.seam.mock.SeamTest$Script.run(Unknown Source)
             at org.jboss.seam.example.booking.test.BookingTest.testBookHotel(BookingTest.java:67)
             at sun.reflect.NativeMethodAccessorImpl.invoke0(Native Method)
             at sun.reflect.NativeMethodAccessorImpl.invoke(NativeMethodAccessorImpl.java:39)
             at sun.reflect.DelegatingMethodAccessorImpl.invoke(DelegatingMethodAccessorImpl.java:25)
             at java.lang.reflect.Method.invoke(Method.java:585)
             at org.testng.internal.MethodHelper.invokeMethod(MethodHelper.java:306)
             at org.testng.internal.Invoker.invokeMethod(Invoker.java:343)
             at org.testng.internal.Invoker.invokeTestMethods(Invoker.java:490)
             at org.testng.internal.TestMethodWorker.run(TestMethodWorker.java:61)
             at org.testng.TestRunner.privateRun(TestRunner.java:585)
             at org.testng.TestRunner.run(TestRunner.java:480)
             at org.testng.SuiteRunner.privateRun(SuiteRunner.java:191)
             at org.testng.SuiteRunner.run(SuiteRunner.java:117)
             at org.testng.eclipse.runner.RemoteTestNG.run(RemoteTestNG.java:99)
             at org.testng.eclipse.runner.RemoteTestNG.main(RemoteTestNG.java:138)
            
            
            ===============================================
             Booking
             Tests run: 1, Failures: 1, Skips: 0
            ===============================================
            
            ERROR 03-10 17:03:39,246 (SchemaExport.java:execute:206) -schema export unsuccessful
            org.hibernate.JDBCException: Error during import script execution
             at org.hibernate.tool.hbm2ddl.SchemaExport.importScript(SchemaExport.java:242)
             at org.hibernate.tool.hbm2ddl.SchemaExport.execute(SchemaExport.java:196)
             at org.hibernate.tool.hbm2ddl.SchemaExport.create(SchemaExport.java:133)
             at org.hibernate.impl.SessionFactoryImpl.<init>(SessionFactoryImpl.java:299)
             at org.hibernate.cfg.Configuration.buildSessionFactory(Configuration.java:1127)
             at org.hibernate.ejb.Ejb3Configuration.createEntityManagerFactory(Ejb3Configuration.java:358)
             at org.hibernate.ejb.Ejb3Configuration.createEntityManagerFactory(Ejb3Configuration.java:484)
             at org.hibernate.ejb.Ejb3Configuration.createContainerEntityManagerFactory(Ejb3Configuration.java:202)
             at org.hibernate.ejb.HibernatePersistence.createContainerEntityManagerFactory(HibernatePersistence.java:78)
             at org.jboss.ejb3.Ejb3Deployment.initializeManagedEntityManagerFactory(Ejb3Deployment.java:512)
             at org.jboss.ejb3.Ejb3Deployment.create(Ejb3Deployment.java:253)
             at org.jboss.ejb3.embedded.EJB3StandaloneDeployer.create(EJB3StandaloneDeployer.java:390)
             at org.jboss.seam.core.Ejb.startup(Unknown Source)
             at sun.reflect.NativeMethodAccessorImpl.invoke0(Native Method)
             at sun.reflect.NativeMethodAccessorImpl.invoke(NativeMethodAccessorImpl.java:39)
             at sun.reflect.DelegatingMethodAccessorImpl.invoke(DelegatingMethodAccessorImpl.java:25)
             at java.lang.reflect.Method.invoke(Method.java:585)
             at org.jboss.seam.util.Reflections.invoke(Unknown Source)
             at org.jboss.seam.util.Reflections.invokeAndWrap(Unknown Source)
             at org.jboss.seam.Component.callCreateMethod(Unknown Source)
             at org.jboss.seam.Component.newInstance(Unknown Source)
             at org.jboss.seam.Component.getInstance(Unknown Source)
             at org.jboss.seam.contexts.Lifecycle.startup(Unknown Source)
             at org.jboss.seam.contexts.Lifecycle.endInitialization(Unknown Source)
             at org.jboss.seam.init.Initialization.init(Unknown Source)
             at org.jboss.seam.mock.SeamTest.init(Unknown Source)
             at sun.reflect.NativeMethodAccessorImpl.invoke0(Native Method)
             at sun.reflect.NativeMethodAccessorImpl.invoke(NativeMethodAccessorImpl.java:39)
             at sun.reflect.DelegatingMethodAccessorImpl.invoke(DelegatingMethodAccessorImpl.java:25)
             at java.lang.reflect.Method.invoke(Method.java:585)
             at org.testng.internal.MethodHelper.invokeMethod(MethodHelper.java:306)
             at org.testng.internal.Invoker.invokeConfigurationMethod(Invoker.java:282)
             at org.testng.internal.Invoker.invokeConfigurations(Invoker.java:151)
             at org.testng.TestRunner.invokeClassConfigurations(TestRunner.java:700)
             at org.testng.TestRunner.privateRun(TestRunner.java:504)
             at org.testng.TestRunner.run(TestRunner.java:480)
             at org.testng.SuiteRunner.privateRun(SuiteRunner.java:191)
             at org.testng.SuiteRunner.run(SuiteRunner.java:117)
             at org.testng.eclipse.runner.RemoteTestNG.run(RemoteTestNG.java:99)
             at org.testng.eclipse.runner.RemoteTestNG.main(RemoteTestNG.java:138)
            Caused by: java.sql.SQLException: Table not found: USER in statement [insert into User]
             at org.hsqldb.jdbc.jdbcUtil.sqlException(Unknown Source)
             at org.hsqldb.jdbc.jdbcStatement.fetchResult(Unknown Source)
             at org.hsqldb.jdbc.jdbcStatement.execute(Unknown Source)
             at org.jboss.resource.adapter.jdbc.WrappedStatement.execute(WrappedStatement.java:55)
             at org.hibernate.tool.hbm2ddl.SchemaExport.importScript(SchemaExport.java:239)
             ... 39 more
            FAILED: org.jboss.seam.example.booking.test.ChangePasswordTest.testChangePassword()
            java.lang.NullPointerException
             at org.jboss.seam.example.booking.test.ChangePasswordTest$1.updateModelValues(ChangePasswordTest.java:40)
             at org.jboss.seam.mock.SeamTest$Script.run(Unknown Source)
             at org.jboss.seam.example.booking.test.ChangePasswordTest.testChangePassword(ChangePasswordTest.java:62)
             at sun.reflect.NativeMethodAccessorImpl.invoke0(Native Method)
             at sun.reflect.NativeMethodAccessorImpl.invoke(NativeMethodAccessorImpl.java:39)
             at sun.reflect.DelegatingMethodAccessorImpl.invoke(DelegatingMethodAccessorImpl.java:25)
             at java.lang.reflect.Method.invoke(Method.java:585)
             at org.testng.internal.MethodHelper.invokeMethod(MethodHelper.java:306)
             at org.testng.internal.Invoker.invokeMethod(Invoker.java:343)
             at org.testng.internal.Invoker.invokeTestMethods(Invoker.java:490)
             at org.testng.internal.TestMethodWorker.run(TestMethodWorker.java:61)
             at org.testng.TestRunner.privateRun(TestRunner.java:585)
             at org.testng.TestRunner.run(TestRunner.java:480)
             at org.testng.SuiteRunner.privateRun(SuiteRunner.java:191)
             at org.testng.SuiteRunner.run(SuiteRunner.java:117)
             at org.testng.eclipse.runner.RemoteTestNG.run(RemoteTestNG.java:99)
             at org.testng.eclipse.runner.RemoteTestNG.main(RemoteTestNG.java:138)
            
            
            ===============================================
             ChangePassword
             Tests run: 1, Failures: 1, Skips: 0
            ===============================================
            
            Creating C:\java\workspace\jboss-seam-1.0beta1\testng-failures.xml
            
            ===============================================
            Hotel Booking
            Total tests run: 3, Failures: 3, Skips: 0
            ===============================================
            
            


            • 3. Re: Problem running provided tests in Eclipse
              Rene Lavoie Newbie

               

              Caused by: java.sql.SQLException: Table not found: USER in statement [insert into User]


              Are you using the default hHSQLDB or did you reconfigure to use another DB?





              • 5. Re: Problem running provided tests in Eclipse
                Gavin King Master

                Sorry, I cant help you much until you enable the log categories org.hibernate and and org.jboss.seam and show us the log output.

                You need to edit the log4j.xml shipped with seam.

                • 6. Re: Problem running provided tests in Eclipse
                  drapierwimATgmailDOTcom Newbie

                   

                  INFO 04-10 17:00:27,829 (?:init:?) -initializing Seam
                  INFO 04-10 17:00:27,829 (?:init:?) -initializing Seam
                  INFO 04-10 17:00:27,900 (?:<init>:?) -Component: org.jboss.seam.core.init, scope: APPLICATION, type: JAVA_BEAN, class: org.jboss.seam.core.Init
                  INFO 04-10 17:00:27,900 (?:<init>:?) -Component: org.jboss.seam.core.init, scope: APPLICATION, type: JAVA_BEAN, class: org.jboss.seam.core.Init
                  DEBUG 04-10 17:00:28,020 (?:initInitializers:?) -org.jboss.seam.core.init.componentClasses=org.jboss.seam.core.Ejb
                  DEBUG 04-10 17:00:28,020 (?:initInitializers:?) -org.jboss.seam.core.init.componentClasses=org.jboss.seam.core.Ejb
                  DEBUG 04-10 17:00:28,030 (?:initInitializers:?) -org.jboss.seam.core.init.managedPersistenceContexts=bookingDatabase
                  DEBUG 04-10 17:00:28,030 (?:initInitializers:?) -org.jboss.seam.core.init.managedPersistenceContexts=bookingDatabase
                  INFO 04-10 17:00:28,350 (?:<init>:?) -Component: org.jboss.seam.core.manager, scope: EVENT, type: JAVA_BEAN, class: org.jboss.seam.core.Manager
                  INFO 04-10 17:00:28,350 (?:<init>:?) -Component: org.jboss.seam.core.manager, scope: EVENT, type: JAVA_BEAN, class: org.jboss.seam.core.Manager
                  INFO 04-10 17:00:28,410 (?:<init>:?) -Component: facesContext, scope: APPLICATION, type: JAVA_BEAN, class: org.jboss.seam.core.FacesContext
                  INFO 04-10 17:00:28,410 (?:<init>:?) -Component: facesContext, scope: APPLICATION, type: JAVA_BEAN, class: org.jboss.seam.core.FacesContext
                  INFO 04-10 17:00:28,450 (?:<init>:?) -Component: eventContext, scope: APPLICATION, type: JAVA_BEAN, class: org.jboss.seam.core.EventContext
                  INFO 04-10 17:00:28,450 (?:<init>:?) -Component: eventContext, scope: APPLICATION, type: JAVA_BEAN, class: org.jboss.seam.core.EventContext
                  INFO 04-10 17:00:28,480 (?:<init>:?) -Component: sessionContext, scope: APPLICATION, type: JAVA_BEAN, class: org.jboss.seam.core.SessionContext
                  INFO 04-10 17:00:28,480 (?:<init>:?) -Component: sessionContext, scope: APPLICATION, type: JAVA_BEAN, class: org.jboss.seam.core.SessionContext
                  INFO 04-10 17:00:28,500 (?:<init>:?) -Component: statelessContext, scope: APPLICATION, type: JAVA_BEAN, class: org.jboss.seam.core.StatelessContext
                  INFO 04-10 17:00:28,500 (?:<init>:?) -Component: statelessContext, scope: APPLICATION, type: JAVA_BEAN, class: org.jboss.seam.core.StatelessContext
                  INFO 04-10 17:00:28,520 (?:<init>:?) -Component: conversationContext, scope: APPLICATION, type: JAVA_BEAN, class: org.jboss.seam.core.ConversationContext
                  INFO 04-10 17:00:28,520 (?:<init>:?) -Component: conversationContext, scope: APPLICATION, type: JAVA_BEAN, class: org.jboss.seam.core.ConversationContext
                  INFO 04-10 17:00:28,540 (?:<init>:?) -Component: applicationContext, scope: APPLICATION, type: JAVA_BEAN, class: org.jboss.seam.core.ApplicationContext
                  INFO 04-10 17:00:28,540 (?:<init>:?) -Component: applicationContext, scope: APPLICATION, type: JAVA_BEAN, class: org.jboss.seam.core.ApplicationContext
                  INFO 04-10 17:00:28,651 (?:<init>:?) -Component: businessProcessContext, scope: APPLICATION, type: JAVA_BEAN, class: org.jboss.seam.core.BusinessProcessContext
                  INFO 04-10 17:00:28,651 (?:<init>:?) -Component: businessProcessContext, scope: APPLICATION, type: JAVA_BEAN, class: org.jboss.seam.core.BusinessProcessContext
                  DEBUG 04-10 17:00:28,671 (?:lookupInStatefulContexts:?) -found in application context: org.jboss.seam.core.init.component
                  DEBUG 04-10 17:00:28,671 (?:lookupInStatefulContexts:?) -found in application context: org.jboss.seam.core.init.component
                  DEBUG 04-10 17:00:28,671 (?:newInstance:?) -instantiating Seam component: org.jboss.seam.core.init
                  DEBUG 04-10 17:00:28,671 (?:newInstance:?) -instantiating Seam component: org.jboss.seam.core.init
                  DEBUG 04-10 17:00:28,681 (?:lookupInStatefulContexts:?) -found in application context: org.jboss.seam.core.init.component
                  DEBUG 04-10 17:00:28,681 (?:lookupInStatefulContexts:?) -found in application context: org.jboss.seam.core.init.component
                  INFO 04-10 17:00:28,681 (?:<init>:?) -Component: org.jboss.seam.core.ejb, scope: APPLICATION, type: JAVA_BEAN, class: org.jboss.seam.core.Ejb
                  INFO 04-10 17:00:28,681 (?:<init>:?) -Component: org.jboss.seam.core.ejb, scope: APPLICATION, type: JAVA_BEAN, class: org.jboss.seam.core.Ejb
                  INFO 04-10 17:00:28,701 (?:<init>:?) -Component: bookingDatabase, scope: CONVERSATION, type: JAVA_BEAN, class: org.jboss.seam.core.ManagedPersistenceContext
                  INFO 04-10 17:00:28,701 (?:<init>:?) -Component: bookingDatabase, scope: CONVERSATION, type: JAVA_BEAN, class: org.jboss.seam.core.ManagedPersistenceContext
                  INFO 04-10 17:00:28,731 (?:getClasses:?) -scanning: C:\java\workspace\jboss-seam-1.0beta1\examples\booking\resources
                  INFO 04-10 17:00:28,731 (?:getClasses:?) -scanning: C:\java\workspace\jboss-seam-1.0beta1\examples\booking\resources
                  DEBUG 04-10 17:00:28,731 (?:handleDirectory:?) -directory: C:\java\workspace\jboss-seam-1.0beta1\examples\booking\resources
                  DEBUG 04-10 17:00:28,731 (?:handleDirectory:?) -directory: C:\java\workspace\jboss-seam-1.0beta1\examples\booking\resources
                  DEBUG 04-10 17:00:28,731 (?:handleDirectory:?) -directory: C:\java\workspace\jboss-seam-1.0beta1\examples\booking\resources\jsp
                  DEBUG 04-10 17:00:28,731 (?:handleDirectory:?) -directory: C:\java\workspace\jboss-seam-1.0beta1\examples\booking\resources\jsp
                  DEBUG 04-10 17:00:28,731 (?:handleDirectory:?) -directory: C:\java\workspace\jboss-seam-1.0beta1\examples\booking\resources\META-INF
                  DEBUG 04-10 17:00:28,731 (?:handleDirectory:?) -directory: C:\java\workspace\jboss-seam-1.0beta1\examples\booking\resources\META-INF
                  DEBUG 04-10 17:00:28,731 (?:handleDirectory:?) -directory: C:\java\workspace\jboss-seam-1.0beta1\examples\booking\resources\view
                  DEBUG 04-10 17:00:28,731 (?:handleDirectory:?) -directory: C:\java\workspace\jboss-seam-1.0beta1\examples\booking\resources\view
                  DEBUG 04-10 17:00:28,741 (?:handleDirectory:?) -directory: C:\java\workspace\jboss-seam-1.0beta1\examples\booking\resources\view\css
                  DEBUG 04-10 17:00:28,741 (?:handleDirectory:?) -directory: C:\java\workspace\jboss-seam-1.0beta1\examples\booking\resources\view\css
                  DEBUG 04-10 17:00:28,741 (?:handleDirectory:?) -directory: C:\java\workspace\jboss-seam-1.0beta1\examples\booking\resources\view\img
                  DEBUG 04-10 17:00:28,741 (?:handleDirectory:?) -directory: C:\java\workspace\jboss-seam-1.0beta1\examples\booking\resources\view\img
                  DEBUG 04-10 17:00:28,741 (?:handleDirectory:?) -directory: C:\java\workspace\jboss-seam-1.0beta1\examples\booking\resources\WEB-INF
                  DEBUG 04-10 17:00:28,741 (?:handleDirectory:?) -directory: C:\java\workspace\jboss-seam-1.0beta1\examples\booking\resources\WEB-INF
                  DEBUG 04-10 17:00:28,741 (?:handleDirectory:?) -directory: C:\java\workspace\jboss-seam-1.0beta1\examples\booking\resources\WEB-INF\lib
                  DEBUG 04-10 17:00:28,741 (?:handleDirectory:?) -directory: C:\java\workspace\jboss-seam-1.0beta1\examples\booking\resources\WEB-INF\lib
                  DEBUG 04-10 17:00:28,741 (?:lookupInStatefulContexts:?) -found in application context: org.jboss.seam.core.ejb.component
                  DEBUG 04-10 17:00:28,741 (?:lookupInStatefulContexts:?) -found in application context: org.jboss.seam.core.ejb.component
                  DEBUG 04-10 17:00:28,741 (?:newInstance:?) -instantiating Seam component: org.jboss.seam.core.ejb
                  DEBUG 04-10 17:00:28,741 (?:newInstance:?) -instantiating Seam component: org.jboss.seam.core.ejb
                  INFO 04-10 17:00:28,751 (?:startup:?) -starting the embedded EJB container
                  INFO 04-10 17:00:28,751 (?:startup:?) -starting the embedded EJB container
                  DEBUG 04-10 17:00:28,801 (KernelFactory.java:assembleNewKernel:68) -Starting JBoss Kernel construction...
                  DEBUG 04-10 17:00:29,422 (KernelFactory.java:assembleNewKernel:94) -Completed JBoss Kernel construction. Duration: 621 milliseconds
                  INFO 04-10 17:00:31,745 (LocalTxDataSource.java:bindConnectionFactory:102) -Bound datasource to JNDI name 'java:/DefaultDS'
                  INFO 04-10 17:00:32,686 (LocalTxDataSource.java:bindConnectionFactory:102) -Bound datasource to JNDI name 'java:/bookingDatasource'
                  INFO 04-10 17:00:32,757 (JaccHelper.java:initialiseJacc:46) -Initialising JACC Context for deployment: resources
                  INFO 04-10 17:00:33,067 (Ejb3Deployment.java:initializeManagedEntityManagerFactory:442) -Found persistence.xml file in EJB3 jar
                  INFO 04-10 17:00:33,207 (Environment.java:<clinit>:470) -Hibernate 3.1 beta 3
                  INFO 04-10 17:00:33,207 (Environment.java:<clinit>:470) -Hibernate 3.1 beta 3
                  INFO 04-10 17:00:33,257 (Environment.java:<clinit>:500) -hibernate.properties not found
                  INFO 04-10 17:00:33,257 (Environment.java:<clinit>:500) -hibernate.properties not found
                  INFO 04-10 17:00:33,267 (Environment.java:<clinit>:516) -using CGLIB reflection optimizer
                  INFO 04-10 17:00:33,267 (Environment.java:<clinit>:516) -using CGLIB reflection optimizer
                  INFO 04-10 17:00:33,267 (Environment.java:<clinit>:546) -using JDK 1.4 java.sql.Timestamp handling
                  INFO 04-10 17:00:33,267 (Environment.java:<clinit>:546) -using JDK 1.4 java.sql.Timestamp handling
                  DEBUG 04-10 17:00:33,508 (Ejb3Configuration.java:getDetectedArtifacts:227) -Detect class: true; detect hbm: true
                  DEBUG 04-10 17:00:33,508 (Ejb3Configuration.java:getDetectedArtifacts:227) -Detect class: true; detect hbm: true
                  DEBUG 04-10 17:00:33,538 (AnnotationConfiguration.java:secondPassCompile:181) -Execute first pass mapping processing
                  DEBUG 04-10 17:00:33,538 (AnnotationConfiguration.java:secondPassCompile:181) -Execute first pass mapping processing
                  DEBUG 04-10 17:00:33,538 (AnnotationConfiguration.java:processArtifactsOfType:238) -Process hbm files
                  DEBUG 04-10 17:00:33,538 (AnnotationConfiguration.java:processArtifactsOfType:238) -Process hbm files
                  DEBUG 04-10 17:00:33,538 (AnnotationConfiguration.java:processArtifactsOfType:246) -Process annotated classes
                  DEBUG 04-10 17:00:33,538 (AnnotationConfiguration.java:processArtifactsOfType:246) -Process annotated classes
                  DEBUG 04-10 17:00:33,648 (AnnotationConfiguration.java:secondPassCompile:208) -processing manytoone fk mappings
                  DEBUG 04-10 17:00:33,648 (AnnotationConfiguration.java:secondPassCompile:208) -processing manytoone fk mappings
                  INFO 04-10 17:00:33,648 (Configuration.java:secondPassCompile:996) -processing extends queue
                  INFO 04-10 17:00:33,648 (Configuration.java:secondPassCompile:996) -processing extends queue
                  INFO 04-10 17:00:33,648 (Configuration.java:secondPassCompile:1000) -processing collection mappings
                  INFO 04-10 17:00:33,648 (Configuration.java:secondPassCompile:1000) -processing collection mappings
                  INFO 04-10 17:00:33,648 (Configuration.java:secondPassCompile:1009) -processing association property references
                  INFO 04-10 17:00:33,648 (Configuration.java:secondPassCompile:1009) -processing association property references
                  INFO 04-10 17:00:33,648 (Configuration.java:secondPassCompile:1031) -processing foreign key constraints
                  INFO 04-10 17:00:33,648 (Configuration.java:secondPassCompile:1031) -processing foreign key constraints
                  DEBUG 04-10 17:00:33,728 (Configuration.java:buildSessionFactory:1119) -Preparing to build session factory with filters : {}
                  DEBUG 04-10 17:00:33,728 (Configuration.java:buildSessionFactory:1119) -Preparing to build session factory with filters : {}
                  DEBUG 04-10 17:00:33,728 (AnnotationConfiguration.java:secondPassCompile:181) -Execute first pass mapping processing
                  DEBUG 04-10 17:00:33,728 (AnnotationConfiguration.java:secondPassCompile:181) -Execute first pass mapping processing
                  DEBUG 04-10 17:00:33,728 (AnnotationConfiguration.java:processArtifactsOfType:238) -Process hbm files
                  DEBUG 04-10 17:00:33,728 (AnnotationConfiguration.java:processArtifactsOfType:238) -Process hbm files
                  DEBUG 04-10 17:00:33,728 (AnnotationConfiguration.java:processArtifactsOfType:246) -Process annotated classes
                  DEBUG 04-10 17:00:33,728 (AnnotationConfiguration.java:processArtifactsOfType:246) -Process annotated classes
                  DEBUG 04-10 17:00:33,728 (AnnotationConfiguration.java:secondPassCompile:208) -processing manytoone fk mappings
                  DEBUG 04-10 17:00:33,728 (AnnotationConfiguration.java:secondPassCompile:208) -processing manytoone fk mappings
                  INFO 04-10 17:00:33,738 (Configuration.java:secondPassCompile:996) -processing extends queue
                  INFO 04-10 17:00:33,738 (Configuration.java:secondPassCompile:996) -processing extends queue
                  INFO 04-10 17:00:33,738 (Configuration.java:secondPassCompile:1000) -processing collection mappings
                  INFO 04-10 17:00:33,738 (Configuration.java:secondPassCompile:1000) -processing collection mappings
                  INFO 04-10 17:00:33,738 (Configuration.java:secondPassCompile:1009) -processing association property references
                  INFO 04-10 17:00:33,738 (Configuration.java:secondPassCompile:1009) -processing association property references
                  INFO 04-10 17:00:33,738 (Configuration.java:secondPassCompile:1031) -processing foreign key constraints
                  INFO 04-10 17:00:33,738 (Configuration.java:secondPassCompile:1031) -processing foreign key constraints
                  INFO 04-10 17:00:33,768 (ConnectionProviderFactory.java:newConnectionProvider:72) -Initializing connection provider: org.hibernate.ejb.InjectedDataSourceConnectionProvider
                  INFO 04-10 17:00:33,768 (ConnectionProviderFactory.java:newConnectionProvider:72) -Initializing connection provider: org.hibernate.ejb.InjectedDataSourceConnectionProvider
                  INFO 04-10 17:00:33,788 (InjectedDataSourceConnectionProvider.java:configure:34) -Using provided datasource
                  INFO 04-10 17:00:33,788 (InjectedDataSourceConnectionProvider.java:configure:34) -Using provided datasource
                  DEBUG 04-10 17:00:33,798 (IdleRemover.java:internalRegisterPool:112) -internalRegisterPool: registering pool with interval 100000 old interval: 9223372036854775807
                  DEBUG 04-10 17:00:33,858 (IdleRemover.java:internalRegisterPool:123) -internalRegisterPool: about to notify thread: old next: 1128438083858, new next: 1128438083858
                  DEBUG 04-10 17:00:33,878 (LocalManagedConnectionFactory.java:createManagedConnection:147) -Using properties: {user=sa, password=--hidden--}
                  DEBUG 04-10 17:00:33,888 (IdleRemover.java:run:74) -run: IdleRemover notifying pools, interval: 50000
                  DEBUG 04-10 17:00:33,888 (LocalManagedConnectionFactory.java:getDriver:252) -Checking driver for URL: jdbc:hsqldb:.
                  DEBUG 04-10 17:00:33,888 (LocalManagedConnectionFactory.java:isDriverLoadedForURL:304) -Driver not yet registered for url: jdbc:hsqldb:.
                  DEBUG 04-10 17:00:33,898 (LocalManagedConnectionFactory.java:isDriverLoadedForURL:299) -Driver already registered for url: jdbc:hsqldb:.
                  INFO 04-10 17:00:34,469 (SettingsFactory.java:buildSettings:77) -RDBMS: HSQL Database Engine, version: 1.7.2
                  INFO 04-10 17:00:34,469 (SettingsFactory.java:buildSettings:77) -RDBMS: HSQL Database Engine, version: 1.7.2
                  INFO 04-10 17:00:34,469 (SettingsFactory.java:buildSettings:78) -JDBC driver: HSQL Database Engine Driver, version: 1.7.2
                  INFO 04-10 17:00:34,469 (SettingsFactory.java:buildSettings:78) -JDBC driver: HSQL Database Engine Driver, version: 1.7.2
                  INFO 04-10 17:00:34,519 (Dialect.java:<init>:100) -Using dialect: org.hibernate.dialect.HSQLDialect
                  INFO 04-10 17:00:34,519 (Dialect.java:<init>:100) -Using dialect: org.hibernate.dialect.HSQLDialect
                  INFO 04-10 17:00:34,699 (TransactionFactoryFactory.java:buildTransactionFactory:31) -Using default transaction strategy (direct JDBC transactions)
                  INFO 04-10 17:00:34,699 (TransactionFactoryFactory.java:buildTransactionFactory:31) -Using default transaction strategy (direct JDBC transactions)
                  INFO 04-10 17:00:34,699 (TransactionManagerLookupFactory.java:getTransactionManagerLookup:38) -instantiating TransactionManagerLookup: org.hibernate.transaction.JBossTransactionManagerLookup
                  INFO 04-10 17:00:34,699 (TransactionManagerLookupFactory.java:getTransactionManagerLookup:38) -instantiating TransactionManagerLookup: org.hibernate.transaction.JBossTransactionManagerLookup
                  INFO 04-10 17:00:34,709 (TransactionManagerLookupFactory.java:getTransactionManagerLookup:42) -instantiated TransactionManagerLookup
                  INFO 04-10 17:00:34,709 (TransactionManagerLookupFactory.java:getTransactionManagerLookup:42) -instantiated TransactionManagerLookup
                  INFO 04-10 17:00:34,709 (SettingsFactory.java:buildSettings:125) -Automatic flush during beforeCompletion(): disabled
                  INFO 04-10 17:00:34,709 (SettingsFactory.java:buildSettings:125) -Automatic flush during beforeCompletion(): disabled
                  INFO 04-10 17:00:34,709 (SettingsFactory.java:buildSettings:129) -Automatic session close at end of transaction: disabled
                  INFO 04-10 17:00:34,709 (SettingsFactory.java:buildSettings:129) -Automatic session close at end of transaction: disabled
                  INFO 04-10 17:00:34,739 (SettingsFactory.java:buildSettings:136) -JDBC batch size: 15
                  INFO 04-10 17:00:34,739 (SettingsFactory.java:buildSettings:136) -JDBC batch size: 15
                  INFO 04-10 17:00:34,739 (SettingsFactory.java:buildSettings:139) -JDBC batch updates for versioned data: disabled
                  INFO 04-10 17:00:34,739 (SettingsFactory.java:buildSettings:139) -JDBC batch updates for versioned data: disabled
                  INFO 04-10 17:00:34,739 (SettingsFactory.java:buildSettings:144) -Scrollable result sets: enabled
                  INFO 04-10 17:00:34,739 (SettingsFactory.java:buildSettings:144) -Scrollable result sets: enabled
                  DEBUG 04-10 17:00:34,749 (SettingsFactory.java:buildSettings:148) -Wrap result sets: disabled
                  DEBUG 04-10 17:00:34,749 (SettingsFactory.java:buildSettings:148) -Wrap result sets: disabled
                  INFO 04-10 17:00:34,749 (SettingsFactory.java:buildSettings:152) -JDBC3 getGeneratedKeys(): disabled
                  INFO 04-10 17:00:34,749 (SettingsFactory.java:buildSettings:152) -JDBC3 getGeneratedKeys(): disabled
                  INFO 04-10 17:00:34,749 (SettingsFactory.java:buildSettings:160) -Connection release mode: after_statement
                  INFO 04-10 17:00:34,749 (SettingsFactory.java:buildSettings:160) -Connection release mode: after_statement
                  INFO 04-10 17:00:34,749 (SettingsFactory.java:buildSettings:187) -Default batch fetch size: 1
                  INFO 04-10 17:00:34,749 (SettingsFactory.java:buildSettings:187) -Default batch fetch size: 1
                  INFO 04-10 17:00:34,749 (SettingsFactory.java:buildSettings:191) -Generate SQL with comments: disabled
                  INFO 04-10 17:00:34,749 (SettingsFactory.java:buildSettings:191) -Generate SQL with comments: disabled
                  INFO 04-10 17:00:34,749 (SettingsFactory.java:buildSettings:195) -Order SQL updates by primary key: disabled
                  INFO 04-10 17:00:34,749 (SettingsFactory.java:buildSettings:195) -Order SQL updates by primary key: disabled
                  INFO 04-10 17:00:34,759 (SettingsFactory.java:createQueryTranslatorFactory:338) -Query translator: org.hibernate.hql.ast.ASTQueryTranslatorFactory
                  INFO 04-10 17:00:34,759 (SettingsFactory.java:createQueryTranslatorFactory:338) -Query translator: org.hibernate.hql.ast.ASTQueryTranslatorFactory
                  INFO 04-10 17:00:34,759 (ASTQueryTranslatorFactory.java:<init>:21) -Using ASTQueryTranslatorFactory
                  INFO 04-10 17:00:34,759 (ASTQueryTranslatorFactory.java:<init>:21) -Using ASTQueryTranslatorFactory
                  INFO 04-10 17:00:34,759 (SettingsFactory.java:buildSettings:203) -Query language substitutions: {}
                  INFO 04-10 17:00:34,759 (SettingsFactory.java:buildSettings:203) -Query language substitutions: {}
                  INFO 04-10 17:00:34,769 (SettingsFactory.java:buildSettings:209) -Second-level cache: enabled
                  INFO 04-10 17:00:34,769 (SettingsFactory.java:buildSettings:209) -Second-level cache: enabled
                  INFO 04-10 17:00:34,769 (SettingsFactory.java:buildSettings:213) -Query cache: disabled
                  INFO 04-10 17:00:34,769 (SettingsFactory.java:buildSettings:213) -Query cache: disabled
                  INFO 04-10 17:00:34,769 (SettingsFactory.java:createCacheProvider:325) -Cache provider: org.hibernate.cache.HashtableCacheProvider
                  INFO 04-10 17:00:34,769 (SettingsFactory.java:createCacheProvider:325) -Cache provider: org.hibernate.cache.HashtableCacheProvider
                  INFO 04-10 17:00:34,769 (SettingsFactory.java:buildSettings:228) -Optimize cache for minimal puts: disabled
                  INFO 04-10 17:00:34,769 (SettingsFactory.java:buildSettings:228) -Optimize cache for minimal puts: disabled
                  INFO 04-10 17:00:34,769 (SettingsFactory.java:buildSettings:237) -Structured second-level cache entries: disabled
                  INFO 04-10 17:00:34,769 (SettingsFactory.java:buildSettings:237) -Structured second-level cache entries: disabled
                  DEBUG 04-10 17:00:34,779 (SQLExceptionConverterFactory.java:buildSQLExceptionConverter:52) -Using dialect defined converter
                  DEBUG 04-10 17:00:34,779 (SQLExceptionConverterFactory.java:buildSQLExceptionConverter:52) -Using dialect defined converter
                  INFO 04-10 17:00:34,789 (SettingsFactory.java:buildSettings:264) -Statistics: disabled
                  INFO 04-10 17:00:34,789 (SettingsFactory.java:buildSettings:264) -Statistics: disabled
                  INFO 04-10 17:00:34,789 (SettingsFactory.java:buildSettings:268) -Deleted entity synthetic identifier rollback: enabled
                  INFO 04-10 17:00:34,789 (SettingsFactory.java:buildSettings:268) -Deleted entity synthetic identifier rollback: enabled
                  INFO 04-10 17:00:34,789 (SettingsFactory.java:buildSettings:283) -Default entity-mode: POJO
                  INFO 04-10 17:00:34,789 (SettingsFactory.java:buildSettings:283) -Default entity-mode: POJO
                  INFO 04-10 17:00:34,930 (SessionFactoryImpl.java:<init>:157) -building session factory
                  INFO 04-10 17:00:34,930 (SessionFactoryImpl.java:<init>:157) -building session factory
                  DEBUG 04-10 17:00:34,930 (SessionFactoryImpl.java:<init>:168) -Session factory constructed with filter configurations : {}
                  DEBUG 04-10 17:00:34,930 (SessionFactoryImpl.java:<init>:168) -Session factory constructed with filter configurations : {}
                  DEBUG 04-10 17:00:34,930 (SessionFactoryImpl.java:<init>:171) -instantiating session factory with properties: {java.runtime.name=Java(TM) 2 Runtime Environment, Standard Edition, hibernate.cache.provider_class=org.hibernate.cache.HashtableCacheProvider, sun.boot.library.path=C:\java\jdk1.5.0_05\jre\bin, java.vm.version=1.5.0_05-b05, hibernate.transaction.auto_close_session=false, java.vm.vendor=Sun Microsystems Inc., java.vendor.url=http://java.sun.com/, path.separator=;, java.vm.name=Java HotSpot(TM) Client VM, file.encoding.pkg=sun.io, user.country=BE, sun.os.patch.level=Service Pack 2, java.vm.specification.name=Java Virtual Machine Specification, user.dir=C:\java\workspace\jboss-seam-1.0beta1, java.runtime.version=1.5.0_05-b05, java.awt.graphicsenv=sun.awt.Win32GraphicsEnvironment, java.endorsed.dirs=C:\java\jdk1.5.0_05\jre\lib\endorsed, os.arch=x86, hibernate.connection.autocommit=true, java.io.tmpdir=C:\DOCUME~1\Wim\LOCALS~1\Temp\, line.separator=
                  , java.vm.specification.vendor=Sun Microsystems Inc., user.variant=, os.name=Windows XP, sun.jnu.encoding=Cp1252, java.library.path=C:\java\jdk1.5.0_05\bin;.;C:\WINDOWS\system32;C:\WINDOWS;C:\WINDOWS\system32;C:\WINDOWS;C:\WINDOWS\System32\Wbem;C:\Program Files\ATI Technologies\ATI Control Panel;C:\Program Files\CVSNT\, java.specification.name=Java Platform API Specification, java.class.version=49.0, sun.management.compiler=HotSpot Client Compiler, hibernate.jndi.java.naming.factory.url.pkgs=org.jboss.naming:org.jnp.interfaces, hibernate.query.factory_class=org.hibernate.hql.ast.ASTQueryTranslatorFactory, os.version=5.1, user.home=C:\Documents and Settings\Wim, user.timezone=Europe/Paris, java.awt.printerjob=sun.awt.windows.WPrinterJob, hibernate.connection.release_mode=after_statement, java.specification.version=1.5, file.encoding=Cp1252, java.class.path=/c:/java/eclipse-SDK-3.2M2-win32/eclipse/plugins/org.testng.eclipse_2.5.5.1/eclipse-testng.jar;/c:/java/eclipse-SDK-3.2M2-win32/eclipse/plugins/org.testng.eclipse_2.5.5.1/lib/testng-jdk15.jar;C:\java\workspace\jboss-seam-1.0beta1\embedded-ejb\conf;C:\java\workspace\jboss-seam-1.0beta1\embedded-ejb\lib\antlr-2.7.5H3.jar;C:\java\workspace\jboss-seam-1.0beta1\embedded-ejb\lib\asm.jar;C:\java\workspace\jboss-seam-1.0beta1\embedded-ejb\lib\asm-attrs.jar;C:\java\workspace\jboss-seam-1.0beta1\embedded-ejb\lib\cglib-2.1.1.jar;C:\java\workspace\jboss-seam-1.0beta1\embedded-ejb\lib\commons-beanutils.jar;C:\java\workspace\jboss-seam-1.0beta1\embedded-ejb\lib\commons-codec-1.2.jar;C:\java\workspace\jboss-seam-1.0beta1\embedded-ejb\lib\commons-collections.jar;C:\java\workspace\jboss-seam-1.0beta1\embedded-ejb\lib\commons-digester-1.6.jar;C:\java\workspace\jboss-seam-1.0beta1\embedded-ejb\lib\commons-discovery.jar;C:\java\workspace\jboss-seam-1.0beta1\embedded-ejb\lib\commons-fileupload.jar;C:\java\workspace\jboss-seam-1.0beta1\embedded-ejb\lib\commons-httpclient.jar;C:\java\workspace\jboss-seam-1.0beta1\embedded-ejb\lib\commons-lang-2.0.jar;C:\java\workspace\jboss-seam-1.0beta1\embedded-ejb\lib\commons-logging.jar;C:\java\workspace\jboss-seam-1.0beta1\embedded-ejb\lib\commons-logging-api.jar;C:\java\workspace\jboss-seam-1.0beta1\embedded-ejb\lib\commons-pool.jar;C:\java\workspace\jboss-seam-1.0beta1\embedded-ejb\lib\commons-validator-1.1.3.jar;C:\java\workspace\jboss-seam-1.0beta1\embedded-ejb\lib\commons-vfs.jar;C:\java\workspace\jboss-seam-1.0beta1\embedded-ejb\lib\concurrent.jar;C:\java\workspace\jboss-seam-1.0beta1\embedded-ejb\lib\dom4j.jar;C:\java\workspace\jboss-seam-1.0beta1\embedded-ejb\lib\ejb3-persistence.jar;C:\java\workspace\jboss-seam-1.0beta1\embedded-ejb\lib\hibernate3.jar;C:\java\workspace\jboss-seam-1.0beta1\embedded-ejb\lib\hibernate-annotations.jar;C:\java\workspace\jboss-seam-1.0beta1\embedded-ejb\lib\hibernate-entitymanager.jar;C:\java\workspace\jboss-seam-1.0beta1\embedded-ejb\lib\hsqldb.jar;C:\java\workspace\jboss-seam-1.0beta1\embedded-ejb\lib\javassist.jar;C:\java\workspace\jboss-seam-1.0beta1\embedded-ejb\lib\jaxen-1.1-beta-4.jar;C:\java\workspace\jboss-seam-1.0beta1\embedded-ejb\lib\jboss.jar;C:\java\workspace\jboss-seam-1.0beta1\embedded-ejb\lib\jboss-annotations-ejb3.jar;C:\java\workspace\jboss-seam-1.0beta1\embedded-ejb\lib\jboss-aop-jdk50.jar;C:\java\workspace\jboss-seam-1.0beta1\embedded-ejb\lib\jboss-aspect-library-jdk50.jar;C:\java\workspace\jboss-seam-1.0beta1\embedded-ejb\lib\jboss-boot.jar;C:\java\workspace\jboss-seam-1.0beta1\embedded-ejb\lib\jboss-common.jar;C:\java\workspace\jboss-seam-1.0beta1\embedded-ejb\lib\jboss-common-jdbc-wrapper.jar;C:\java\workspace\jboss-seam-1.0beta1\embedded-ejb\lib\jboss-container.jar;C:\java\workspace\jboss-seam-1.0beta1\embedded-ejb\lib\jbosscx-client.jar;C:\java\workspace\jboss-seam-1.0beta1\embedded-ejb\lib\jboss-dependency.jar;C:\java\workspace\jboss-seam-1.0beta1\embedded-ejb\lib\jboss-ejb3.jar;C:\java\workspace\jboss-seam-1.0beta1\embedded-ejb\lib\jboss-ejb3x.jar;C:\java\workspace\jboss-seam-1.0beta1\embedded-ejb\lib\jboss-ha-local-jdbc.jar;C:\java\workspace\jboss-seam-1.0beta1\embedded-ejb\lib\jboss-ha-xa-jdbc.jar;C:\java\workspace\jboss-seam-1.0beta1\embedded-ejb\lib\jboss-j2ee.jar;C:\java\workspace\jboss-seam-1.0beta1\embedded-ejb\lib\jboss-j2se.jar;C:\java\workspace\jboss-seam-1.0beta1\embedded-ejb\lib\jboss-jaxrpc.jar;C:\java\workspace\jboss-seam-1.0beta1\embedded-ejb\lib\jboss-jca.jar;C:\java\workspace\jboss-seam-1.0beta1\embedded-ejb\lib\jboss-local-jdbc.jar;C:\java\workspace\jboss-seam-1.0beta1\embedded-ejb\lib\jboss-microcontainer.jar;C:\java\workspace\jboss-seam-1.0beta1\embedded-ejb\lib\jbossmq.jar;C:\java\workspace\jboss-seam-1.0beta1\embedded-ejb\lib\jboss-remoting.jar;C:\java\workspace\jboss-seam-1.0beta1\embedded-ejb\lib\jboss-saaj.jar;C:\java\workspace\jboss-seam-1.0beta1\embedded-ejb\lib\jbosssx.jar;C:\java\workspace\jboss-seam-1.0beta1\embedded-ejb\lib\jboss-system.jar;C:\java\workspace\jboss-seam-1.0beta1\embedded-ejb\lib\jboss-system-client.jar;C:\java\workspace\jboss-seam-1.0beta1\embedded-ejb\lib\jboss-transaction.jar;C:\java\workspace\jboss-seam-1.0beta1\embedded-ejb\lib\jboss-xa-jdbc.jar;C:\java\workspace\jboss-seam-1.0beta1\embedded-ejb\lib\jms-ra.jar;C:\java\workspace\jboss-seam-1.0beta1\embedded-ejb\lib\jnpserver.jar;C:\java\workspace\jboss-seam-1.0beta1\embedded-ejb\lib\log4j.jar;C:\java\workspace\jboss-seam-1.0beta1\embedded-ejb\lib\log4j-boot.jar;C:\java\workspace\jboss-seam-1.0beta1\embedded-ejb\lib\mail-ra.jar;C:\java\workspace\jboss-seam-1.0beta1\embedded-ejb\lib\resolver.jar;C:\java\workspace\jboss-seam-1.0beta1\embedded-ejb\lib\run.jar;C:\java\workspace\jboss-seam-1.0beta1\embedded-ejb\lib\testsuite-support.jar;C:\java\workspace\jboss-seam-1.0beta1\embedded-ejb\lib\trove.jar;C:\java\workspace\jboss-seam-1.0beta1\embedded-ejb\lib\xercesImpl.jar;C:\java\workspace\jboss-seam-1.0beta1\embedded-ejb\lib\xml-apis.jar;C:\java\workspace\jboss-seam-1.0beta1\bin;C:\java\workspace\jboss-seam-1.0beta1\lib\myfaces-jsf-api.jar;C:\java\workspace\jboss-seam-1.0beta1\lib\jbpm-3.0.jar;C:\java\workspace\jboss-seam-1.0beta1\lib\javax.servlet.jar;C:\java\workspace\jboss-seam-1.0beta1\jboss-seam.jar;C:\java\workspace\jboss-seam-1.0beta1\lib\jboss-ejb3x.jar;C:\java\workspace\jboss-seam-1.0beta1\lib\ejb3-persistence.jar;C:\java\workspace\jboss-seam-1.0beta1\lib\hibernate-annotations.jar;C:\java\workspace\jboss-seam-1.0beta1\lib\jboss-common.jar;C:\java\workspace\jboss-seam-1.0beta1\lib\testng-2.5.3-jdk15.jar;C:\java\workspace\jboss-seam-1.0beta1\examples\booking\resources, user.name=Wim, hibernate.use_identifier_rollback=true, java.vm.specification.version=1.0, java.home=C:\java\jdk1.5.0_05\jre, sun.arch.data.model=32, hibernate.dialect=org.hibernate.dialect.HSQLDialect, user.language=nl, java.specification.vendor=Sun Microsystems Inc., awt.toolkit=sun.awt.windows.WToolkit, java.vm.info=mixed mode, sharing, hibernate.cglib.use_reflection_optimizer=true, java.version=1.5.0_05, hibernate.transaction.flush_before_completion=false, java.ext.dirs=C:\java\jdk1.5.0_05\jre\lib\ext, sun.boot.class.path=C:\java\jdk1.5.0_05\jre\lib\rt.jar;C:\java\jdk1.5.0_05\jre\lib\i18n.jar;C:\java\jdk1.5.0_05\jre\lib\sunrsasign.jar;C:\java\jdk1.5.0_05\jre\lib\jsse.jar;C:\java\jdk1.5.0_05\jre\lib\jce.jar;C:\java\jdk1.5.0_05\jre\lib\charsets.jar;C:\java\jdk1.5.0_05\jre\classes, java.vendor=Sun Microsystems Inc., file.separator=\, java.vendor.url.bug=http://java.sun.com/cgi-bin/bugreport.cgi, hibernate.connection.provider_class=org.hibernate.ejb.InjectedDataSourceConnectionProvider, hibernate.hbm2ddl.auto=create-drop, org.w3c.dom.DOMImplementationSourceList=org.apache.xerces.dom.DOMXSImplementationSourceImpl, hibernate.jacc.ctx.id=resources, sun.io.unicode.encoding=UnicodeLittle, sun.cpu.endian=little, hibernate.jndi.java.naming.factory.initial=org.jnp.interfaces.NamingContextFactory, hibernate.transaction.manager_lookup_class=org.hibernate.transaction.JBossTransactionManagerLookup, sun.desktop=windows, sun.cpu.isalist=}
                  DEBUG 04-10 17:00:34,930 (SessionFactoryImpl.java:<init>:171) -instantiating session factory with properties: {java.runtime.name=Java(TM) 2 Runtime Environment, Standard Edition, hibernate.cache.provider_class=org.hibernate.cache.HashtableCacheProvider, sun.boot.library.path=C:\java\jdk1.5.0_05\jre\bin, java.vm.version=1.5.0_05-b05, hibernate.transaction.auto_close_session=false, java.vm.vendor=Sun Microsystems Inc., java.vendor.url=http://java.sun.com/, path.separator=;, java.vm.name=Java HotSpot(TM) Client VM, file.encoding.pkg=sun.io, user.country=BE, sun.os.patch.level=Service Pack 2, java.vm.specification.name=Java Virtual Machine Specification, user.dir=C:\java\workspace\jboss-seam-1.0beta1, java.runtime.version=1.5.0_05-b05, java.awt.graphicsenv=sun.awt.Win32GraphicsEnvironment, java.endorsed.dirs=C:\java\jdk1.5.0_05\jre\lib\endorsed, os.arch=x86, hibernate.connection.autocommit=true, java.io.tmpdir=C:\DOCUME~1\Wim\LOCALS~1\Temp\, line.separator=
                  , java.vm.specification.vendor=Sun Microsystems Inc., user.variant=, os.name=Windows XP, sun.jnu.encoding=Cp1252, java.library.path=C:\java\jdk1.5.0_05\bin;.;C:\WINDOWS\system32;C:\WINDOWS;C:\WINDOWS\system32;C:\WINDOWS;C:\WINDOWS\System32\Wbem;C:\Program Files\ATI Technologies\ATI Control Panel;C:\Program Files\CVSNT\, java.specification.name=Java Platform API Specification, java.class.version=49.0, sun.management.compiler=HotSpot Client Compiler, hibernate.jndi.java.naming.factory.url.pkgs=org.jboss.naming:org.jnp.interfaces, hibernate.query.factory_class=org.hibernate.hql.ast.ASTQueryTranslatorFactory, os.version=5.1, user.home=C:\Documents and Settings\Wim, user.timezone=Europe/Paris, java.awt.printerjob=sun.awt.windows.WPrinterJob, hibernate.connection.release_mode=after_statement, java.specification.version=1.5, file.encoding=Cp1252, java.class.path=/c:/java/eclipse-SDK-3.2M2-win32/eclipse/plugins/org.testng.eclipse_2.5.5.1/eclipse-testng.jar;/c:/java/eclipse-SDK-3.2M2-win32/eclipse/plugins/org.testng.eclipse_2.5.5.1/lib/testng-jdk15.jar;C:\java\workspace\jboss-seam-1.0beta1\embedded-ejb\conf;C:\java\workspace\jboss-seam-1.0beta1\embedded-ejb\lib\antlr-2.7.5H3.jar;C:\java\workspace\jboss-seam-1.0beta1\embedded-ejb\lib\asm.jar;C:\java\workspace\jboss-seam-1.0beta1\embedded-ejb\lib\asm-attrs.jar;C:\java\workspace\jboss-seam-1.0beta1\embedded-ejb\lib\cglib-2.1.1.jar;C:\java\workspace\jboss-seam-1.0beta1\embedded-ejb\lib\commons-beanutils.jar;C:\java\workspace\jboss-seam-1.0beta1\embedded-ejb\lib\commons-codec-1.2.jar;C:\java\workspace\jboss-seam-1.0beta1\embedded-ejb\lib\commons-collections.jar;C:\java\workspace\jboss-seam-1.0beta1\embedded-ejb\lib\commons-digester-1.6.jar;C:\java\workspace\jboss-seam-1.0beta1\embedded-ejb\lib\commons-discovery.jar;C:\java\workspace\jboss-seam-1.0beta1\embedded-ejb\lib\commons-fileupload.jar;C:\java\workspace\jboss-seam-1.0beta1\embedded-ejb\lib\commons-httpclient.jar;C:\java\workspace\jboss-seam-1.0beta1\embedded-ejb\lib\commons-lang-2.0.jar;C:\java\workspace\jboss-seam-1.0beta1\embedded-ejb\lib\commons-logging.jar;C:\java\workspace\jboss-seam-1.0beta1\embedded-ejb\lib\commons-logging-api.jar;C:\java\workspace\jboss-seam-1.0beta1\embedded-ejb\lib\commons-pool.jar;C:\java\workspace\jboss-seam-1.0beta1\embedded-ejb\lib\commons-validator-1.1.3.jar;C:\java\workspace\jboss-seam-1.0beta1\embedded-ejb\lib\commons-vfs.jar;C:\java\workspace\jboss-seam-1.0beta1\embedded-ejb\lib\concurrent.jar;C:\java\workspace\jboss-seam-1.0beta1\embedded-ejb\lib\dom4j.jar;C:\java\workspace\jboss-seam-1.0beta1\embedded-ejb\lib\ejb3-persistence.jar;C:\java\workspace\jboss-seam-1.0beta1\embedded-ejb\lib\hibernate3.jar;C:\java\workspace\jboss-seam-1.0beta1\embedded-ejb\lib\hibernate-annotations.jar;C:\java\workspace\jboss-seam-1.0beta1\embedded-ejb\lib\hibernate-entitymanager.jar;C:\java\workspace\jboss-seam-1.0beta1\embedded-ejb\lib\hsqldb.jar;C:\java\workspace\jboss-seam-1.0beta1\embedded-ejb\lib\javassist.jar;C:\java\workspace\jboss-seam-1.0beta1\embedded-ejb\lib\jaxen-1.1-beta-4.jar;C:\java\workspace\jboss-seam-1.0beta1\embedded-ejb\lib\jboss.jar;C:\java\workspace\jboss-seam-1.0beta1\embedded-ejb\lib\jboss-annotations-ejb3.jar;C:\java\workspace\jboss-seam-1.0beta1\embedded-ejb\lib\jboss-aop-jdk50.jar;C:\java\workspace\jboss-seam-1.0beta1\embedded-ejb\lib\jboss-aspect-library-jdk50.jar;C:\java\workspace\jboss-seam-1.0beta1\embedded-ejb\lib\jboss-boot.jar;C:\java\workspace\jboss-seam-1.0beta1\embedded-ejb\lib\jboss-common.jar;C:\java\workspace\jboss-seam-1.0beta1\embedded-ejb\lib\jboss-common-jdbc-wrapper.jar;C:\java\workspace\jboss-seam-1.0beta1\embedded-ejb\lib\jboss-container.jar;C:\java\workspace\jboss-seam-1.0beta1\embedded-ejb\lib\jbosscx-client.jar;C:\java\workspace\jboss-seam-1.0beta1\embedded-ejb\lib\jboss-dependency.jar;C:\java\workspace\jboss-seam-1.0beta1\embedded-ejb\lib\jboss-ejb3.jar;C:\java\workspace\jboss-seam-1.0beta1\embedded-ejb\lib\jboss-ejb3x.jar;C:\java\workspace\jboss-seam-1.0beta1\embedded-ejb\lib\jboss-ha-local-jdbc.jar;C:\java\workspace\jboss-seam-1.0beta1\embedded-ejb\lib\jboss-ha-xa-jdbc.jar;C:\java\workspace\jboss-seam-1.0beta1\embedded-ejb\lib\jboss-j2ee.jar;C:\java\workspace\jboss-seam-1.0beta1\embedded-ejb\lib\jboss-j2se.jar;C:\java\workspace\jboss-seam-1.0beta1\embedded-ejb\lib\jboss-jaxrpc.jar;C:\java\workspace\jboss-seam-1.0beta1\embedded-ejb\lib\jboss-jca.jar;C:\java\workspace\jboss-seam-1.0beta1\embedded-ejb\lib\jboss-local-jdbc.jar;C:\java\workspace\jboss-seam-1.0beta1\embedded-ejb\lib\jboss-microcontainer.jar;C:\java\workspace\jboss-seam-1.0beta1\embedded-ejb\lib\jbossmq.jar;C:\java\workspace\jboss-seam-1.0beta1\embedded-ejb\lib\jboss-remoting.jar;C:\java\workspace\jboss-seam-1.0beta1\embedded-ejb\lib\jboss-saaj.jar;C:\java\workspace\jboss-seam-1.0beta1\embedded-ejb\lib\jbosssx.jar;C:\java\workspace\jboss-seam-1.0beta1\embedded-ejb\lib\jboss-system.jar;C:\java\workspace\jboss-seam-1.0beta1\embedded-ejb\lib\jboss-system-client.jar;C:\java\workspace\jboss-seam-1.0beta1\embedded-ejb\lib\jboss-transaction.jar;C:\java\workspace\jboss-seam-1.0beta1\embedded-ejb\lib\jboss-xa-jdbc.jar;C:\java\workspace\jboss-seam-1.0beta1\embedded-ejb\lib\jms-ra.jar;C:\java\workspace\jboss-seam-1.0beta1\embedded-ejb\lib\jnpserver.jar;C:\java\workspace\jboss-seam-1.0beta1\embedded-ejb\lib\log4j.jar;C:\java\workspace\jboss-seam-1.0beta1\embedded-ejb\lib\log4j-boot.jar;C:\java\workspace\jboss-seam-1.0beta1\embedded-ejb\lib\mail-ra.jar;C:\java\workspace\jboss-seam-1.0beta1\embedded-ejb\lib\resolver.jar;C:\java\workspace\jboss-seam-1.0beta1\embedded-ejb\lib\run.jar;C:\java\workspace\jboss-seam-1.0beta1\embedded-ejb\lib\testsuite-support.jar;C:\java\workspace\jboss-seam-1.0beta1\embedded-ejb\lib\trove.jar;C:\java\workspace\jboss-seam-1.0beta1\embedded-ejb\lib\xercesImpl.jar;C:\java\workspace\jboss-seam-1.0beta1\embedded-ejb\lib\xml-apis.jar;C:\java\workspace\jboss-seam-1.0beta1\bin;C:\java\workspace\jboss-seam-1.0beta1\lib\myfaces-jsf-api.jar;C:\java\workspace\jboss-seam-1.0beta1\lib\jbpm-3.0.jar;C:\java\workspace\jboss-seam-1.0beta1\lib\javax.servlet.jar;C:\java\workspace\jboss-seam-1.0beta1\jboss-seam.jar;C:\java\workspace\jboss-seam-1.0beta1\lib\jboss-ejb3x.jar;C:\java\workspace\jboss-seam-1.0beta1\lib\ejb3-persistence.jar;C:\java\workspace\jboss-seam-1.0beta1\lib\hibernate-annotations.jar;C:\java\workspace\jboss-seam-1.0beta1\lib\jboss-common.jar;C:\java\workspace\jboss-seam-1.0beta1\lib\testng-2.5.3-jdk15.jar;C:\java\workspace\jboss-seam-1.0beta1\examples\booking\resources, user.name=Wim, hibernate.use_identifier_rollback=true, java.vm.specification.version=1.0, java.home=C:\java\jdk1.5.0_05\jre, sun.arch.data.model=32, hibernate.dialect=org.hibernate.dialect.HSQLDialect, user.language=nl, java.specification.vendor=Sun Microsystems Inc., awt.toolkit=sun.awt.windows.WToolkit, java.vm.info=mixed mode, sharing, hibernate.cglib.use_reflection_optimizer=true, java.version=1.5.0_05, hibernate.transaction.flush_before_completion=false, java.ext.dirs=C:\java\jdk1.5.0_05\jre\lib\ext, sun.boot.class.path=C:\java\jdk1.5.0_05\jre\lib\rt.jar;C:\java\jdk1.5.0_05\jre\lib\i18n.jar;C:\java\jdk1.5.0_05\jre\lib\sunrsasign.jar;C:\java\jdk1.5.0_05\jre\lib\jsse.jar;C:\java\jdk1.5.0_05\jre\lib\jce.jar;C:\java\jdk1.5.0_05\jre\lib\charsets.jar;C:\java\jdk1.5.0_05\jre\classes, java.vendor=Sun Microsystems Inc., file.separator=\, java.vendor.url.bug=http://java.sun.com/cgi-bin/bugreport.cgi, hibernate.connection.provider_class=org.hibernate.ejb.InjectedDataSourceConnectionProvider, hibernate.hbm2ddl.auto=create-drop, org.w3c.dom.DOMImplementationSourceList=org.apache.xerces.dom.DOMXSImplementationSourceImpl, hibernate.jacc.ctx.id=resources, sun.io.unicode.encoding=UnicodeLittle, sun.cpu.endian=little, hibernate.jndi.java.naming.factory.initial=org.jnp.interfaces.NamingContextFactory, hibernate.transaction.manager_lookup_class=org.hibernate.transaction.JBossTransactionManagerLookup, sun.desktop=windows, sun.cpu.isalist=}
                  DEBUG 04-10 17:00:35,160 (SessionFactoryObjectFactory.java:<clinit>:39) -initializing class SessionFactoryObjectFactory
                  DEBUG 04-10 17:00:35,160 (SessionFactoryObjectFactory.java:<clinit>:39) -initializing class SessionFactoryObjectFactory
                  DEBUG 04-10 17:00:35,170 (SessionFactoryObjectFactory.java:addInstance:76) -registered: 402880e406bc25f10106bc25f2d80000 (unnamed)
                  DEBUG 04-10 17:00:35,170 (SessionFactoryObjectFactory.java:addInstance:76) -registered: 402880e406bc25f10106bc25f2d80000 (unnamed)
                  INFO 04-10 17:00:35,170 (SessionFactoryObjectFactory.java:addInstance:82) -Not binding factory to JNDI, no JNDI name configured
                  INFO 04-10 17:00:35,170 (SessionFactoryObjectFactory.java:addInstance:82) -Not binding factory to JNDI, no JNDI name configured
                  DEBUG 04-10 17:00:35,170 (SessionFactoryImpl.java:<init>:297) -instantiated session factory
                  DEBUG 04-10 17:00:35,170 (SessionFactoryImpl.java:<init>:297) -instantiated session factory
                  DEBUG 04-10 17:00:35,180 (AnnotationConfiguration.java:secondPassCompile:181) -Execute first pass mapping processing
                  DEBUG 04-10 17:00:35,180 (AnnotationConfiguration.java:secondPassCompile:181) -Execute first pass mapping processing
                  DEBUG 04-10 17:00:35,180 (AnnotationConfiguration.java:processArtifactsOfType:238) -Process hbm files
                  DEBUG 04-10 17:00:35,180 (AnnotationConfiguration.java:processArtifactsOfType:238) -Process hbm files
                  DEBUG 04-10 17:00:35,190 (AnnotationConfiguration.java:processArtifactsOfType:246) -Process annotated classes
                  DEBUG 04-10 17:00:35,190 (AnnotationConfiguration.java:processArtifactsOfType:246) -Process annotated classes
                  DEBUG 04-10 17:00:35,190 (AnnotationConfiguration.java:secondPassCompile:208) -processing manytoone fk mappings
                  DEBUG 04-10 17:00:35,190 (AnnotationConfiguration.java:secondPassCompile:208) -processing manytoone fk mappings
                  INFO 04-10 17:00:35,350 (Configuration.java:secondPassCompile:996) -processing extends queue
                  INFO 04-10 17:00:35,350 (Configuration.java:secondPassCompile:996) -processing extends queue
                  INFO 04-10 17:00:35,360 (Configuration.java:secondPassCompile:1000) -processing collection mappings
                  INFO 04-10 17:00:35,360 (Configuration.java:secondPassCompile:1000) -processing collection mappings
                  INFO 04-10 17:00:35,360 (Configuration.java:secondPassCompile:1009) -processing association property references
                  INFO 04-10 17:00:35,360 (Configuration.java:secondPassCompile:1009) -processing association property references
                  INFO 04-10 17:00:35,360 (Configuration.java:secondPassCompile:1031) -processing foreign key constraints
                  INFO 04-10 17:00:35,360 (Configuration.java:secondPassCompile:1031) -processing foreign key constraints
                  DEBUG 04-10 17:00:35,360 (AnnotationConfiguration.java:secondPassCompile:181) -Execute first pass mapping processing
                  DEBUG 04-10 17:00:35,360 (AnnotationConfiguration.java:secondPassCompile:181) -Execute first pass mapping processing
                  DEBUG 04-10 17:00:35,370 (AnnotationConfiguration.java:processArtifactsOfType:238) -Process hbm files
                  DEBUG 04-10 17:00:35,370 (AnnotationConfiguration.java:processArtifactsOfType:238) -Process hbm files
                  DEBUG 04-10 17:00:35,370 (AnnotationConfiguration.java:processArtifactsOfType:246) -Process annotated classes
                  DEBUG 04-10 17:00:35,370 (AnnotationConfiguration.java:processArtifactsOfType:246) -Process annotated classes
                  DEBUG 04-10 17:00:35,370 (AnnotationConfiguration.java:secondPassCompile:208) -processing manytoone fk mappings
                  DEBUG 04-10 17:00:35,370 (AnnotationConfiguration.java:secondPassCompile:208) -processing manytoone fk mappings
                  INFO 04-10 17:00:35,370 (Configuration.java:secondPassCompile:996) -processing extends queue
                  INFO 04-10 17:00:35,370 (Configuration.java:secondPassCompile:996) -processing extends queue
                  INFO 04-10 17:00:35,370 (Configuration.java:secondPassCompile:1000) -processing collection mappings
                  INFO 04-10 17:00:35,370 (Configuration.java:secondPassCompile:1000) -processing collection mappings
                  INFO 04-10 17:00:35,370 (Configuration.java:secondPassCompile:1009) -processing association property references
                  INFO 04-10 17:00:35,370 (Configuration.java:secondPassCompile:1009) -processing association property references
                  INFO 04-10 17:00:35,380 (Configuration.java:secondPassCompile:1031) -processing foreign key constraints
                  INFO 04-10 17:00:35,380 (Configuration.java:secondPassCompile:1031) -processing foreign key constraints
                  INFO 04-10 17:00:35,380 (SchemaExport.java:execute:153) -Running hbm2ddl schema export
                  INFO 04-10 17:00:35,380 (SchemaExport.java:execute:153) -Running hbm2ddl schema export
                  INFO 04-10 17:00:35,380 (SchemaExport.java:execute:180) -exporting generated schema to database
                  INFO 04-10 17:00:35,380 (SchemaExport.java:execute:180) -exporting generated schema to database
                  INFO 04-10 17:00:35,390 (SchemaExport.java:importScript:234) -Executing import script: /import.sql
                  INFO 04-10 17:00:35,390 (SchemaExport.java:importScript:234) -Executing import script: /import.sql
                  DEBUG 04-10 17:00:35,390 (SchemaExport.java:importScript:238) -insert into User (username, password, name) values ('gavin', 'foobar', 'Gavin King')
                  DEBUG 04-10 17:00:35,390 (SchemaExport.java:importScript:238) -insert into User (username, password, name) values ('gavin', 'foobar', 'Gavin King')
                  ERROR 04-10 17:00:35,400 (SchemaExport.java:execute:206) -schema export unsuccessful
                  org.hibernate.JDBCException: Error during import script execution
                   at org.hibernate.tool.hbm2ddl.SchemaExport.importScript(SchemaExport.java:242)
                   at org.hibernate.tool.hbm2ddl.SchemaExport.execute(SchemaExport.java:196)
                   at org.hibernate.tool.hbm2ddl.SchemaExport.create(SchemaExport.java:133)
                   at org.hibernate.impl.SessionFactoryImpl.<init>(SessionFactoryImpl.java:299)
                   at org.hibernate.cfg.Configuration.buildSessionFactory(Configuration.java:1127)
                   at org.hibernate.ejb.Ejb3Configuration.createEntityManagerFactory(Ejb3Configuration.java:358)
                   at org.hibernate.ejb.Ejb3Configuration.createEntityManagerFactory(Ejb3Configuration.java:484)
                   at org.hibernate.ejb.Ejb3Configuration.createContainerEntityManagerFactory(Ejb3Configuration.java:202)
                   at org.hibernate.ejb.HibernatePersistence.createContainerEntityManagerFactory(HibernatePersistence.java:78)
                   at org.jboss.ejb3.Ejb3Deployment.initializeManagedEntityManagerFactory(Ejb3Deployment.java:512)
                   at org.jboss.ejb3.Ejb3Deployment.create(Ejb3Deployment.java:253)
                   at org.jboss.ejb3.embedded.EJB3StandaloneDeployer.create(EJB3StandaloneDeployer.java:390)
                   at org.jboss.seam.core.Ejb.startup(Unknown Source)
                   at sun.reflect.NativeMethodAccessorImpl.invoke0(Native Method)
                   at sun.reflect.NativeMethodAccessorImpl.invoke(NativeMethodAccessorImpl.java:39)
                   at sun.reflect.DelegatingMethodAccessorImpl.invoke(DelegatingMethodAccessorImpl.java:25)
                   at java.lang.reflect.Method.invoke(Method.java:585)
                   at org.jboss.seam.util.Reflections.invoke(Unknown Source)
                   at org.jboss.seam.util.Reflections.invokeAndWrap(Unknown Source)
                   at org.jboss.seam.Component.callCreateMethod(Unknown Source)
                   at org.jboss.seam.Component.newInstance(Unknown Source)
                   at org.jboss.seam.Component.getInstance(Unknown Source)
                   at org.jboss.seam.contexts.Lifecycle.startup(Unknown Source)
                   at org.jboss.seam.contexts.Lifecycle.endInitialization(Unknown Source)
                   at org.jboss.seam.init.Initialization.init(Unknown Source)
                   at org.jboss.seam.mock.SeamTest.init(Unknown Source)
                   at sun.reflect.NativeMethodAccessorImpl.invoke0(Native Method)
                   at sun.reflect.NativeMethodAccessorImpl.invoke(NativeMethodAccessorImpl.java:39)
                   at sun.reflect.DelegatingMethodAccessorImpl.invoke(DelegatingMethodAccessorImpl.java:25)
                   at java.lang.reflect.Method.invoke(Method.java:585)
                   at org.testng.internal.MethodHelper.invokeMethod(MethodHelper.java:306)
                   at org.testng.internal.Invoker.invokeConfigurationMethod(Invoker.java:282)
                   at org.testng.internal.Invoker.invokeConfigurations(Invoker.java:151)
                   at org.testng.TestRunner.invokeClassConfigurations(TestRunner.java:700)
                   at org.testng.TestRunner.privateRun(TestRunner.java:504)
                   at org.testng.TestRunner.run(TestRunner.java:480)
                   at org.testng.SuiteRunner.privateRun(SuiteRunner.java:191)
                   at org.testng.SuiteRunner.run(SuiteRunner.java:117)
                   at org.testng.eclipse.runner.RemoteTestNG.run(RemoteTestNG.java:99)
                   at org.testng.eclipse.runner.RemoteTestNG.main(RemoteTestNG.java:138)
                  Caused by: java.sql.SQLException: Table not found: USER in statement [insert into User]
                   at org.hsqldb.jdbc.jdbcUtil.sqlException(Unknown Source)
                   at org.hsqldb.jdbc.jdbcStatement.fetchResult(Unknown Source)
                   at org.hsqldb.jdbc.jdbcStatement.execute(Unknown Source)
                   at org.jboss.resource.adapter.jdbc.WrappedStatement.execute(WrappedStatement.java:55)
                   at org.hibernate.tool.hbm2ddl.SchemaExport.importScript(SchemaExport.java:239)
                   ... 39 more
                  ERROR 04-10 17:00:35,400 (SchemaExport.java:execute:206) -schema export unsuccessful
                  org.hibernate.JDBCException: Error during import script execution
                   at org.hibernate.tool.hbm2ddl.SchemaExport.importScript(SchemaExport.java:242)
                   at org.hibernate.tool.hbm2ddl.SchemaExport.execute(SchemaExport.java:196)
                   at org.hibernate.tool.hbm2ddl.SchemaExport.create(SchemaExport.java:133)
                   at org.hibernate.impl.SessionFactoryImpl.<init>(SessionFactoryImpl.java:299)
                   at org.hibernate.cfg.Configuration.buildSessionFactory(Configuration.java:1127)
                   at org.hibernate.ejb.Ejb3Configuration.createEntityManagerFactory(Ejb3Configuration.java:358)
                   at org.hibernate.ejb.Ejb3Configuration.createEntityManagerFactory(Ejb3Configuration.java:484)
                   at org.hibernate.ejb.Ejb3Configuration.createContainerEntityManagerFactory(Ejb3Configuration.java:202)
                   at org.hibernate.ejb.HibernatePersistence.createContainerEntityManagerFactory(HibernatePersistence.java:78)
                   at org.jboss.ejb3.Ejb3Deployment.initializeManagedEntityManagerFactory(Ejb3Deployment.java:512)
                   at org.jboss.ejb3.Ejb3Deployment.create(Ejb3Deployment.java:253)
                   at org.jboss.ejb3.embedded.EJB3StandaloneDeployer.create(EJB3StandaloneDeployer.java:390)
                   at org.jboss.seam.core.Ejb.startup(Unknown Source)
                   at sun.reflect.NativeMethodAccessorImpl.invoke0(Native Method)
                   at sun.reflect.NativeMethodAccessorImpl.invoke(NativeMethodAccessorImpl.java:39)
                   at sun.reflect.DelegatingMethodAccessorImpl.invoke(DelegatingMethodAccessorImpl.java:25)
                   at java.lang.reflect.Method.invoke(Method.java:585)
                   at org.jboss.seam.util.Reflections.invoke(Unknown Source)
                   at org.jboss.seam.util.Reflections.invokeAndWrap(Unknown Source)
                   at org.jboss.seam.Component.callCreateMethod(Unknown Source)
                   at org.jboss.seam.Component.newInstance(Unknown Source)
                   at org.jboss.seam.Component.getInstance(Unknown Source)
                   at org.jboss.seam.contexts.Lifecycle.startup(Unknown Source)
                   at org.jboss.seam.contexts.Lifecycle.endInitialization(Unknown Source)
                   at org.jboss.seam.init.Initialization.init(Unknown Source)
                   at org.jboss.seam.mock.SeamTest.init(Unknown Source)
                   at sun.reflect.NativeMethodAccessorImpl.invoke0(Native Method)
                   at sun.reflect.NativeMethodAccessorImpl.invoke(NativeMethodAccessorImpl.java:39)
                   at sun.reflect.DelegatingMethodAccessorImpl.invoke(DelegatingMethodAccessorImpl.java:25)
                   at java.lang.reflect.Method.invoke(Method.java:585)
                   at org.testng.internal.MethodHelper.invokeMethod(MethodHelper.java:306)
                   at org.testng.internal.Invoker.invokeConfigurationMethod(Invoker.java:282)
                   at org.testng.internal.Invoker.invokeConfigurations(Invoker.java:151)
                   at org.testng.TestRunner.invokeClassConfigurations(TestRunner.java:700)
                   at org.testng.TestRunner.privateRun(TestRunner.java:504)
                   at org.testng.TestRunner.run(TestRunner.java:480)
                   at org.testng.SuiteRunner.privateRun(SuiteRunner.java:191)
                   at org.testng.SuiteRunner.run(SuiteRunner.java:117)
                   at org.testng.eclipse.runner.RemoteTestNG.run(RemoteTestNG.java:99)
                   at org.testng.eclipse.runner.RemoteTestNG.main(RemoteTestNG.java:138)
                  Caused by: java.sql.SQLException: Table not found: USER in statement [insert into User]
                   at org.hsqldb.jdbc.jdbcUtil.sqlException(Unknown Source)
                   at org.hsqldb.jdbc.jdbcStatement.fetchResult(Unknown Source)
                   at org.hsqldb.jdbc.jdbcStatement.execute(Unknown Source)
                   at org.jboss.resource.adapter.jdbc.WrappedStatement.execute(WrappedStatement.java:55)
                   at org.hibernate.tool.hbm2ddl.SchemaExport.importScript(SchemaExport.java:239)
                   ... 39 more
                  DEBUG 04-10 17:00:35,420 (AnnotationConfiguration.java:secondPassCompile:181) -Execute first pass mapping processing
                  DEBUG 04-10 17:00:35,420 (AnnotationConfiguration.java:secondPassCompile:181) -Execute first pass mapping processing
                  DEBUG 04-10 17:00:35,420 (AnnotationConfiguration.java:processArtifactsOfType:238) -Process hbm files
                  DEBUG 04-10 17:00:35,420 (AnnotationConfiguration.java:processArtifactsOfType:238) -Process hbm files
                  DEBUG 04-10 17:00:35,420 (AnnotationConfiguration.java:processArtifactsOfType:246) -Process annotated classes
                  DEBUG 04-10 17:00:35,420 (AnnotationConfiguration.java:processArtifactsOfType:246) -Process annotated classes
                  DEBUG 04-10 17:00:35,440 (AnnotationConfiguration.java:secondPassCompile:208) -processing manytoone fk mappings
                  DEBUG 04-10 17:00:35,440 (AnnotationConfiguration.java:secondPassCompile:208) -processing manytoone fk mappings
                  INFO 04-10 17:00:35,440 (Configuration.java:secondPassCompile:996) -processing extends queue
                  INFO 04-10 17:00:35,440 (Configuration.java:secondPassCompile:996) -processing extends queue
                  INFO 04-10 17:00:35,440 (Configuration.java:secondPassCompile:1000) -processing collection mappings
                  INFO 04-10 17:00:35,440 (Configuration.java:secondPassCompile:1000) -processing collection mappings
                  INFO 04-10 17:00:35,450 (Configuration.java:secondPassCompile:1009) -processing association property references
                  INFO 04-10 17:00:35,450 (Configuration.java:secondPassCompile:1009) -processing association property references
                  INFO 04-10 17:00:35,450 (Configuration.java:secondPassCompile:1031) -processing foreign key constraints
                  INFO 04-10 17:00:35,450 (Configuration.java:secondPassCompile:1031) -processing foreign key constraints
                  DEBUG 04-10 17:00:35,450 (AnnotationConfiguration.java:secondPassCompile:181) -Execute first pass mapping processing
                  DEBUG 04-10 17:00:35,450 (AnnotationConfiguration.java:secondPassCompile:181) -Execute first pass mapping processing
                  DEBUG 04-10 17:00:35,450 (AnnotationConfiguration.java:processArtifactsOfType:238) -Process hbm files
                  DEBUG 04-10 17:00:35,450 (AnnotationConfiguration.java:processArtifactsOfType:238) -Process hbm files
                  DEBUG 04-10 17:00:35,450 (AnnotationConfiguration.java:processArtifactsOfType:246) -Process annotated classes
                  DEBUG 04-10 17:00:35,450 (AnnotationConfiguration.java:processArtifactsOfType:246) -Process annotated classes
                  DEBUG 04-10 17:00:35,450 (AnnotationConfiguration.java:secondPassCompile:208) -processing manytoone fk mappings
                  DEBUG 04-10 17:00:35,450 (AnnotationConfiguration.java:secondPassCompile:208) -processing manytoone fk mappings
                  INFO 04-10 17:00:35,460 (Configuration.java:secondPassCompile:996) -processing extends queue
                  INFO 04-10 17:00:35,460 (Configuration.java:secondPassCompile:996) -processing extends queue
                  INFO 04-10 17:00:35,460 (Configuration.java:secondPassCompile:1000) -processing collection mappings
                  INFO 04-10 17:00:35,460 (Configuration.java:secondPassCompile:1000) -processing collection mappings
                  INFO 04-10 17:00:35,460 (Configuration.java:secondPassCompile:1009) -processing association property references
                  INFO 04-10 17:00:35,460 (Configuration.java:secondPassCompile:1009) -processing association property references
                  INFO 04-10 17:00:35,460 (Configuration.java:secondPassCompile:1031) -processing foreign key constraints
                  INFO 04-10 17:00:35,460 (Configuration.java:secondPassCompile:1031) -processing foreign key constraints
                  DEBUG 04-10 17:00:35,460 (SessionFactoryImpl.java:<init>:305) -obtaining JTA TransactionManager
                  DEBUG 04-10 17:00:35,460 (SessionFactoryImpl.java:<init>:305) -obtaining JTA TransactionManager
                  INFO 04-10 17:00:35,470 (NamingHelper.java:getInitialContext:26) -JNDI InitialContext properties:{java.naming.factory.initial=org.jnp.interfaces.NamingContextFactory, java.naming.factory.url.pkgs=org.jboss.naming:org.jnp.interfaces}
                  INFO 04-10 17:00:35,470 (NamingHelper.java:getInitialContext:26) -JNDI InitialContext properties:{java.naming.factory.initial=org.jnp.interfaces.NamingContextFactory, java.naming.factory.url.pkgs=org.jboss.naming:org.jnp.interfaces}
                  INFO 04-10 17:00:35,470 (SessionFactoryImpl.java:checkNamedQueries:432) -Checking 0 named queries
                  INFO 04-10 17:00:35,470 (SessionFactoryImpl.java:checkNamedQueries:432) -Checking 0 named queries
                  INFO 04-10 17:00:35,530 (Ejb3Deployment.java:initializeManagedEntityManagerFactory:520) -Create EntityManager with JNDI name: bookingDatabase
                  INFO 04-10 17:00:35,551 (Ejb3Deployment.java:create:257) -EJB3 deployment time took: 2825
                  DEBUG 04-10 17:00:35,551 (?:lookupInStatefulContexts:?) -found in application context: org.jboss.seam.core.ejb.component
                  DEBUG 04-10 17:00:35,551 (?:lookupInStatefulContexts:?) -found in application context: org.jboss.seam.core.ejb.component
                  DEBUG 04-10 17:00:35,551 (?:lookupInStatefulContexts:?) -found in application context: sessionContext.component
                  DEBUG 04-10 17:00:35,551 (?:lookupInStatefulContexts:?) -found in application context: sessionContext.component
                  DEBUG 04-10 17:00:35,561 (?:newInstance:?) -instantiating Seam component: sessionContext
                  DEBUG 04-10 17:00:35,561 (?:newInstance:?) -instantiating Seam component: sessionContext
                  DEBUG 04-10 17:00:35,561 (?:lookupInStatefulContexts:?) -found in application context: sessionContext.component
                  DEBUG 04-10 17:00:35,561 (?:lookupInStatefulContexts:?) -found in application context: sessionContext.component
                  DEBUG 04-10 17:00:35,561 (?:lookupInStatefulContexts:?) -found in application context: statelessContext.component
                  DEBUG 04-10 17:00:35,561 (?:lookupInStatefulContexts:?) -found in application context: statelessContext.component
                  DEBUG 04-10 17:00:35,601 (?:newInstance:?) -instantiating Seam component: statelessContext
                  DEBUG 04-10 17:00:35,601 (?:newInstance:?) -instantiating Seam component: statelessContext
                  DEBUG 04-10 17:00:35,611 (?:lookupInStatefulContexts:?) -found in application context: statelessContext.component
                  DEBUG 04-10 17:00:35,611 (?:lookupInStatefulContexts:?) -found in application context: statelessContext.component
                  DEBUG 04-10 17:00:35,611 (?:lookupInStatefulContexts:?) -found in application context: conversationContext.component
                  DEBUG 04-10 17:00:35,611 (?:lookupInStatefulContexts:?) -found in application context: conversationContext.component
                  DEBUG 04-10 17:00:35,611 (?:newInstance:?) -instantiating Seam component: conversationContext
                  DEBUG 04-10 17:00:35,611 (?:newInstance:?) -instantiating Seam component: conversationContext
                  DEBUG 04-10 17:00:35,611 (?:lookupInStatefulContexts:?) -found in application context: conversationContext.component
                  DEBUG 04-10 17:00:35,611 (?:lookupInStatefulContexts:?) -found in application context: conversationContext.component
                  DEBUG 04-10 17:00:35,611 (?:lookupInStatefulContexts:?) -found in application context: eventContext.component
                  DEBUG 04-10 17:00:35,611 (?:lookupInStatefulContexts:?) -found in application context: eventContext.component
                  DEBUG 04-10 17:00:35,611 (?:newInstance:?) -instantiating Seam component: eventContext
                  DEBUG 04-10 17:00:35,611 (?:newInstance:?) -instantiating Seam component: eventContext
                  DEBUG 04-10 17:00:35,611 (?:lookupInStatefulContexts:?) -found in application context: eventContext.component
                  DEBUG 04-10 17:00:35,611 (?:lookupInStatefulContexts:?) -found in application context: eventContext.component
                  DEBUG 04-10 17:00:35,611 (?:lookupInStatefulContexts:?) -found in application context: applicationContext.component
                  DEBUG 04-10 17:00:35,611 (?:lookupInStatefulContexts:?) -found in application context: applicationContext.component
                  DEBUG 04-10 17:00:35,611 (?:newInstance:?) -instantiating Seam component: applicationContext
                  DEBUG 04-10 17:00:35,611 (?:newInstance:?) -instantiating Seam component: applicationContext
                  DEBUG 04-10 17:00:35,611 (?:lookupInStatefulContexts:?) -found in application context: applicationContext.component
                  DEBUG 04-10 17:00:35,611 (?:lookupInStatefulContexts:?) -found in application context: applicationContext.component
                  DEBUG 04-10 17:00:35,611 (?:lookupInStatefulContexts:?) -found in application context: businessProcessContext.component
                  DEBUG 04-10 17:00:35,611 (?:lookupInStatefulContexts:?) -found in application context: businessProcessContext.component
                  DEBUG 04-10 17:00:35,671 (?:newInstance:?) -instantiating Seam component: businessProcessContext
                  DEBUG 04-10 17:00:35,671 (?:newInstance:?) -instantiating Seam component: businessProcessContext
                  DEBUG 04-10 17:00:35,671 (?:lookupInStatefulContexts:?) -found in application context: businessProcessContext.component
                  DEBUG 04-10 17:00:35,671 (?:lookupInStatefulContexts:?) -found in application context: businessProcessContext.component
                  DEBUG 04-10 17:00:35,681 (?:lookupInStatefulContexts:?) -found in application context: facesContext.component
                  DEBUG 04-10 17:00:35,681 (?:lookupInStatefulContexts:?) -found in application context: facesContext.component
                  DEBUG 04-10 17:00:35,681 (?:newInstance:?) -instantiating Seam component: facesContext
                  DEBUG 04-10 17:00:35,681 (?:newInstance:?) -instantiating Seam component: facesContext
                  DEBUG 04-10 17:00:35,681 (?:lookupInStatefulContexts:?) -found in application context: facesContext.component
                  DEBUG 04-10 17:00:35,681 (?:lookupInStatefulContexts:?) -found in application context: facesContext.component
                  INFO 04-10 17:00:35,691 (?:init:?) -done initializing Seam
                  INFO 04-10 17:00:35,691 (?:init:?) -done initializing Seam
                  DEBUG 04-10 17:00:35,801 (?:beginRequest:?) ->>> Begin web request
                  DEBUG 04-10 17:00:35,801 (?:beginRequest:?) ->>> Begin web request
                  DEBUG 04-10 17:00:35,811 (?:lookupInStatefulContexts:?) -found in application context: org.jboss.seam.core.manager.component
                  DEBUG 04-10 17:00:35,811 (?:lookupInStatefulContexts:?) -found in application context: org.jboss.seam.core.manager.component
                  DEBUG 04-10 17:00:35,811 (?:newInstance:?) -instantiating Seam component: org.jboss.seam.core.manager
                  DEBUG 04-10 17:00:35,811 (?:newInstance:?) -instantiating Seam component: org.jboss.seam.core.manager
                  DEBUG 04-10 17:00:35,821 (?:lookupInStatefulContexts:?) -found in application context: org.jboss.seam.core.manager.component
                  DEBUG 04-10 17:00:35,821 (?:lookupInStatefulContexts:?) -found in application context: org.jboss.seam.core.manager.component
                  DEBUG 04-10 17:00:35,821 (?:lookupInStatefulContexts:?) -found in event context: org.jboss.seam.core.manager
                  DEBUG 04-10 17:00:35,821 (?:lookupInStatefulContexts:?) -found in event context: org.jboss.seam.core.manager
                  DEBUG 04-10 17:00:35,821 (?:lookupInStatefulContexts:?) -found in application context: org.jboss.seam.core.manager.component
                  DEBUG 04-10 17:00:35,821 (?:lookupInStatefulContexts:?) -found in application context: org.jboss.seam.core.manager.component
                  DEBUG 04-10 17:00:35,821 (?:restore:?) -No stored conversation
                  DEBUG 04-10 17:00:35,821 (?:restore:?) -No stored conversation
                  DEBUG 04-10 17:00:35,821 (?:lookupInStatefulContexts:?) -found in application context: org.jboss.seam.core.init
                  DEBUG 04-10 17:00:35,821 (?:lookupInStatefulContexts:?) -found in application context: org.jboss.seam.core.init
                  DEBUG 04-10 17:00:35,821 (?:lookupInStatefulContexts:?) -found in application context: org.jboss.seam.core.init.component
                  DEBUG 04-10 17:00:35,821 (?:lookupInStatefulContexts:?) -found in application context: org.jboss.seam.core.init.component
                  DEBUG 04-10 17:00:35,831 (?:restoreAnyConversationContext:?) -After restore view, conversation context: ConversationContext(1)
                  DEBUG 04-10 17:00:35,831 (?:restoreAnyConversationContext:?) -After restore view, conversation context: ConversationContext(1)
                  DEBUG 04-10 17:00:35,831 (?:<init>:?) -Created BusinessProcessContext
                  DEBUG 04-10 17:00:35,831 (?:<init>:?) -Created BusinessProcessContext
                  DEBUG 04-10 17:00:35,831 (?:lookupInStatefulContexts:?) -found in event context: org.jboss.seam.core.manager
                  DEBUG 04-10 17:00:35,831 (?:lookupInStatefulContexts:?) -found in event context: org.jboss.seam.core.manager
                  DEBUG 04-10 17:00:35,831 (?:lookupInStatefulContexts:?) -found in application context: org.jboss.seam.core.manager.component
                  DEBUG 04-10 17:00:35,831 (?:lookupInStatefulContexts:?) -found in application context: org.jboss.seam.core.manager.component
                  DEBUG 04-10 17:00:35,831 (?:newInstance:?) -seam component not found: hotelBooking
                  DEBUG 04-10 17:00:35,831 (?:newInstance:?) -seam component not found: hotelBooking
                  DEBUG 04-10 17:00:35,841 (?:endSession:?) -End of session, destroying contexts
                  DEBUG 04-10 17:00:35,841 (?:endSession:?) -End of session, destroying contexts
                  DEBUG 04-10 17:00:35,841 (?:lookupInStatefulContexts:?) -found in application context: org.jboss.seam.core.manager.component
                  DEBUG 04-10 17:00:35,841 (?:lookupInStatefulContexts:?) -found in application context: org.jboss.seam.core.manager.component
                  DEBUG 04-10 17:00:35,841 (?:newInstance:?) -instantiating Seam component: org.jboss.seam.core.manager
                  DEBUG 04-10 17:00:35,841 (?:newInstance:?) -instantiating Seam component: org.jboss.seam.core.manager
                  DEBUG 04-10 17:00:35,841 (?:lookupInStatefulContexts:?) -found in application context: org.jboss.seam.core.manager.component
                  DEBUG 04-10 17:00:35,841 (?:lookupInStatefulContexts:?) -found in application context: org.jboss.seam.core.manager.component
                  DEBUG 04-10 17:00:35,841 (?:endSession:?) -destroying conversation contexts: []
                  DEBUG 04-10 17:00:35,841 (?:endSession:?) -destroying conversation contexts: []
                  DEBUG 04-10 17:00:35,861 (?:endSession:?) -destroying session


                  • 7. Re: Problem running provided tests in Eclipse
                    Gavin King Master

                    Looks to me like you have some classpathing issues, since no entity beans or Seam components have been found by Hibernate or Seam.

                    You must make sure that the resources dir is in the eclipse classpath and that seam.properties and persistence.xml are being deployed into the build dir.

                    • 8. Re: Problem running provided tests in Eclipse
                      drapierwimATgmailDOTcom Newbie

                      Problem solved, thanks for your instrest ;-)

                      I added the resources dir to the classpath in the configuration dialog when setting up a run for my tests after I changed it to the eclipse classpath I was able to run my tests.

                      Again, Thank you