3 Replies Latest reply on Jan 17, 2008 10:15 AM by Pete Muir

    cannot run example tests

    Levent Aksu Newbie

      Hi,
      I am getting this strange error with almost any (booking, jpa, hibernate2, dvdstore) project from the examples when I try

      ant test

      I get
       [testng] ERROR [org.jboss.kernel.plugins.dependency.AbstractKernelController] Error installing to Instantiated: name=DeploymentFilter state=Described
       [testng] java.lang.IllegalStateException: Class not found: [Ljava.lang.String;
      

      I am using Ubuntu 7.10 (64 bit), Sun JDK 1.6.0_02 (64 bit) and Seam 2.0.0 GA.
      Things other than tests seem to work all right. I cannot tell what could be wrong.
      Here follows the sample run from booking example:
      levent@levent3:~/lab/libs/jboss-seam-2.0.0.GA/examples/booking$ ant clean
      Buildfile: build.xml
      
      clean:
       [delete] Deleting directory /home/levent/lab/libs/jboss-seam-2.0.0.GA/examples/booking/dist
       [delete] Deleting directory /home/levent/lab/libs/jboss-seam-2.0.0.GA/examples/booking/exploded-archives
       [delete] Deleting directory /home/levent/lab/libs/jboss-seam-2.0.0.GA/examples/booking/test-build
      
      BUILD SUCCESSFUL
      Total time: 1 second
      levent@levent3:~/lab/libs/jboss-seam-2.0.0.GA/examples/booking$ ant test
      Buildfile: build.xml
      
      initcopy:
      
      initpoms:
       [echo] Setting up dependencies
       [copy] Copying 1 file to /home/levent/lab/libs/jboss-seam-2.0.0.GA/classes/poms
      [artifact:install] [INFO] Installing /home/levent/lab/libs/jboss-seam-2.0.0.GA/classes/poms/root.pom to /home/levent/.m2/repository/org/jboss/seam/root/2.0.0.GA/root-2.0.0.GA.pom
       [copy] Copying 1 file to /home/levent/lab/libs/jboss-seam-2.0.0.GA/classes/poms
      [artifact:install] [INFO] Installing /home/levent/lab/libs/jboss-seam-2.0.0.GA/classes/poms/parent.pom to /home/levent/.m2/repository/org/jboss/seam/parent/2.0.0.GA/parent-2.0.0.GA.pom
       [copy] Copying 1 file to /home/levent/lab/libs/jboss-seam-2.0.0.GA/classes/poms
       [copy] Copying 1 file to /home/levent/lab/libs/jboss-seam-2.0.0.GA/classes/poms
       [copy] Copying 1 file to /home/levent/lab/libs/jboss-seam-2.0.0.GA/classes/poms
       [copy] Copying 1 file to /home/levent/lab/libs/jboss-seam-2.0.0.GA/classes/poms
       [copy] Copying 1 file to /home/levent/lab/libs/jboss-seam-2.0.0.GA/classes/poms
       [copy] Copying 1 file to /home/levent/lab/libs/jboss-seam-2.0.0.GA/classes/poms
       [copy] Copying 1 file to /home/levent/lab/libs/jboss-seam-2.0.0.GA/classes/poms
       [copy] Copying 1 file to /home/levent/lab/libs/jboss-seam-2.0.0.GA/classes/poms
      
      copyseam:
      
      copyseamdependencies:
      
      copyextradependencies:
      
      init:
       [echo] Building Seam on JBoss Booking Example 2.0
       [mkdir] Created dir: /home/levent/lab/libs/jboss-seam-2.0.0.GA/examples/booking/exploded-archives/jboss-seam-booking.jar
       [mkdir] Created dir: /home/levent/lab/libs/jboss-seam-2.0.0.GA/examples/booking/exploded-archives/jboss-seam-booking.ear
       [mkdir] Created dir: /home/levent/lab/libs/jboss-seam-2.0.0.GA/examples/booking/exploded-archives/jboss-seam-booking.war
       [mkdir] Created dir: /home/levent/lab/libs/jboss-seam-2.0.0.GA/examples/booking/dist
      
      compiletest:
       [mkdir] Created dir: /home/levent/lab/libs/jboss-seam-2.0.0.GA/examples/booking/test-build
       [javac] Compiling 18 source files to /home/levent/lab/libs/jboss-seam-2.0.0.GA/examples/booking/test-build
       [javac] Note: Some input files use unchecked or unsafe operations.
       [javac] Note: Recompile with -Xlint:unchecked for details.
      
      buildtest:
       [copy] Copying 13 files to /home/levent/lab/libs/jboss-seam-2.0.0.GA/examples/booking/test-build
       [copy] Copying 1 file to /home/levent/lab/libs/jboss-seam-2.0.0.GA/examples/booking/test-build
      
      copyjbossembedded:
      
      test:
       [testng] [Parser] Running:
       [testng] /home/levent/lab/libs/jboss-seam-2.0.0.GA/examples/booking/src/org/jboss/seam/example/booking/test/testng.xml
       [testng]
       [testng] ERROR [org.jboss.kernel.plugins.dependency.AbstractKernelController] Error installing to Instantiated: name=DeploymentFilter state=Described
       [testng] java.lang.IllegalStateException: Class not found: [Ljava.lang.String;
       [testng] at org.jboss.metadata.spi.signature.Signature.stringsToClasses(Signature.java:174)
       [testng] at org.jboss.metadata.spi.signature.Signature.stringsToClasses(Signature.java:125)
       [testng] at org.jboss.metadata.spi.signature.Signature.getParametersTypes(Signature.java:292)
       [testng] at org.jboss.metadata.plugins.loader.reflection.AnnotatedElementMetaDataLoader.getComponentMetaDataRetrieval(AnnotatedElementMetaDataLoader.java:138)
       [testng] at org.jboss.metadata.plugins.context.AbstractMetaDataContext.getComponentMetaDataRetrieval(AbstractMetaDataContext.java:280)
       [testng] at org.jboss.metadata.spi.retrieval.MetaDataRetrievalToMetaDataBridge.getComponentMetaData(MetaDataRetrievalToMetaDataBridge.java:159)
       [testng] at org.jboss.aop.microcontainer.integration.AOPConstructorJoinpoint.methodHasAnnotations(AOPConstructorJoinpoint.java:202)
       [testng] at org.jboss.aop.microcontainer.integration.AOPConstructorJoinpoint.hasMethodMetaData(AOPConstructorJoinpoint.java:172)
       [testng] at org.jboss.aop.microcontainer.integration.AOPConstructorJoinpoint.hasInstanceOrJoinpointMetaData(AOPConstructorJoinpoint.java:152)
       [testng] at org.jboss.aop.microcontainer.integration.AOPConstructorJoinpoint.dispatch(AOPConstructorJoinpoint.java:99)
       [testng] at org.jboss.kernel.plugins.dependency.KernelControllerContextAction.dispatchJoinPoint(KernelControllerContextAction.java:103)
       [testng] at org.jboss.kernel.plugins.dependency.InstantiateAction.installActionInternal(InstantiateAction.java:52)
       [testng] at org.jboss.kernel.plugins.dependency.KernelControllerContextAction.installAction(KernelControllerContextAction.java:197)
       [testng] at org.jboss.kernel.plugins.dependency.KernelControllerContextAction.install(KernelControllerContextAction.java:136)
       [testng] at org.jboss.dependency.plugins.AbstractControllerContextActions.install(AbstractControllerContextActions.java:51)
       [testng] at org.jboss.dependency.plugins.AbstractControllerContext.install(AbstractControllerContext.java:233)
       [testng] at org.jboss.dependency.plugins.AbstractController.install(AbstractController.java:724)
       [testng] at org.jboss.dependency.plugins.AbstractController.incrementState(AbstractController.java:445)
       [testng] at org.jboss.dependency.plugins.AbstractController.resolveContexts(AbstractController.java:555)
       [testng] at org.jboss.dependency.plugins.AbstractController.resolveContexts(AbstractController.java:489)
       [testng] at org.jboss.dependency.plugins.AbstractController.install(AbstractController.java:289)
       [testng] at org.jboss.dependency.plugins.AbstractController.install(AbstractController.java:192)
       [testng] at org.jboss.kernel.plugins.deployment.AbstractKernelDeployer.deployBean(AbstractKernelDeployer.java:302)
       [testng] at org.jboss.kernel.plugins.deployment.AbstractKernelDeployer.deployBeans(AbstractKernelDeployer.java:272)
       [testng] at org.jboss.kernel.plugins.deployment.AbstractKernelDeployer.deploy(AbstractKernelDeployer.java:119)
       [testng] at org.jboss.kernel.plugins.deployment.xml.BeanXMLDeployer.deploy(BeanXMLDeployer.java:96)
       [testng] at org.jboss.embedded.Bootstrap.deployBaseBootstrapUrl(Bootstrap.java:150)
       [testng] at org.jboss.embedded.Bootstrap.bootstrapURL(Bootstrap.java:162)
       [testng] at org.jboss.embedded.Bootstrap.bootstrap(Bootstrap.java:201)
       [testng] at org.jboss.embedded.Bootstrap.bootstrap(Bootstrap.java:214)
       [testng] at org.jboss.seam.mock.EmbeddedBootstrap.startAndDeployResources(EmbeddedBootstrap.java:11)
       [testng] at org.jboss.seam.mock.BaseSeamTest.startJbossEmbeddedIfNecessary(BaseSeamTest.java:1006)
       [testng] at org.jboss.seam.mock.BaseSeamTest.init(BaseSeamTest.java:931)
       [testng] at org.jboss.seam.mock.SeamTest.init(SeamTest.java:42)
       [testng] at sun.reflect.NativeMethodAccessorImpl.invoke0(Native Method)
       [testng] at sun.reflect.NativeMethodAccessorImpl.invoke(NativeMethodAccessorImpl.java:39)
       [testng] at sun.reflect.DelegatingMethodAccessorImpl.invoke(DelegatingMethodAccessorImpl.java:25)
       [testng] at java.lang.reflect.Method.invoke(Method.java:597)
       [testng] at org.testng.internal.MethodHelper.invokeMethod(MethodHelper.java:604)
       [testng] at org.testng.internal.Invoker.invokeConfigurationMethod(Invoker.java:394)
       [testng] at org.testng.internal.Invoker.invokeConfigurations(Invoker.java:142)
       [testng] at org.testng.internal.Invoker.invokeConfigurations(Invoker.java:79)
       [testng] at org.testng.internal.TestMethodWorker.invokeBeforeClassMethods(TestMethodWorker.java:165)
       [testng] at org.testng.internal.TestMethodWorker.run(TestMethodWorker.java:103)
       [testng] at org.testng.TestRunner.runWorkers(TestRunner.java:678)
       [testng] at org.testng.TestRunner.privateRun(TestRunner.java:624)
       [testng] at org.testng.TestRunner.run(TestRunner.java:495)
       [testng] at org.testng.SuiteRunner.runTest(SuiteRunner.java:300)
       [testng] at org.testng.SuiteRunner.runSequentially(SuiteRunner.java:295)
       [testng] at org.testng.SuiteRunner.privateRun(SuiteRunner.java:275)
       [testng] at org.testng.SuiteRunner.run(SuiteRunner.java:190)
       [testng] at org.testng.TestNG.createAndRunSuiteRunners(TestNG.java:792)
       [testng] at org.testng.TestNG.runSuitesLocally(TestNG.java:765)
       [testng] at org.testng.TestNG.run(TestNG.java:699)
       [testng] at org.testng.TestNG.privateMain(TestNG.java:824)
       [testng] at org.testng.TestNG.main(TestNG.java:802)
       [testng] Caused by: java.lang.ClassNotFoundException: [Ljava.lang.String;
       [testng] at java.net.URLClassLoader$1.run(URLClassLoader.java:200)
       [testng] at java.security.AccessController.doPrivileged(Native Method)
       [testng] at java.net.URLClassLoader.findClass(URLClassLoader.java:188)
       [testng] at java.lang.ClassLoader.loadClass(ClassLoader.java:306)
       [testng] at sun.misc.Launcher$AppClassLoader.loadClass(Launcher.java:276)
       [testng] at java.lang.ClassLoader.loadClass(ClassLoader.java:251)
       [testng] at org.jboss.metadata.spi.signature.Signature.stringsToClasses(Signature.java:170)
       [testng] ... 55 more
       [testng] FAILED CONFIGURATION: @BeforeClass init
       [testng] org.jboss.deployers.spi.IncompleteDeploymentException: Summary of incomplete deployments (SEE PREVIOUS ERRORS FOR DETAILS):
       [testng]
       [testng] *** CONTEXTS MISSING DEPENDENCIES: Name -> Dependency{Required State:Actual State}
       [testng]
       [testng] ResourcesToDeploy
       [testng] -> DeploymentFilter{Configured:**ERROR**}
       [testng]
       [testng] ResourcesToDeploy2
       [testng] -> DeploymentFilter{Configured:**ERROR**}
       [testng] -> jboss.kernel:service=Kernel{Configured:**ERROR**}
       [testng]
       [testng] ResourcesToDeploy3
       [testng] -> DeploymentFilter{Configured:**ERROR**}
       [testng]
       [testng]
       [testng] *** CONTEXTS IN ERROR: Name -> Error
       [testng]
       [testng] DeploymentFilter -> java.lang.ClassNotFoundException: [Ljava.lang.String;
       [testng]
       [testng] jboss.kernel:service=Kernel -> **ERROR**
       [testng]
       [testng]
       [testng] at org.jboss.embedded.Bootstrap.checkIncomplete(Bootstrap.java:144)
       [testng] at org.jboss.embedded.Bootstrap.bootstrapURL(Bootstrap.java:169)
       [testng] at org.jboss.embedded.Bootstrap.bootstrap(Bootstrap.java:201)
       [testng] at org.jboss.embedded.Bootstrap.bootstrap(Bootstrap.java:214)
       [testng] at org.jboss.seam.mock.EmbeddedBootstrap.startAndDeployResources(EmbeddedBootstrap.java:11)
       [testng] at org.jboss.seam.mock.BaseSeamTest.startJbossEmbeddedIfNecessary(BaseSeamTest.java:1006)
       [testng] at org.jboss.seam.mock.BaseSeamTest.init(BaseSeamTest.java:931)
       [testng] at org.jboss.seam.mock.SeamTest.init(SeamTest.java:42)
       [testng] ... Removed 22 stack frames
       [testng] SKIPPED CONFIGURATION: @BeforeMethod begin
       [testng] SKIPPED CONFIGURATION: @AfterMethod end
       [testng] SKIPPED CONFIGURATION: @AfterClass cleanup
       [testng] SKIPPED CONFIGURATION: @BeforeClass init
       [testng] SKIPPED CONFIGURATION: @BeforeMethod begin
       [testng] SKIPPED CONFIGURATION: @AfterMethod end
       [testng] SKIPPED CONFIGURATION: @AfterClass cleanup
       [testng] SKIPPED CONFIGURATION: @BeforeClass init
       [testng] SKIPPED CONFIGURATION: @BeforeMethod begin
       [testng] SKIPPED CONFIGURATION: @AfterMethod end
       [testng] SKIPPED CONFIGURATION: @BeforeMethod begin
       [testng] SKIPPED CONFIGURATION: @AfterMethod end
       [testng] SKIPPED CONFIGURATION: @AfterClass cleanup
       [testng] SKIPPED: testBookHotel
       [testng] SKIPPED: testChangePassword
       [testng] SKIPPED: testLogin
       [testng] SKIPPED: testLoginComponent
       [testng]
       [testng] ===============================================
       [testng] Hotel Booking
       [testng] Tests run: 4, Failures: 0, Skips: 4
       [testng] Configuration Failures: 1, Skips: 13
       [testng] ===============================================
       [testng]
       [testng]
       [testng] ===============================================
       [testng] Hotel Booking
       [testng] Total tests run: 4, Failures: 0, Skips: 4
       [testng] Configuration Failures: 1, Skips: 13
       [testng] ===============================================
       [testng]
       [echo] You can increase the logging by editing bootstrap/log4j.xml
      
      BUILD SUCCESSFUL
      Total time: 4 seconds