3 Replies Latest reply on Jun 2, 2011 10:09 PM by leon z

    JBPM-Bpel helloworld example- ant run test

    ram kumar Newbie

      Hi,

      I am getting this error report when i try to run the test class through ant -run test in the helloworld example of JBPM-Bpel 1.1-beta3

      and the test result is

      Running org.jbpm.bpel.tutorial.hello.HelloTest
      [junit] Tests run: 2, Failures: 0, Errors: 2, Time elapsed: 17.936 sec


      color=darkred] javax.naming.NamingException: Cannot unmarshall service ref meta data, cause: java.io.InvalidClassException: javax.xml.namespace.QName; local class incompatible: stream classdesc serialVersionUID = 4418622981026545151, local class serialVersionUID = -9120448754896609940
      at org.jboss.ws.jaxrpc.ServiceObjectFactory.getObjectInstance(ServiceObjectFactory.java:127)
      at javax.naming.spi.NamingManager.getObjectInstance(NamingManager.java:304)
      at org.jnp.interfaces.NamingContext.getObjectInstance(NamingContext.java:1125)
      at org.jnp.interfaces.NamingContext.getObjectInstanceWrapFailure(NamingContext.java:1142)
      at org.jnp.interfaces.NamingContext.lookup(NamingContext.java:705)
      at org.jboss.naming.client.java.javaURLContextFactory$EncContextProxy.invoke(javaURLContextFactory.java:135)
      at $Proxy1.lookup(Unknown Source)
      at javax.naming.InitialContext.lookup(InitialContext.java:351)
      at org.jbpm.bpel.tutorial.hello.HelloTest.setUp(HelloTest.java:56)
      at junit.extensions.TestDecorator.basicRun(TestDecorator.java:22)
      at junit.extensions.TestSetup$1.protect(TestSetup.java:19)
      at junit.extensions.TestSetup.run(TestSetup.java:23)



      javax.naming.NamingException: Cannot unmarshall service ref meta data, cause: java.io.InvalidClassException: javax.xml.namespace.QName; local class incompatible: stream classdesc serialVersionUID = 4418622981026545151, local class serialVersionUID = -9120448754896609940
      at org.jboss.ws.jaxrpc.ServiceObjectFactory.getObjectInstance(ServiceObjectFactory.java:127)
      at javax.naming.spi.NamingManager.getObjectInstance(NamingManager.java:304)
      at org.jnp.interfaces.NamingContext.getObjectInstance(NamingContext.java:1125)
      at org.jnp.interfaces.NamingContext.getObjectInstanceWrapFailure(NamingContext.java:1142)
      at org.jnp.interfaces.NamingContext.lookup(NamingContext.java:705)
      at org.jboss.naming.client.java.javaURLContextFactory$EncContextProxy.invoke(javaURLContextFactory.java:135)
      at $Proxy1.lookup(Unknown Source)
      at javax.naming.InitialContext.lookup(InitialContext.java:351)
      at org.jbpm.bpel.tutorial.hello.HelloTest.setUp(HelloTest.java:56)
      at junit.extensions.TestDecorator.basicRun(TestDecorator.java:22)
      at junit.extensions.TestSetup$1.protect(TestSetup.java:19)
      at junit.extensions.TestSetup.run(TestSetup.java:23)


      <system-out><![CDATA[^^^^-
      18:45:30,284 DEBUG SecurityAssociation : Using ThreadLocal: false
      ---
      18:45:42,002 ERROR ServiceObjectFactory : Cannot create service
      javax.naming.NamingException: Cannot unmarshall service ref meta data, cause: java.io.InvalidClassException: javax.xml.namespace.QName; local class incompatible: stream classdesc serialVersionUID = 4418622981026545151, local class serialVersionUID = -9120448754896609940
      at org.jboss.ws.jaxrpc.ServiceObjectFactory.getObjectInstance(ServiceObjectFactory.java:127)
      at javax.naming.spi.NamingManager.getObjectInstance(NamingManager.java:304)
      at org.jnp.interfaces.NamingContext.getObjectInstance(NamingContext.java:1125)
      at org.jnp.interfaces.NamingContext.getObjectInstanceWrapFailure(NamingContext.java:1142)
      at org.jnp.interfaces.NamingContext.lookup(NamingContext.java:705)
      at org.jboss.naming.client.java.javaURLContextFactory$EncContextProxy.invoke(javaURLContextFactory.java:135)
      at $Proxy1.lookup(Unknown Source)
      at javax.naming.InitialContext.lookup(InitialContext.java:351)
      at org.jbpm.bpel.tutorial.hello.HelloTest.setUp(HelloTest.java:56)
      at junit.framework.TestCase.runBare(TestCase.java:125)
      at junit.framework.TestResult$1.protect(TestResult.java:106)
      at junit.framework.TestResult.runProtected(TestResult.java:124)
      at junit.framework.TestResult.run(TestResult.java:109)
      at junit.framework.TestCase.run(TestCase.java:118)
      at junit.framework.TestSuite.runTest(TestSuite.java:208)
      at junit.framework.TestSuite.run(TestSuite.java:203)
      at junit.extensions.TestDecorator.basicRun(TestDecorator.java:22)
      at junit.extensions.TestSetup$1.protect(TestSetup.java:19)
      at junit.framework.TestResult.runProtected(TestResult.java:124)
      at junit.extensions.TestSetup.run(TestSetup.java:23)
      at org.apache.tools.ant.taskdefs.optional.junit.JUnitTestRunner.run(JUnitTestRunner.java:297)
      at org.apache.tools.ant.taskdefs.optional.junit.JUnitTestRunner.launch(JUnitTestRunner.java:672)
      at org.apache.tools.ant.taskdefs.optional.junit.JUnitTestRunner.main(JUnitTestRunner.java:567)
      ---
      18:45:42,033 ERROR ServiceObjectFactory : Cannot create service
      javax.naming.NamingException: Cannot unmarshall service ref meta data, cause: java.io.InvalidClassException: javax.xml.namespace.QName; local class incompatible: stream classdesc serialVersionUID = 4418622981026545151, local class serialVersionUID = -9120448754896609940
      at org.jboss.ws.jaxrpc.ServiceObjectFactory.getObjectInstance(ServiceObjectFactory.java:127)
      at javax.naming.spi.NamingManager.getObjectInstance(NamingManager.java:304)
      at org.jnp.interfaces.NamingContext.getObjectInstance(NamingContext.java:1125)
      at org.jnp.interfaces.NamingContext.getObjectInstanceWrapFailure(NamingContext.java:1142)
      at org.jnp.interfaces.NamingContext.lookup(NamingContext.java:705)
      at org.jboss.naming.client.java.javaURLContextFactory$EncContextProxy.invoke(javaURLContextFactory.java:135)
      at $Proxy1.lookup(Unknown Source)
      at javax.naming.InitialContext.lookup(InitialContext.java:351)
      at org.jbpm.bpel.tutorial.hello.HelloTest.setUp(HelloTest.java:56)
      at junit.framework.TestCase.runBare(TestCase.java:125)
      at junit.framework.TestResult$1.protect(TestResult.java:106)
      at junit.framework.TestResult.runProtected(TestResult.java:124)
      at junit.framework.TestResult.run(TestResult.java:109)
      at junit.framework.TestCase.run(TestCase.java:118)
      at junit.framework.TestSuite.runTest(TestSuite.java:208)
      at junit.framework.TestSuite.run(TestSuite.java:203)
      at junit.extensions.TestDecorator.basicRun(TestDecorator.java:22)
      at junit.extensions.TestSetup$1.protect(TestSetup.java:19)
      at junit.framework.TestResult.runProtected(TestResult.java:124)
      at junit.extensions.TestSetup.run(TestSetup.java:23)
      at org.apache.tools.ant.taskdefs.optional.junit.JUnitTestRunner.run(JUnitTestRunner.java:297)
      at org.apache.tools.ant.taskdefs.optional.junit.JUnitTestRunner.launch(JUnitTestRunner.java:672)
      at org.apache.tools.ant.taskdefs.optional.junit.JUnitTestRunner.main(JUnitTestRunner.java:567)
      ]]></system-out>
      <system-err><![CDATA[]]></system-err>