0 Replies Latest reply on Aug 9, 2010 4:42 AM by Thomas Diesler

    AS7 build failure

    Thomas Diesler Master

      Folks,

       

      the AS7 build consistently fails for me

       

      Test set: org.jboss.as.deployment.ServiceDeploymentTestCase
      -------------------------------------------------------------------------------
      Tests run: 1, Failures: 1, Errors: 0, Skipped: 0, Time elapsed: 0.051 sec <<< FAILURE!
      testParsedDeployment(org.jboss.as.deployment.ServiceDeploymentTestCase)  Time elapsed: 0.041 sec  <<< FAILURE!
      java.lang.AssertionError: 
          at org.junit.Assert.fail(Assert.java:92)
          at org.junit.Assert.assertTrue(Assert.java:44)
          at org.junit.Assert.assertNotNull(Assert.java:568)
          at org.junit.Assert.assertNotNull(Assert.java:579)
          at org.jboss.as.deployment.ServiceDeploymentTestCase.testParsedDeployment(ServiceDeploymentTestCase.java:105)

       

      http://jbmuc.dyndns.org:8280/hudson/job/JBoss-7.0.0/4/testReport/junit/org.jboss.as.deployment/ServiceDeploymentTestCase/testParsedDeployment/

       

      Is there a master hudson instance somewhere?