0 Replies Latest reply on Jul 27, 2011 12:03 PM by songjinglim

    RichFaces 4.0 example build fail

    songjinglim Newbie

      [INFO] ------------------------------------------------------------------------

      [INFO] BUILD FAILURE

      [INFO] ------------------------------------------------------------------------

      [INFO] Total time: 6:00.500s

      [INFO] Finished at: Thu Jul 28 01:44:32 EST 2011

      [INFO] Final Memory: 5M/15M

      [INFO] ------------------------------------------------------------------------

      [ERROR] Failed to execute goal on project richfaces-showcase: Could not resolve

      dependencies for project org.richfaces.examples:richfaces-showcase:war:4.0.0.Fin

      al: The following artifacts could not be resolved: com.sun.faces:jsf-api:jar:2.0

      .3-b03, com.sun.faces:jsf-impl:jar:2.0.3-b03: Could not find artifact com.sun.fa

      ces:jsf-api:jar:2.0.3-b03 in jboss-public-repository-group (https://repository.j

      boss.org/nexus/content/groups/public-jboss/) -> [Help 1]

      [ERROR]

      [ERROR] To see the full stack trace of the errors, re-run Maven with the -e swit

      ch.

      [ERROR] Re-run Maven using the -X switch to enable full debug logging.

      [ERROR]

      [ERROR] For more information about the errors and possible solutions, please rea

      d the following articles:

      [ERROR] [Help 1] http://cwiki.apache.org/confluence/display/MAVEN/DependencyReso

      lutionException

      G:\javaapps\RichFaces\richfaces-4.0.0.Final\examples\richfaces-showcase>