2 Replies Latest reply on Aug 29, 2011 11:58 AM by Danny C

    Modeshape 2.6 latest Git Source build Failures

    Danny C Newbie

      Hi,

       

           Git pull the latest Modeshape 2.6 source today and using Maven3 & JDK6 to build it,  some reactors jar are successfully built and some fail, would like to know if I have overlooked something. The command used for building is "mvn clean install -fae -Dmaven.test.skip=true" and the build summary is as below:

       

      Thank in advance.

       

      ------------------------------------------------------------------------

      Reactor Summary:

      ModeShape Common Parent ........................... SUCCESS (3.495s)

      ModeShape Assembly Descriptors .................... SUCCESS (5.143s)

      ModeShape Common .................................. SUCCESS (15.789s)

      ModeShape Graph ................................... SUCCESS (1:30.609s)

      ModeShape Search Engine for Lucene ................ SUCCESS (5.245s)

      ModeShape ......................................... SUCCESS (0.125s)

      ModeShape Repository .............................. SUCCESS (5.588s)

      ModeShape CND Utility ............................. SUCCESS (2.435s)

      ModeShape Clustering Component .................... SUCCESS (13.039s)

      ModeShape JCR Repository API ...................... SUCCESS (3.296s)

      ModeShape JCR Repository .......................... SUCCESS (31.925s)

      ModeShape Maven Classloader ....................... SUCCESS (3.752s)

      ModeShape Image Sequencer ......................... SUCCESS (2.114s)

      ModeShape MP3 Sequencer ........................... SUCCESS (2.342s)

      ModeShape jBPM jPDL Sequencer ..................... SUCCESS (2.961s)

      ModeShape CND Sequencer ........................... SUCCESS (2.525s)

      ModeShape Java Class File Sequencer ............... SUCCESS (5.949s)

      ModeShape Java Sequencer .......................... SUCCESS (6.011s)

      ModeShape Microsoft Office Sequencer .............. SUCCESS (4.088s)

      ModeShape S-RAMP Sequencer ........................ SUCCESS (1.315s)

      ModeShape Teiid Sequencer ......................... SUCCESS (16.634s)

      ModeShape Text File Sequencer ..................... SUCCESS (3.419s)

      ModeShape XML Sequencer ........................... SUCCESS (4.273s)

      ModeShape XSD Sequencer ........................... FAILURE (6.518s)

      ModeShape WSDL Sequencer .......................... SKIPPED

      ModeShape ZIP Sequencer ........................... SUCCESS (2.281s)

      ModeShape DDL Sequencer ........................... SUCCESS (45.694s)

      ModeShape Connector to Disk-Based Storage ......... SUCCESS (3.673s)

      ModeShape Connector to a local file system ........ SUCCESS (6.711s)

      ModeShape Connector to JBoss Infinispan ........... FAILURE (7.406s)

      ModeShape Connector to JBoss Cache ................ SUCCESS (6.335s)

      ModeShape Connector to SVN ........................ SUCCESS (19.981s)

      ModeShape Connector to JCR ........................ SUCCESS (8.740s)

      ModeShape Connector to JPA Persistence Store ...... SUCCESS (48.538s)

      ModeShape Connector to JDBC Schemas ............... SUCCESS (11.409s)

      ModeShape Aperture MIME-type detector ............. FAILURE (2.534s)

      ModeShape Tika-based text extractor ............... SUCCESS (5.330s)

      ModeShape JCR Web Library ......................... SUCCESS (2.548s)

      ModeShape JCR REST Library ........................ FAILURE (5.550s)

      ModeShape JCR REST Servlet ........................ SKIPPED

      ModeShape JCR REST Client ......................... SKIPPED

      ModeShape JCR WebDAV Library ...................... SKIPPED

      ModeShape JCR WebDAV Servlet ...................... SKIPPED

      ModeShape Web Components .......................... SUCCESS (0.132s)

      ModeShape JPA Connector DDL Generator ............. SUCCESS (3.189s)

      ModeShape JDBC Driver (Local) ..................... SUCCESS (13.544s)

      ModeShape JDBC Driver ............................. SKIPPED

      ModeShape Unit Test Framework ..................... SUCCESS (6.285s)

      ModeShape Service Deployment for JBoss AS ......... SKIPPED

      ModeShape RHQ Console for JBoss AS ................ SKIPPED

      ModeShape JCR REST Servlet Deployment for JBoss AS  SKIPPED

      ModeShape JCR WebDAV Servlet Deployment for JBoss AS  SKIPPED

      ModeShape JBoss Deployment Components ............. SKIPPED

      ------------------------------------------------------------------------

      BUILD FAILURE

      ------------------------------------------------------------------------

      Total time: 7:22.043s

      Finished at: Mon Aug 29 18:00:19 SGT 2011

      Final Memory: 56M/165M

      ------------------------------------------------------------------------

      Errors: Failed to execute goal on project modeshape-sequencer-xsd: Could not resolve dependencies for project org.modeshape:modeshape-sequencer-xsd:ja

      r:2.6-SNAPSHOT: The following artifacts could not be resolved: org.eclipse.emf:common:jar:2.4.0, org.eclipse.emf:ecore:jar:2.4.2, org.eclipse.emf:ecor

      e-xmi:jar:2.4.1: Could not find artifact org.eclipse.emf:common:jar:2.4.0 in central (http://repo1.maven.org/maven2) -> (Help 1)

      Errors: Failed to execute goal on project modeshape-connector-infinispan: Could not resolve dependencies for project org.modeshape:modeshape-connector

      -infinispan:jar:2.6-SNAPSHOT: The following artifacts could not be resolved: org.infinispan:infinispan-core:jar:4.2.1.FINAL, org.infinispan:infinispan

      -client-hotrod:jar:4.2.1.FINAL, org.infinispan:infinispan-client-hotrod:jar:tests:4.2.1.FINAL, org.infinispan:infinispan-server-hotrod:jar:tests:4.2.1

      .FINAL, org.infinispan:infinispan-server-hotrod:jar:4.2.1.FINAL: Could not find artifact org.infinispan:infinispan-core:jar:4.2.1.FINAL in central (ht

      tp://repo1.maven.org/maven2) -> (Help 1)

      Errors: Failed to execute goal on project modeshape-mimetype-detector-aperture: Could not resolve dependencies for project org.modeshape:modeshape-mim

      etype-detector-aperture:jar:2.6-SNAPSHOT: Could not find artifact org.semanticdesktop:aperture:jar:1.1.0.Beta1 in central (http://repo1.maven.org/mave

      n2) -> (Help 1)

      Errors: Failed to execute goal on project modeshape-web-jcr-rest: Could not resolve dependencies for project org.modeshape:modeshape-web-jcr-rest:jar:

      2.6-SNAPSHOT: The following artifacts could not be resolved: org.jboss.resteasy:resteasy-jaxrs:jar:1.2.1.GA, org.jboss.resteasy:resteasy-jaxb-provider

      :jar:1.2.1.GA, org.jboss.resteasy:resteasy-jettison-provider:jar:1.2.1.GA: Could not find artifact org.jboss.resteasy:resteasy-jaxrs:jar:1.2.1.GA in c

      entral (http://repo1.maven.org/maven2) -> (Help 1)

      (ERROR)

      Errors: To see the full stack trace of the errors, re-run Maven with the -e switch.

      Errors: Re-run Maven using the -X switch to enable full debug logging.

      (ERROR)

      Errors: For more information about the errors and possible solutions, please read the following articles:

      Errors: (Help 1) http://cwiki.apache.org/confluence/display/MAVEN/DependencyResolutionException

      (ERROR)

      Errors: After correcting the problems, you can resume the build with the command

      Errors:   mvn <goals> -rf :modeshape-sequencer-xsd