0 Replies Latest reply on Jan 16, 2012 2:58 AM by Paweł Kubica

    Building AS7

    Paweł Kubica Newbie

      I have problem with building AS7.

      [INFO] JBoss Application Server: Arquillian Common ....... SUCCESS [7.425s] 
      [INFO] JBoss Application Server: Arquillian Protocol JMX . SUCCESS [6.269s]
      [INFO] JBoss Application Server: Arquillian Managed Container  FAILURE [1:15.138s]
      [INFO] JBoss Application Server: Arquillian Remote Container  SKIPPED
      [INFO] JBoss Application Server: Arquillian TestNG Integration  SKIPPED 

      It stop build on Arquillian Managed Container tests:

       

      -------------------------------------------------------
      T E S T S
      -------------------------------------------------------
      Forking command line: /bin/sh -c cd /opt/jboss-as/arquillian/container-managed && /opt/sun-jdk-1.6.0.29/jre/bin/java -jar /opt/jboss-as/arquillian/container-managed/target/surefire/surefirebooter1451506914025761381.jar /opt/jboss-as/arquillian/container-managed/target/surefire/surefire4562649437214461632tmp /opt/jboss-as/arquillian/container-managed/target/surefire/surefire763432821862937573tmp
      Running org.jboss.as.arquillian.container.managed.ManagedAsClientEnterpriseArchiveServletTestCase
      Tests run: 1, Failures: 0, Errors: 1, Skipped: 0, Time elapsed: 68.244 sec <<< FAILURE!
      Running org.jboss.as.arquillian.container.managed.IntegrationTestCase Tests run: 1, Failures: 0, Errors: 1, Skipped: 0, Time elapsed: 0.044 sec <<< FAILURE!
      Running org.jboss.as.arquillian.container.managed.ManagedInContainerTestCase Tests run: 1, Failures: 0, Errors: 1, Skipped: 0, Time elapsed: 0.014 sec <<< FAILURE!
      Running org.jboss.as.arquillian.container.managed.ManagedAsClientWebArchiveServletTestCase Tests run: 1, Failures: 0, Errors: 1, Skipped: 0, Time elapsed: 0.01 sec <<< FAILURE!
      Running org.jboss.as.arquillian.container.managed.ManagedAsClientTestCase Tests run: 1, Failures: 0, Errors: 0, Skipped: 1, Time elapsed: 0.005 sec

       

      Here are reports from test that don't pass:

      http://pastebin.com/iC4TXUqQ

      http://pastebin.com/PBCVjhsR

       

      Is it normal or I'm doing something wrong?

       

      Thanks in advance.