7 Replies Latest reply on Mar 6, 2013 10:18 AM by Bartosz Majsak

    Arquillian Persistence Extension exception in beforeCompletion(), database table is not cleaned after test

    Marco Cella Newbie

      Dear all,

       

      I have noticed a strange behaviour on executing some test methods, see attached maven project.

       

      The test class method try to merge an entity object Not null field with a null value.

       

      The following exception is thrown on client side:

       

      Arquillian archive class it.arquilliantest.jpa.ArchiveFactory Database Type: mysql
      Tests run: 1, Failures: 1, Errors: 0, Skipped: 0, Time elapsed: 36.388 sec <<< FAILURE!
      
      Results :
      
      Failed tests: 
        shouldNotEditActionOnNullNameField(it.arquilliantest.jpa.controller.ActionJpaControllerTest): Should have throws javax.validation.ConstraintViolationException: validation failed for classes [it.arquillian.moduleTest.jpa.entity.Action] during update time for groups [javax.validation.groups.Default, ].
      No exception was thown instead.
      
      Tests run: 1, Failures: 1, Errors: 0, Skipped: 0
      

       

      Server log shows the following exception:

       

      [#|2013-02-13T10:36:31.064+0100|INFO|glassfish3.1.2|javax.enterprise.system.container.web.com.sun.enterprise.web|_ThreadID=19;_ThreadName=Thread-2;|WEB0671: Loading application [ArquillianTestArchive] at [/ArquillianTestArchive]|#]
      
      [#|2013-02-13T10:36:31.102+0100|INFO|glassfish3.1.2|javax.enterprise.system.tools.admin.org.glassfish.deployment.admin|_ThreadID=19;_ThreadName=Thread-2;|ArquillianTestArchive was successfully deployed in 2,022 milliseconds.|#]
      
      [#|2013-02-13T10:36:32.116+0100|WARNING|glassfish3.1.2|javax.enterprise.resource.jta.com.sun.enterprise.transaction|_ThreadID=20;_ThreadName=Thread-2;|DTX5014: Caught exception in beforeCompletion() callback:
      javax.persistence.PersistenceException: javax.validation.ConstraintViolationException: validation failed for classes [it.arquilliantest.jpa.entity.Action] during update time for groups [javax.validation.groups.Default, ]
          at org.hibernate.ejb.AbstractEntityManagerImpl$1.beforeCompletion(AbstractEntityManagerImpl.java:1071)
          at com.sun.enterprise.transaction.JavaEETransactionImpl.commit(JavaEETransactionImpl.java:435)
          at com.sun.enterprise.transaction.JavaEETransactionManagerSimplified.commit(JavaEETransactionManagerSimplified.java:855)
          at com.sun.enterprise.transaction.UserTransactionImpl.commit(UserTransactionImpl.java:208)
          at org.jboss.arquillian.persistence.core.transaction.TestTransactionWrapper.afterTest(TestTransactionWrapper.java:70)
          at sun.reflect.NativeMethodAccessorImpl.invoke0(Native Method)
          at sun.reflect.NativeMethodAccessorImpl.invoke(NativeMethodAccessorImpl.java:39)
          at sun.reflect.DelegatingMethodAccessorImpl.invoke(DelegatingMethodAccessorImpl.java:25)
          at java.lang.reflect.Method.invoke(Method.java:597)
          at org.jboss.arquillian.core.impl.ObserverImpl.invoke(ObserverImpl.java:90)
          at org.jboss.arquillian.core.impl.EventContextImpl.invokeObservers(EventContextImpl.java:99)
          at org.jboss.arquillian.core.impl.EventContextImpl.proceed(EventContextImpl.java:81)
          at org.jboss.arquillian.test.impl.TestContextHandler.createTestContext(TestContextHandler.java:89)
          at sun.reflect.NativeMethodAccessorImpl.invoke0(Native Method)
          at sun.reflect.NativeMethodAccessorImpl.invoke(NativeMethodAccessorImpl.java:39)
          at sun.reflect.DelegatingMethodAccessorImpl.invoke(DelegatingMethodAccessorImpl.java:25)
          at java.lang.reflect.Method.invoke(Method.java:597)
          at org.jboss.arquillian.core.impl.ObserverImpl.invoke(ObserverImpl.java:90)
          at org.jboss.arquillian.core.impl.EventContextImpl.proceed(EventContextImpl.java:88)
          at org.jboss.arquillian.test.impl.TestContextHandler.createClassContext(TestContextHandler.java:75)
          at sun.reflect.NativeMethodAccessorImpl.invoke0(Native Method)
          at sun.reflect.NativeMethodAccessorImpl.invoke(NativeMethodAccessorImpl.java:39)
          at sun.reflect.DelegatingMethodAccessorImpl.invoke(DelegatingMethodAccessorImpl.java:25)
          at java.lang.reflect.Method.invoke(Method.java:597)
          at org.jboss.arquillian.core.impl.ObserverImpl.invoke(ObserverImpl.java:90)
          at org.jboss.arquillian.core.impl.EventContextImpl.proceed(EventContextImpl.java:88)
          at org.jboss.arquillian.test.impl.TestContextHandler.createSuiteContext(TestContextHandler.java:60)
          at sun.reflect.NativeMethodAccessorImpl.invoke0(Native Method)
          at sun.reflect.NativeMethodAccessorImpl.invoke(NativeMethodAccessorImpl.java:39)
          at sun.reflect.DelegatingMethodAccessorImpl.invoke(DelegatingMethodAccessorImpl.java:25)
          at java.lang.reflect.Method.invoke(Method.java:597)
          at org.jboss.arquillian.core.impl.ObserverImpl.invoke(ObserverImpl.java:90)
          at org.jboss.arquillian.core.impl.EventContextImpl.proceed(EventContextImpl.java:88)
          at org.jboss.arquillian.core.impl.ManagerImpl.fire(ManagerImpl.java:135)
          at org.jboss.arquillian.core.impl.ManagerImpl.fire(ManagerImpl.java:115)
          at org.jboss.arquillian.core.impl.EventImpl.fire(EventImpl.java:67)
          at org.jboss.arquillian.persistence.core.lifecycle.TransactionHandler.endTransactionAfterTest(TransactionHandler.java:54)
          at sun.reflect.NativeMethodAccessorImpl.invoke0(Native Method)
          at sun.reflect.NativeMethodAccessorImpl.invoke(NativeMethodAccessorImpl.java:39)
          at sun.reflect.DelegatingMethodAccessorImpl.invoke(DelegatingMethodAccessorImpl.java:25)
          at java.lang.reflect.Method.invoke(Method.java:597)
          at org.jboss.arquillian.core.impl.ObserverImpl.invoke(ObserverImpl.java:90)
          at org.jboss.arquillian.core.impl.EventContextImpl.invokeObservers(EventContextImpl.java:99)
          at org.jboss.arquillian.core.impl.EventContextImpl.proceed(EventContextImpl.java:81)
          at org.jboss.arquillian.test.impl.TestContextHandler.createTestContext(TestContextHandler.java:89)
          at sun.reflect.NativeMethodAccessorImpl.invoke0(Native Method)
          at sun.reflect.NativeMethodAccessorImpl.invoke(NativeMethodAccessorImpl.java:39)
          at sun.reflect.DelegatingMethodAccessorImpl.invoke(DelegatingMethodAccessorImpl.java:25)
          at java.lang.reflect.Method.invoke(Method.java:597)
          at org.jboss.arquillian.core.impl.ObserverImpl.invoke(ObserverImpl.java:90)
          at org.jboss.arquillian.core.impl.EventContextImpl.proceed(EventContextImpl.java:88)
          at org.jboss.arquillian.test.impl.TestContextHandler.createClassContext(TestContextHandler.java:75)
          at sun.reflect.NativeMethodAccessorImpl.invoke0(Native Method)
          at sun.reflect.NativeMethodAccessorImpl.invoke(NativeMethodAccessorImpl.java:39)
          at sun.reflect.DelegatingMethodAccessorImpl.invoke(DelegatingMethodAccessorImpl.java:25)
          at java.lang.reflect.Method.invoke(Method.java:597)
          at org.jboss.arquillian.core.impl.ObserverImpl.invoke(ObserverImpl.java:90)
          at org.jboss.arquillian.core.impl.EventContextImpl.proceed(EventContextImpl.java:88)
          at org.jboss.arquillian.test.impl.TestContextHandler.createSuiteContext(TestContextHandler.java:60)
          at sun.reflect.NativeMethodAccessorImpl.invoke0(Native Method)
          at sun.reflect.NativeMethodAccessorImpl.invoke(NativeMethodAccessorImpl.java:39)
          at sun.reflect.DelegatingMethodAccessorImpl.invoke(DelegatingMethodAccessorImpl.java:25)
          at java.lang.reflect.Method.invoke(Method.java:597)
          at org.jboss.arquillian.core.impl.ObserverImpl.invoke(ObserverImpl.java:90)
          at org.jboss.arquillian.core.impl.EventContextImpl.proceed(EventContextImpl.java:88)
          at org.jboss.arquillian.persistence.dbunit.DBUnitPersistenceTestLifecycleHandler.closeConnection(DBUnitPersistenceTestLifecycleHandler.java:113)
          at sun.reflect.NativeMethodAccessorImpl.invoke0(Native Method)
          at sun.reflect.NativeMethodAccessorImpl.invoke(NativeMethodAccessorImpl.java:39)
          at sun.reflect.DelegatingMethodAccessorImpl.invoke(DelegatingMethodAccessorImpl.java:25)
          at java.lang.reflect.Method.invoke(Method.java:597)
          at org.jboss.arquillian.core.impl.ObserverImpl.invoke(ObserverImpl.java:90)
          at org.jboss.arquillian.core.impl.EventContextImpl.proceed(EventContextImpl.java:88)
          at org.jboss.arquillian.persistence.core.lifecycle.ErrorCollectorHandler.collectErrors(ErrorCollectorHandler.java:46)
          at sun.reflect.NativeMethodAccessorImpl.invoke0(Native Method)
          at sun.reflect.NativeMethodAccessorImpl.invoke(NativeMethodAccessorImpl.java:39)
          at sun.reflect.DelegatingMethodAccessorImpl.invoke(DelegatingMethodAccessorImpl.java:25)
          at java.lang.reflect.Method.invoke(Method.java:597)
          at org.jboss.arquillian.core.impl.ObserverImpl.invoke(ObserverImpl.java:90)
          at org.jboss.arquillian.core.impl.EventContextImpl.proceed(EventContextImpl.java:88)
          at org.jboss.arquillian.core.impl.ManagerImpl.fire(ManagerImpl.java:135)
          at org.jboss.arquillian.core.impl.ManagerImpl.fire(ManagerImpl.java:115)
          at org.jboss.arquillian.core.impl.EventImpl.fire(EventImpl.java:67)
          at org.jboss.arquillian.persistence.core.lifecycle.PersistenceTestTrigger.afterTest(PersistenceTestTrigger.java:113)
          at sun.reflect.NativeMethodAccessorImpl.invoke0(Native Method)
          at sun.reflect.NativeMethodAccessorImpl.invoke(NativeMethodAccessorImpl.java:39)
          at sun.reflect.DelegatingMethodAccessorImpl.invoke(DelegatingMethodAccessorImpl.java:25)
          at java.lang.reflect.Method.invoke(Method.java:597)
          at org.jboss.arquillian.core.impl.ObserverImpl.invoke(ObserverImpl.java:90)
          at org.jboss.arquillian.core.impl.EventContextImpl.invokeObservers(EventContextImpl.java:99)
          at org.jboss.arquillian.core.impl.EventContextImpl.proceed(EventContextImpl.java:81)
          at org.jboss.arquillian.testenricher.cdi.CreationalContextDestroyer.destory(CreationalContextDestroyer.java:44)
          at sun.reflect.NativeMethodAccessorImpl.invoke0(Native Method)
          at sun.reflect.NativeMethodAccessorImpl.invoke(NativeMethodAccessorImpl.java:39)
          at sun.reflect.DelegatingMethodAccessorImpl.invoke(DelegatingMethodAccessorImpl.java:25)
          at java.lang.reflect.Method.invoke(Method.java:597)
          at org.jboss.arquillian.core.impl.ObserverImpl.invoke(ObserverImpl.java:90)
          at org.jboss.arquillian.core.impl.EventContextImpl.proceed(EventContextImpl.java:88)
          at org.jboss.arquillian.test.impl.TestContextHandler.createTestContext(TestContextHandler.java:89)
          at sun.reflect.NativeMethodAccessorImpl.invoke0(Native Method)
          at sun.reflect.NativeMethodAccessorImpl.invoke(NativeMethodAccessorImpl.java:39)
          at sun.reflect.DelegatingMethodAccessorImpl.invoke(DelegatingMethodAccessorImpl.java:25)
          at java.lang.reflect.Method.invoke(Method.java:597)
          at org.jboss.arquillian.core.impl.ObserverImpl.invoke(ObserverImpl.java:90)
          at org.jboss.arquillian.core.impl.EventContextImpl.proceed(EventContextImpl.java:88)
          at org.jboss.arquillian.test.impl.TestContextHandler.createClassContext(TestContextHandler.java:75)
          at sun.reflect.NativeMethodAccessorImpl.invoke0(Native Method)
          at sun.reflect.NativeMethodAccessorImpl.invoke(NativeMethodAccessorImpl.java:39)
          at sun.reflect.DelegatingMethodAccessorImpl.invoke(DelegatingMethodAccessorImpl.java:25)
          at java.lang.reflect.Method.invoke(Method.java:597)
          at org.jboss.arquillian.core.impl.ObserverImpl.invoke(ObserverImpl.java:90)
          at org.jboss.arquillian.core.impl.EventContextImpl.proceed(EventContextImpl.java:88)
          at org.jboss.arquillian.test.impl.TestContextHandler.createSuiteContext(TestContextHandler.java:60)
          at sun.reflect.NativeMethodAccessorImpl.invoke0(Native Method)
          at sun.reflect.NativeMethodAccessorImpl.invoke(NativeMethodAccessorImpl.java:39)
          at sun.reflect.DelegatingMethodAccessorImpl.invoke(DelegatingMethodAccessorImpl.java:25)
          at java.lang.reflect.Method.invoke(Method.java:597)
          at org.jboss.arquillian.core.impl.ObserverImpl.invoke(ObserverImpl.java:90)
          at org.jboss.arquillian.core.impl.EventContextImpl.proceed(EventContextImpl.java:88)
          at org.jboss.arquillian.core.impl.ManagerImpl.fire(ManagerImpl.java:135)
          at org.jboss.arquillian.core.impl.ManagerImpl.fire(ManagerImpl.java:115)
          at org.jboss.arquillian.test.impl.EventTestRunnerAdaptor.after(EventTestRunnerAdaptor.java:103)
          at org.jboss.arquillian.junit.Arquillian$5$1.evaluate(Arquillian.java:245)
          at org.jboss.arquillian.junit.Arquillian.multiExecute(Arquillian.java:314)
          at org.jboss.arquillian.junit.Arquillian.access$100(Arquillian.java:46)
          at org.jboss.arquillian.junit.Arquillian$5.evaluate(Arquillian.java:240)
          at org.junit.runners.ParentRunner.runLeaf(ParentRunner.java:263)
          at org.junit.runners.BlockJUnit4ClassRunner.runChild(BlockJUnit4ClassRunner.java:68)
          at org.junit.runners.BlockJUnit4ClassRunner.runChild(BlockJUnit4ClassRunner.java:47)
          at org.junit.runners.ParentRunner$3.run(ParentRunner.java:231)
          at org.junit.runners.ParentRunner$1.schedule(ParentRunner.java:60)
          at org.junit.runners.ParentRunner.runChildren(ParentRunner.java:229)
          at org.junit.runners.ParentRunner.access$000(ParentRunner.java:50)
          at org.junit.runners.ParentRunner$2.evaluate(ParentRunner.java:222)
          at org.jboss.arquillian.junit.Arquillian$2.evaluate(Arquillian.java:185)
          at org.jboss.arquillian.junit.Arquillian.multiExecute(Arquillian.java:314)
          at org.jboss.arquillian.junit.Arquillian.access$100(Arquillian.java:46)
          at org.jboss.arquillian.junit.Arquillian$3.evaluate(Arquillian.java:199)
          at org.junit.runners.ParentRunner.run(ParentRunner.java:300)
          at org.jboss.arquillian.junit.Arquillian.run(Arquillian.java:147)
          at org.junit.runner.JUnitCore.run(JUnitCore.java:157)
          at org.junit.runner.JUnitCore.run(JUnitCore.java:136)
          at org.jboss.arquillian.junit.container.JUnitTestRunner.execute(JUnitTestRunner.java:65)
          at org.jboss.arquillian.protocol.servlet.runner.ServletTestRunner.executeTest(ServletTestRunner.java:160)
          at org.jboss.arquillian.protocol.servlet.runner.ServletTestRunner.execute(ServletTestRunner.java:126)
          at org.jboss.arquillian.protocol.servlet.runner.ServletTestRunner.doGet(ServletTestRunner.java:90)
          at javax.servlet.http.HttpServlet.service(HttpServlet.java:668)
          at javax.servlet.http.HttpServlet.service(HttpServlet.java:770)
          at org.apache.catalina.core.StandardWrapper.service(StandardWrapper.java:1542)
          at org.apache.catalina.core.StandardWrapperValve.invoke(StandardWrapperValve.java:281)
          at org.apache.catalina.core.StandardContextValve.invoke(StandardContextValve.java:175)
          at org.apache.catalina.core.StandardPipeline.doInvoke(StandardPipeline.java:655)
          at org.apache.catalina.core.StandardPipeline.invoke(StandardPipeline.java:595)
          at org.apache.catalina.core.StandardHostValve.invoke(StandardHostValve.java:161)
          at org.apache.catalina.connector.CoyoteAdapter.doService(CoyoteAdapter.java:331)
          at org.apache.catalina.connector.CoyoteAdapter.service(CoyoteAdapter.java:231)
          at com.sun.enterprise.v3.services.impl.ContainerMapper$AdapterCallable.call(ContainerMapper.java:317)
          at com.sun.enterprise.v3.services.impl.ContainerMapper.service(ContainerMapper.java:195)
          at com.sun.grizzly.http.ProcessorTask.invokeAdapter(ProcessorTask.java:849)
          at com.sun.grizzly.http.ProcessorTask.doProcess(ProcessorTask.java:746)
          at com.sun.grizzly.http.ProcessorTask.process(ProcessorTask.java:1045)
          at com.sun.grizzly.http.DefaultProtocolFilter.execute(DefaultProtocolFilter.java:228)
          at com.sun.grizzly.DefaultProtocolChain.executeProtocolFilter(DefaultProtocolChain.java:137)
          at com.sun.grizzly.DefaultProtocolChain.execute(DefaultProtocolChain.java:104)
          at com.sun.grizzly.DefaultProtocolChain.execute(DefaultProtocolChain.java:90)
          at com.sun.grizzly.http.HttpProtocolChain.execute(HttpProtocolChain.java:79)
          at com.sun.grizzly.ProtocolChainContextTask.doCall(ProtocolChainContextTask.java:54)
          at com.sun.grizzly.SelectionKeyContextTask.call(SelectionKeyContextTask.java:59)
          at com.sun.grizzly.ContextTask.run(ContextTask.java:71)
          at com.sun.grizzly.util.AbstractThreadPool$Worker.doWork(AbstractThreadPool.java:532)
          at com.sun.grizzly.util.AbstractThreadPool$Worker.run(AbstractThreadPool.java:513)
          at java.lang.Thread.run(Thread.java:662)
      Caused by: javax.validation.ConstraintViolationException: validation failed for classes [it.arquilliantest.jpa.entity.Action] during update time for groups [javax.validation.groups.Default, ]
          at org.hibernate.cfg.beanvalidation.BeanValidationEventListener.validate(BeanValidationEventListener.java:132)
          at org.hibernate.cfg.beanvalidation.BeanValidationEventListener.onPreUpdate(BeanValidationEventListener.java:79)
          at org.hibernate.action.EntityUpdateAction.preUpdate(EntityUpdateAction.java:236)
          at org.hibernate.action.EntityUpdateAction.execute(EntityUpdateAction.java:87)
          at org.hibernate.engine.ActionQueue.execute(ActionQueue.java:267)
          at org.hibernate.engine.ActionQueue.executeActions(ActionQueue.java:259)
          at org.hibernate.engine.ActionQueue.executeActions(ActionQueue.java:179)
          at org.hibernate.event.def.AbstractFlushingEventListener.performExecutions(AbstractFlushingEventListener.java:321)
          at org.hibernate.event.def.DefaultFlushEventListener.onFlush(DefaultFlushEventListener.java:51)
          at org.hibernate.impl.SessionImpl.flush(SessionImpl.java:1206)
          at org.hibernate.impl.SessionImpl.managedFlush(SessionImpl.java:375)
          at org.hibernate.ejb.AbstractEntityManagerImpl$1.beforeCompletion(AbstractEntityManagerImpl.java:1057)
          ... 170 more
      |#]
      

       

      After that, the comparison of database state to dataset xml file is not executed (@ShouldMatchDataSet annotation) and the database table is not cleaned up after test execution (@Cleanup annotation).

       

      Update:

       

      disable hibernate JPA2 Bean validation (add <validation-mode>NONE</validation-mode> in persistence.xml resource test file)

       

      The following exception is thrown on client side:

       

      Arquillian archive class it.arquilliantest.jpa.ArchiveFactory Database Type: mysql
      Tests run: 1, Failures: 1, Errors: 0, Skipped: 0, Time elapsed: 35.949 sec <<< FAILURE!
      
      Results :
      
      Failed tests: 
        shouldNotEditActionOnNullNameField(it.arquilliantest.jpa.controller.ActionJpaControllerTest): Should have throws javax.persistence.PersistenceException: org.hibernate.exception.ConstraintViolationException: Could not execute JDBC batch update.
      No exception was thown instead.
      
      Tests run: 1, Failures: 1, Errors: 0, Skipped: 0
      

       

      Server log shows the following exception:

       

      [#|2013-03-06T10:51:04.287+0100|INFO|glassfish3.1.2|javax.enterprise.system.std.com.sun.enterprise.server.logging|_ThreadID=19;_ThreadName=Thread-2;|2013-03-06 10:51:04,287 [http-thread-pool-10080(1)] ERROR org.hibernate.util.JDBCExceptionReporter - Column 'name' cannot be null
      |#]
      
      [#|2013-03-06T10:51:04.291+0100|INFO|glassfish3.1.2|javax.enterprise.system.std.com.sun.enterprise.server.logging|_ThreadID=19;_ThreadName=Thread-2;|2013-03-06 10:51:04,288 [http-thread-pool-10080(1)] ERROR org.hibernate.event.def.AbstractFlushingEventListener - Could not synchronize database state with session
      org.hibernate.exception.ConstraintViolationException: Could not execute JDBC batch update
          at org.hibernate.exception.SQLStateConverter.convert(SQLStateConverter.java:96)
          at org.hibernate.exception.JDBCExceptionHelper.convert(JDBCExceptionHelper.java:66)
          at org.hibernate.jdbc.AbstractBatcher.executeBatch(AbstractBatcher.java:275)
          at org.hibernate.engine.ActionQueue.executeActions(ActionQueue.java:262)
          at org.hibernate.engine.ActionQueue.executeActions(ActionQueue.java:179)
          at org.hibernate.event.def.AbstractFlushingEventListener.performExecutions(AbstractFlushingEventListener.java:321)
          at org.hibernate.event.def.DefaultFlushEventListener.onFlush(DefaultFlushEventListener.java:51)
          at org.hibernate.impl.SessionImpl.flush(SessionImpl.java:1206)
          at org.hibernate.impl.SessionImpl.managedFlush(SessionImpl.java:375)
          at org.hibernate.ejb.AbstractEntityManagerImpl$1.beforeCompletion(AbstractEntityManagerImpl.java:1057)
          at com.sun.enterprise.transaction.JavaEETransactionImpl.commit(JavaEETransactionImpl.java:435)
          at com.sun.enterprise.transaction.JavaEETransactionManagerSimplified.commit(JavaEETransactionManagerSimplified.java:855)
          at com.sun.enterprise.transaction.UserTransactionImpl.commit(UserTransactionImpl.java:208)
          at org.jboss.arquillian.persistence.core.transaction.TestTransactionWrapper.afterTest(TestTransactionWrapper.java:70)
          at sun.reflect.NativeMethodAccessorImpl.invoke0(Native Method)
          at sun.reflect.NativeMethodAccessorImpl.invoke(NativeMethodAccessorImpl.java:39)
          at sun.reflect.DelegatingMethodAccessorImpl.invoke(DelegatingMethodAccessorImpl.java:25)
          at java.lang.reflect.Method.invoke(Method.java:597)
          at org.jboss.arquillian.core.impl.ObserverImpl.invoke(ObserverImpl.java:90)
          at org.jboss.arquillian.core.impl.EventContextImpl.invokeObservers(EventContextImpl.java:99)
          at org.jboss.arquillian.core.impl.EventContextImpl.proceed(EventContextImpl.java:81)
          at org.jboss.arquillian.test.impl.TestContextHandler.createTestContext(TestContextHandler.java:89)
          at sun.reflect.NativeMethodAccessorImpl.invoke0(Native Method)
          at sun.reflect.NativeMethodAccessorImpl.invoke(NativeMethodAccessorImpl.java:39)
          at sun.reflect.DelegatingMethodAccessorImpl.invoke(DelegatingMethodAccessorImpl.java:25)
          at java.lang.reflect.Method.invoke(Method.java:597)
          at org.jboss.arquillian.core.impl.ObserverImpl.invoke(ObserverImpl.java:90)
          at org.jboss.arquillian.core.impl.EventContextImpl.proceed(EventContextImpl.java:88)
          at org.jboss.arquillian.test.impl.TestContextHandler.createClassContext(TestContextHandler.java:75)
          at sun.reflect.NativeMethodAccessorImpl.invoke0(Native Method)
          at sun.reflect.NativeMethodAccessorImpl.invoke(NativeMethodAccessorImpl.java:39)
          at sun.reflect.DelegatingMethodAccessorImpl.invoke(DelegatingMethodAccessorImpl.java:25)
          at java.lang.reflect.Method.invoke(Method.java:597)
          at org.jboss.arquillian.core.impl.ObserverImpl.invoke(ObserverImpl.java:90)
          at org.jboss.arquillian.core.impl.EventContextImpl.proceed(EventContextImpl.java:88)
          at org.jboss.arquillian.test.impl.TestContextHandler.createSuiteContext(TestContextHandler.java:60)
          at sun.reflect.NativeMethodAccessorImpl.invoke0(Native Method)
          at sun.reflect.NativeMethodAccessorImpl.invoke(NativeMethodAccessorImpl.java:39)
          at sun.reflect.DelegatingMethodAccessorImpl.invoke(DelegatingMethodAccessorImpl.java:25)
          at java.lang.reflect.Method.invoke(Method.java:597)
          at org.jboss.arquillian.core.impl.ObserverImpl.invoke(ObserverImpl.java:90)
          at org.jboss.arquillian.core.impl.EventContextImpl.proceed(EventContextImpl.java:88)
          at org.jboss.arquillian.core.impl.ManagerImpl.fire(ManagerImpl.java:135)
          at org.jboss.arquillian.core.impl.ManagerImpl.fire(ManagerImpl.java:115)
          at org.jboss.arquillian.core.impl.EventImpl.fire(EventImpl.java:67)
          at org.jboss.arquillian.persistence.core.lifecycle.TransactionHandler.endTransactionAfterTest(TransactionHandler.java:54)
          at sun.reflect.NativeMethodAccessorImpl.invoke0(Native Method)
          at sun.reflect.NativeMethodAccessorImpl.invoke(NativeMethodAccessorImpl.java:39)
          at sun.reflect.DelegatingMethodAccessorImpl.invoke(DelegatingMethodAccessorImpl.java:25)
          at java.lang.reflect.Method.invoke(Method.java:597)
          at org.jboss.arquillian.core.impl.ObserverImpl.invoke(ObserverImpl.java:90)
          at org.jboss.arquillian.core.impl.EventContextImpl.invokeObservers(EventContextImpl.java:99)
          at org.jboss.arquillian.core.impl.EventContextImpl.proceed(EventContextImpl.java:81)
          at org.jboss.arquillian.test.impl.TestContextHandler.createTestContext(TestContextHandler.java:89)
          at sun.reflect.NativeMethodAccessorImpl.invoke0(Native Method)
          at sun.reflect.NativeMethodAccessorImpl.invoke(NativeMethodAccessorImpl.java:39)
          at sun.reflect.DelegatingMethodAccessorImpl.invoke(DelegatingMethodAccessorImpl.java:25)
          at java.lang.reflect.Method.invoke(Method.java:597)
          at org.jboss.arquillian.core.impl.ObserverImpl.invoke(ObserverImpl.java:90)
          at org.jboss.arquillian.core.impl.EventContextImpl.proceed(EventContextImpl.java:88)
          at org.jboss.arquillian.test.impl.TestContextHandler.createClassContext(TestContextHandler.java:75)
          at sun.reflect.NativeMethodAccessorImpl.invoke0(Native Method)
          at sun.reflect.NativeMethodAccessorImpl.invoke(NativeMethodAccessorImpl.java:39)
          at sun.reflect.DelegatingMethodAccessorImpl.invoke(DelegatingMethodAccessorImpl.java:25)
          at java.lang.reflect.Method.invoke(Method.java:597)
          at org.jboss.arquillian.core.impl.ObserverImpl.invoke(ObserverImpl.java:90)
          at org.jboss.arquillian.core.impl.EventContextImpl.proceed(EventContextImpl.java:88)
          at org.jboss.arquillian.test.impl.TestContextHandler.createSuiteContext(TestContextHandler.java:60)
          at sun.reflect.NativeMethodAccessorImpl.invoke0(Native Method)
          at sun.reflect.NativeMethodAccessorImpl.invoke(NativeMethodAccessorImpl.java:39)
          at sun.reflect.DelegatingMethodAccessorImpl.invoke(DelegatingMethodAccessorImpl.java:25)
          at java.lang.reflect.Method.invoke(Method.java:597)
          at org.jboss.arquillian.core.impl.ObserverImpl.invoke(ObserverImpl.java:90)
          at org.jboss.arquillian.core.impl.EventContextImpl.proceed(EventContextImpl.java:88)
          at org.jboss.arquillian.persistence.dbunit.DBUnitPersistenceTestLifecycleHandler.closeConnection(DBUnitPersistenceTestLifecycleHandler.java:113)
          at sun.reflect.NativeMethodAccessorImpl.invoke0(Native Method)
          at sun.reflect.NativeMethodAccessorImpl.invoke(NativeMethodAccessorImpl.java:39)
          at sun.reflect.DelegatingMethodAccessorImpl.invoke(DelegatingMethodAccessorImpl.java:25)
          at java.lang.reflect.Method.invoke(Method.java:597)
          at org.jboss.arquillian.core.impl.ObserverImpl.invoke(ObserverImpl.java:90)
          at org.jboss.arquillian.core.impl.EventContextImpl.proceed(EventContextImpl.java:88)
          at org.jboss.arquillian.persistence.core.lifecycle.ErrorCollectorHandler.collectErrors(ErrorCollectorHandler.java:46)
          at sun.reflect.NativeMethodAccessorImpl.invoke0(Native Method)
          at sun.reflect.NativeMethodAccessorImpl.invoke(NativeMethodAccessorImpl.java:39)
          at sun.reflect.DelegatingMethodAccessorImpl.invoke(DelegatingMethodAccessorImpl.java:25)
          at java.lang.reflect.Method.invoke(Method.java:597)
          at org.jboss.arquillian.core.impl.ObserverImpl.invoke(ObserverImpl.java:90)
          at org.jboss.arquillian.core.impl.EventContextImpl.proceed(EventContextImpl.java:88)
          at org.jboss.arquillian.core.impl.ManagerImpl.fire(ManagerImpl.java:135)
          at org.jboss.arquillian.core.impl.ManagerImpl.fire(ManagerImpl.java:115)
          at org.jboss.arquillian.core.impl.EventImpl.fire(EventImpl.java:67)
          at org.jboss.arquillian.persistence.core.lifecycle.PersistenceTestTrigger.afterTest(PersistenceTestTrigger.java:113)
          at sun.reflect.NativeMethodAccessorImpl.invoke0(Native Method)
          at sun.reflect.NativeMethodAccessorImpl.invoke(NativeMethodAccessorImpl.java:39)
          at sun.reflect.DelegatingMethodAccessorImpl.invoke(DelegatingMethodAccessorImpl.java:25)
          at java.lang.reflect.Method.invoke(Method.java:597)
          at org.jboss.arquillian.core.impl.ObserverImpl.invoke(ObserverImpl.java:90)
          at org.jboss.arquillian.core.impl.EventContextI|#]
      
      [#|2013-03-06T10:51:04.291+0100|INFO|glassfish3.1.2|javax.enterprise.system.std.com.sun.enterprise.server.logging|_ThreadID=19;_ThreadName=Thread-2;|mpl.invokeObservers(EventContextImpl.java:99)
          at org.jboss.arquillian.core.impl.EventContextImpl.proceed(EventContextImpl.java:81)
          at org.jboss.arquillian.testenricher.cdi.CreationalContextDestroyer.destory(CreationalContextDestroyer.java:44)
          at sun.reflect.NativeMethodAccessorImpl.invoke0(Native Method)
          at sun.reflect.NativeMethodAccessorImpl.invoke(NativeMethodAccessorImpl.java:39)
          at sun.reflect.DelegatingMethodAccessorImpl.invoke(DelegatingMethodAccessorImpl.java:25)
          at java.lang.reflect.Method.invoke(Method.java:597)
          at org.jboss.arquillian.core.impl.ObserverImpl.invoke(ObserverImpl.java:90)
          at org.jboss.arquillian.core.impl.EventContextImpl.proceed(EventContextImpl.java:88)
          at org.jboss.arquillian.test.impl.TestContextHandler.createTestContext(TestContextHandler.java:89)
          at sun.reflect.NativeMethodAccessorImpl.invoke0(Native Method)
          at sun.reflect.NativeMethodAccessorImpl.invoke(NativeMethodAccessorImpl.java:39)
          at sun.reflect.DelegatingMethodAccessorImpl.invoke(DelegatingMethodAccessorImpl.java:25)
          at java.lang.reflect.Method.invoke(Method.java:597)
          at org.jboss.arquillian.core.impl.ObserverImpl.invoke(ObserverImpl.java:90)
          at org.jboss.arquillian.core.impl.EventContextImpl.proceed(EventContextImpl.java:88)
          at org.jboss.arquillian.test.impl.TestContextHandler.createClassContext(TestContextHandler.java:75)
          at sun.reflect.NativeMethodAccessorImpl.invoke0(Native Method)
          at sun.reflect.NativeMethodAccessorImpl.invoke(NativeMethodAccessorImpl.java:39)
          at sun.reflect.DelegatingMethodAccessorImpl.invoke(DelegatingMethodAccessorImpl.java:25)
          at java.lang.reflect.Method.invoke(Method.java:597)
          at org.jboss.arquillian.core.impl.ObserverImpl.invoke(ObserverImpl.java:90)
          at org.jboss.arquillian.core.impl.EventContextImpl.proceed(EventContextImpl.java:88)
          at org.jboss.arquillian.test.impl.TestContextHandler.createSuiteContext(TestContextHandler.java:60)
          at sun.reflect.NativeMethodAccessorImpl.invoke0(Native Method)
          at sun.reflect.NativeMethodAccessorImpl.invoke(NativeMethodAccessorImpl.java:39)
          at sun.reflect.DelegatingMethodAccessorImpl.invoke(DelegatingMethodAccessorImpl.java:25)
          at java.lang.reflect.Method.invoke(Method.java:597)
          at org.jboss.arquillian.core.impl.ObserverImpl.invoke(ObserverImpl.java:90)
          at org.jboss.arquillian.core.impl.EventContextImpl.proceed(EventContextImpl.java:88)
          at org.jboss.arquillian.core.impl.ManagerImpl.fire(ManagerImpl.java:135)
          at org.jboss.arquillian.core.impl.ManagerImpl.fire(ManagerImpl.java:115)
          at org.jboss.arquillian.test.impl.EventTestRunnerAdaptor.after(EventTestRunnerAdaptor.java:103)
          at org.jboss.arquillian.junit.Arquillian$5$1.evaluate(Arquillian.java:245)
          at org.jboss.arquillian.junit.Arquillian.multiExecute(Arquillian.java:314)
          at org.jboss.arquillian.junit.Arquillian.access$100(Arquillian.java:46)
          at org.jboss.arquillian.junit.Arquillian$5.evaluate(Arquillian.java:240)
          at org.junit.runners.ParentRunner.runLeaf(ParentRunner.java:263)
          at org.junit.runners.BlockJUnit4ClassRunner.runChild(BlockJUnit4ClassRunner.java:68)
          at org.junit.runners.BlockJUnit4ClassRunner.runChild(BlockJUnit4ClassRunner.java:47)
          at org.junit.runners.ParentRunner$3.run(ParentRunner.java:231)
          at org.junit.runners.ParentRunner$1.schedule(ParentRunner.java:60)
          at org.junit.runners.ParentRunner.runChildren(ParentRunner.java:229)
          at org.junit.runners.ParentRunner.access$000(ParentRunner.java:50)
          at org.junit.runners.ParentRunner$2.evaluate(ParentRunner.java:222)
          at org.jboss.arquillian.junit.Arquillian$2.evaluate(Arquillian.java:185)
          at org.jboss.arquillian.junit.Arquillian.multiExecute(Arquillian.java:314)
          at org.jboss.arquillian.junit.Arquillian.access$100(Arquillian.java:46)
          at org.jboss.arquillian.junit.Arquillian$3.evaluate(Arquillian.java:199)
          at org.junit.runners.ParentRunner.run(ParentRunner.java:300)
          at org.jboss.arquillian.junit.Arquillian.run(Arquillian.java:147)
          at org.junit.runner.JUnitCore.run(JUnitCore.java:157)
          at org.junit.runner.JUnitCore.run(JUnitCore.java:136)
          at org.jboss.arquillian.junit.container.JUnitTestRunner.execute(JUnitTestRunner.java:65)
          at org.jboss.arquillian.protocol.servlet.runner.ServletTestRunner.executeTest(ServletTestRunner.java:160)
          at org.jboss.arquillian.protocol.servlet.runner.ServletTestRunner.execute(ServletTestRunner.java:126)
          at org.jboss.arquillian.protocol.servlet.runner.ServletTestRunner.doGet(ServletTestRunner.java:90)
          at javax.servlet.http.HttpServlet.service(HttpServlet.java:668)
          at javax.servlet.http.HttpServlet.service(HttpServlet.java:770)
          at org.apache.catalina.core.StandardWrapper.service(StandardWrapper.java:1542)
          at org.apache.catalina.core.StandardWrapperValve.invoke(StandardWrapperValve.java:281)
          at org.apache.catalina.core.StandardContextValve.invoke(StandardContextValve.java:175)
          at org.apache.catalina.core.StandardPipeline.doInvoke(StandardPipeline.java:655)
          at org.apache.catalina.core.StandardPipeline.invoke(StandardPipeline.java:595)
          at org.apache.catalina.core.StandardHostValve.invoke(StandardHostValve.java:161)
          at org.apache.catalina.connector.CoyoteAdapter.doService(CoyoteAdapter.java:331)
          at org.apache.catalina.connector.CoyoteAdapter.service(CoyoteAdapter.java:231)
          at com.sun.enterprise.v3.services.impl.ContainerMapper$AdapterCallable.call(ContainerMapper.java:317)
          at com.sun.enterprise.v3.services.impl.ContainerMapper.service(ContainerMapper.java:195)
          at com.sun.grizzly.http.ProcessorTask.invokeAdapter(ProcessorTask.java:849)
          at com.sun.grizzly.http.ProcessorTask.doProcess(ProcessorTask.java:746)
          at com.sun.grizzly.http.ProcessorTask.process(ProcessorTask.java:1045)
          at com.sun.grizzly.http.DefaultProtocolFilter.execute(DefaultProtocolFilter.java:228)
          at com.sun.grizzly.DefaultProtocolChain.executeProtocolFilter(DefaultProtocolChain.java:137)
          at com.sun.grizzly.DefaultProtocolChain.execute(DefaultProtocolChain.java:104)
          at com.sun.grizzly.DefaultProtocolChain.execute(DefaultProtocolChain.java:90)
          at com.sun.grizzly.http.HttpProtocolChain.execute(HttpProtocolChain.java:79)
          at com.sun.grizzly.ProtocolChainContextTask.doCall(ProtocolChainContextTask.java:54)
          at com.sun.grizzly.SelectionKeyContextTask.call(SelectionKeyContextTask.java:59)
          at com.sun.grizzly.ContextTask.run(ContextTask.java:71)
          at com.sun.grizzly.util.AbstractThreadPool$Worker.doWork(AbstractThreadPool.java:532)
          at com.sun.grizzly.util.AbstractThreadPool$Worker.run(AbstractThreadPool.java:513)
          at java.lang.Thread.run(Thread.java:662)
      Caused by: java.sql.BatchUpdateException: Column 'name' cannot be null
          at com.mysql.jdbc.PreparedStatement.executeBatchSerially(PreparedStatement.java:2054)
          at com.mysql.jdbc.PreparedStatement.executeBatch(PreparedStatement.java:1467)
          at com.sun.gjc.spi.base.StatementWrapper.executeBatch(StatementWrapper.java:585)
          at org.hibernate.jdbc.BatchingBatcher.doExecuteBatch(BatchingBatcher.java:70)
          at org.hibernate.jdbc.AbstractBatcher.executeBatch(AbstractBatcher.java:268)
          ... 177 more
      Caused by: com.mysql.jdbc.exceptions.jdbc4.MySQLIntegrityConstraintViolationException: Column 'name' cannot be null
          at sun.reflect.NativeConstructorAccessorImpl.newInstance0(Native Method)
          at sun.reflect.NativeConstructorAccessorImpl.newInstance(NativeConstructorAccessorImpl.java:39)
          at sun.reflect.DelegatingConstructorAccessorImpl.newInstance(DelegatingConstructorAccessorImpl.java:27)
          at java.lang.reflect.Constructor.newInstance(Constructor.java:513)
          at com.mysql.jdbc.Util.handleNewInstance(Util.java:411)
          at com.mysql.jdbc.Util.getInstance(Util.java:386)
          at com.mysql.jdbc.SQLError.createSQLException(SQLError.java:1040)
          at com.mysql.jdbc.MysqlIO.checkErrorPacket(MysqlIO.java:4074)
          at com.mysql.jdbc.MysqlIO.checkErrorPacket(MysqlIO.java:4006)
          at com.mysql.jdbc.MysqlIO.sendCommand(MysqlIO.java:2468)
          at com.mysql.jdbc.MysqlIO.sqlQueryDirect(MysqlIO.java:2629)
          at com.mysql.jdbc.ConnectionImpl.execSQL(ConnectionImpl.java:2719)
          at com.mysql.jdbc.PreparedStatement.executeInternal(PreparedStatement.java:2155)
          at com.mysql.jdbc.PreparedStatement.executeUpdate(PreparedStatement.java:2450)
          at com.mysql.jdbc.PreparedStatement.executeBatchSerially(PreparedStatement.java:2006)
          ... 181 more
      |#]
      
      [#|2013-03-06T10:51:04.291+0100|WARNING|glassfish3.1.2|javax.enterprise.resource.jta.com.sun.enterprise.transaction|_ThreadID=19;_ThreadName=Thread-2;|DTX5014: Caught exception in beforeCompletion() callback:
      javax.persistence.PersistenceException: org.hibernate.exception.ConstraintViolationException: Could not execute JDBC batch update
          at org.hibernate.ejb.AbstractEntityManagerImpl.convert(AbstractEntityManagerImpl.java:1235)
          at org.hibernate.ejb.AbstractEntityManagerImpl.convert(AbstractEntityManagerImpl.java:1168)
          at org.hibernate.ejb.AbstractEntityManagerImpl$1.beforeCompletion(AbstractEntityManagerImpl.java:1064)
          at com.sun.enterprise.transaction.JavaEETransactionImpl.commit(JavaEETransactionImpl.java:435)
          at com.sun.enterprise.transaction.JavaEETransactionManagerSimplified.commit(JavaEETransactionManagerSimplified.java:855)
          at com.sun.enterprise.transaction.UserTransactionImpl.commit(UserTransactionImpl.java:208)
          at org.jboss.arquillian.persistence.core.transaction.TestTransactionWrapper.afterTest(TestTransactionWrapper.java:70)
          at sun.reflect.NativeMethodAccessorImpl.invoke0(Native Method)
          at sun.reflect.NativeMethodAccessorImpl.invoke(NativeMethodAccessorImpl.java:39)
          at sun.reflect.DelegatingMethodAccessorImpl.invoke(DelegatingMethodAccessorImpl.java:25)
          at java.lang.reflect.Method.invoke(Method.java:597)
          at org.jboss.arquillian.core.impl.ObserverImpl.invoke(ObserverImpl.java:90)
          at org.jboss.arquillian.core.impl.EventContextImpl.invokeObservers(EventContextImpl.java:99)
          at org.jboss.arquillian.core.impl.EventContextImpl.proceed(EventContextImpl.java:81)
          at org.jboss.arquillian.test.impl.TestContextHandler.createTestContext(TestContextHandler.java:89)
          at sun.reflect.NativeMethodAccessorImpl.invoke0(Native Method)
          at sun.reflect.NativeMethodAccessorImpl.invoke(NativeMethodAccessorImpl.java:39)
          at sun.reflect.DelegatingMethodAccessorImpl.invoke(DelegatingMethodAccessorImpl.java:25)
          at java.lang.reflect.Method.invoke(Method.java:597)
          at org.jboss.arquillian.core.impl.ObserverImpl.invoke(ObserverImpl.java:90)
          at org.jboss.arquillian.core.impl.EventContextImpl.proceed(EventContextImpl.java:88)
          at org.jboss.arquillian.test.impl.TestContextHandler.createClassContext(TestContextHandler.java:75)
          at sun.reflect.NativeMethodAccessorImpl.invoke0(Native Method)
          at sun.reflect.NativeMethodAccessorImpl.invoke(NativeMethodAccessorImpl.java:39)
          at sun.reflect.DelegatingMethodAccessorImpl.invoke(DelegatingMethodAccessorImpl.java:25)
          at java.lang.reflect.Method.invoke(Method.java:597)
          at org.jboss.arquillian.core.impl.ObserverImpl.invoke(ObserverImpl.java:90)
          at org.jboss.arquillian.core.impl.EventContextImpl.proceed(EventContextImpl.java:88)
          at org.jboss.arquillian.test.impl.TestContextHandler.createSuiteContext(TestContextHandler.java:60)
          at sun.reflect.NativeMethodAccessorImpl.invoke0(Native Method)
          at sun.reflect.NativeMethodAccessorImpl.invoke(NativeMethodAccessorImpl.java:39)
          at sun.reflect.DelegatingMethodAccessorImpl.invoke(DelegatingMethodAccessorImpl.java:25)
          at java.lang.reflect.Method.invoke(Method.java:597)
          at org.jboss.arquillian.core.impl.ObserverImpl.invoke(ObserverImpl.java:90)
          at org.jboss.arquillian.core.impl.EventContextImpl.proceed(EventContextImpl.java:88)
          at org.jboss.arquillian.core.impl.ManagerImpl.fire(ManagerImpl.java:135)
          at org.jboss.arquillian.core.impl.ManagerImpl.fire(ManagerImpl.java:115)
          at org.jboss.arquillian.core.impl.EventImpl.fire(EventImpl.java:67)
          at org.jboss.arquillian.persistence.core.lifecycle.TransactionHandler.endTransactionAfterTest(TransactionHandler.java:54)
          at sun.reflect.NativeMethodAccessorImpl.invoke0(Native Method)
          at sun.reflect.NativeMethodAccessorImpl.invoke(NativeMethodAccessorImpl.java:39)
          at sun.reflect.DelegatingMethodAccessorImpl.invoke(DelegatingMethodAccessorImpl.java:25)
          at java.lang.reflect.Method.invoke(Method.java:597)
          at org.jboss.arquillian.core.impl.ObserverImpl.invoke(ObserverImpl.java:90)
          at org.jboss.arquillian.core.impl.EventContextImpl.invokeObservers(EventContextImpl.java:99)
          at org.jboss.arquillian.core.impl.EventContextImpl.proceed(EventContextImpl.java:81)
          at org.jboss.arquillian.test.impl.TestContextHandler.createTestContext(TestContextHandler.java:89)
          at sun.reflect.NativeMethodAccessorImpl.invoke0(Native Method)
          at sun.reflect.NativeMethodAccessorImpl.invoke(NativeMethodAccessorImpl.java:39)
          at sun.reflect.DelegatingMethodAccessorImpl.invoke(DelegatingMethodAccessorImpl.java:25)
          at java.lang.reflect.Method.invoke(Method.java:597)
          at org.jboss.arquillian.core.impl.ObserverImpl.invoke(ObserverImpl.java:90)
          at org.jboss.arquillian.core.impl.EventContextImpl.proceed(EventContextImpl.java:88)
          at org.jboss.arquillian.test.impl.TestContextHandler.createClassContext(TestContextHandler.java:75)
          at sun.reflect.NativeMethodAccessorImpl.invoke0(Native Method)
          at sun.reflect.NativeMethodAccessorImpl.invoke(NativeMethodAccessorImpl.java:39)
          at sun.reflect.DelegatingMethodAccessorImpl.invoke(DelegatingMethodAccessorImpl.java:25)
          at java.lang.reflect.Method.invoke(Method.java:597)
          at org.jboss.arquillian.core.impl.ObserverImpl.invoke(ObserverImpl.java:90)
          at org.jboss.arquillian.core.impl.EventContextImpl.proceed(EventContextImpl.java:88)
          at org.jboss.arquillian.test.impl.TestContextHandler.createSuiteContext(TestContextHandler.java:60)
          at sun.reflect.NativeMethodAccessorImpl.invoke0(Native Method)
          at sun.reflect.NativeMethodAccessorImpl.invoke(NativeMethodAccessorImpl.java:39)
          at sun.reflect.DelegatingMethodAccessorImpl.invoke(DelegatingMethodAccessorImpl.java:25)
          at java.lang.reflect.Method.invoke(Method.java:597)
          at org.jboss.arquillian.core.impl.ObserverImpl.invoke(ObserverImpl.java:90)
          at org.jboss.arquillian.core.impl.EventContextImpl.proceed(EventContextImpl.java:88)
          at org.jboss.arquillian.persistence.dbunit.DBUnitPersistenceTestLifecycleHandler.closeConnection(DBUnitPersistenceTestLifecycleHandler.java:113)
          at sun.reflect.NativeMethodAccessorImpl.invoke0(Native Method)
          at sun.reflect.NativeMethodAccessorImpl.invoke(NativeMethodAccessorImpl.java:39)
          at sun.reflect.DelegatingMethodAccessorImpl.invoke(DelegatingMethodAccessorImpl.java:25)
          at java.lang.reflect.Method.invoke(Method.java:597)
          at org.jboss.arquillian.core.impl.ObserverImpl.invoke(ObserverImpl.java:90)
          at org.jboss.arquillian.core.impl.EventContextImpl.proceed(EventContextImpl.java:88)
          at org.jboss.arquillian.persistence.core.lifecycle.ErrorCollectorHandler.collectErrors(ErrorCollectorHandler.java:46)
          at sun.reflect.NativeMethodAccessorImpl.invoke0(Native Method)
          at sun.reflect.NativeMethodAccessorImpl.invoke(NativeMethodAccessorImpl.java:39)
          at sun.reflect.DelegatingMethodAccessorImpl.invoke(DelegatingMethodAccessorImpl.java:25)
          at java.lang.reflect.Method.invoke(Method.java:597)
          at org.jboss.arquillian.core.impl.ObserverImpl.invoke(ObserverImpl.java:90)
          at org.jboss.arquillian.core.impl.EventContextImpl.proceed(EventContextImpl.java:88)
          at org.jboss.arquillian.core.impl.ManagerImpl.fire(ManagerImpl.java:135)
          at org.jboss.arquillian.core.impl.ManagerImpl.fire(ManagerImpl.java:115)
          at org.jboss.arquillian.core.impl.EventImpl.fire(EventImpl.java:67)
          at org.jboss.arquillian.persistence.core.lifecycle.PersistenceTestTrigger.afterTest(PersistenceTestTrigger.java:113)
          at sun.reflect.NativeMethodAccessorImpl.invoke0(Native Method)
          at sun.reflect.NativeMethodAccessorImpl.invoke(NativeMethodAccessorImpl.java:39)
          at sun.reflect.DelegatingMethodAccessorImpl.invoke(DelegatingMethodAccessorImpl.java:25)
          at java.lang.reflect.Method.invoke(Method.java:597)
          at org.jboss.arquillian.core.impl.ObserverImpl.invoke(ObserverImpl.java:90)
          at org.jboss.arquillian.core.impl.EventContextImpl.invokeObservers(EventContextImpl.java:99)
          at org.jboss.arquillian.core.impl.EventContextImpl.proceed(EventContextImpl.java:81)
          at org.jboss.arquillian.testenricher.cdi.CreationalContextDestroyer.destory(CreationalContextDestroyer.java:44)
          at sun.reflect.NativeMethodAccessorImpl.invoke0(Native Method)
          at sun.reflect.NativeMethodAccessorImpl.invoke(NativeMethodAccessorImpl.java:39)
          at sun.reflect.DelegatingMethodAccessorImpl.invoke(DelegatingMethodAccessorImpl.java:25)
          at java.lang.reflect.Method.invoke(Method.java:597)
          at org.jboss.arquillian.core.impl.ObserverImpl.invoke(ObserverImpl.java:90)
          at org.jboss.arquillian.core.impl.EventContextImpl.proceed(EventContextImpl.java:88)
          at org.jboss.arquillian.test.impl.TestContextHandler.createTestContext(TestContextHandler.java:89)
          at sun.reflect.NativeMethodAccessorImpl.invoke0(Native Method)
          at sun.reflect.NativeMethodAccessorImpl.invoke(NativeMethodAccessorImpl.java:39)
          at sun.reflect.DelegatingMethodAccessorImpl.invoke(DelegatingMethodAccessorImpl.java:25)
          at java.lang.reflect.Method.invoke(Method.java:597)
          at org.jboss.arquillian.core.impl.ObserverImpl.invoke(ObserverImpl.java:90)
          at org.jboss.arquillian.core.impl.EventContextImpl.proceed(EventContextImpl.java:88)
          at org.jboss.arquillian.test.impl.TestContextHandler.createClassContext(TestContextHandler.java:75)
          at sun.reflect.NativeMethodAccessorImpl.invoke0(Native Method)
          at sun.reflect.NativeMethodAccessorImpl.invoke(NativeMethodAccessorImpl.java:39)
          at sun.reflect.DelegatingMethodAccessorImpl.invoke(DelegatingMethodAccessorImpl.java:25)
          at java.lang.reflect.Method.invoke(Method.java:597)
          at org.jboss.arquillian.core.impl.ObserverImpl.invoke(ObserverImpl.java:90)
          at org.jboss.arquillian.core.impl.EventContextImpl.proceed(EventContextImpl.java:88)
          at org.jboss.arquillian.test.impl.TestContextHandler.createSuiteContext(TestContextHandler.java:60)
          at sun.reflect.NativeMethodAccessorImpl.invoke0(Native Method)
          at sun.reflect.NativeMethodAccessorImpl.invoke(NativeMethodAccessorImpl.java:39)
          at sun.reflect.DelegatingMethodAccessorImpl.invoke(DelegatingMethodAccessorImpl.java:25)
          at java.lang.reflect.Method.invoke(Method.java:597)
          at org.jboss.arquillian.core.impl.ObserverImpl.invoke(ObserverImpl.java:90)
          at org.jboss.arquillian.core.impl.EventContextImpl.proceed(EventContextImpl.java:88)
          at org.jboss.arquillian.core.impl.ManagerImpl.fire(ManagerImpl.java:135)
          at org.jboss.arquillian.core.impl.ManagerImpl.fire(ManagerImpl.java:115)
          at org.jboss.arquillian.test.impl.EventTestRunnerAdaptor.after(EventTestRunnerAdaptor.java:103)
          at org.jboss.arquillian.junit.Arquillian$5$1.evaluate(Arquillian.java:245)
          at org.jboss.arquillian.junit.Arquillian.multiExecute(Arquillian.java:314)
          at org.jboss.arquillian.junit.Arquillian.access$100(Arquillian.java:46)
          at org.jboss.arquillian.junit.Arquillian$5.evaluate(Arquillian.java:240)
          at org.junit.runners.ParentRunner.runLeaf(ParentRunner.java:263)
          at org.junit.runners.BlockJUnit4ClassRunner.runChild(BlockJUnit4ClassRunner.java:68)
          at org.junit.runners.BlockJUnit4ClassRunner.runChild(BlockJUnit4ClassRunner.java:47)
          at org.junit.runners.ParentRunner$3.run(ParentRunner.java:231)
          at org.junit.runners.ParentRunner$1.schedule(ParentRunner.java:60)
          at org.junit.runners.ParentRunner.runChildren(ParentRunner.java:229)
          at org.junit.runners.ParentRunner.access$000(ParentRunner.java:50)
          at org.junit.runners.ParentRunner$2.evaluate(ParentRunner.java:222)
          at org.jboss.arquillian.junit.Arquillian$2.evaluate(Arquillian.java:185)
          at org.jboss.arquillian.junit.Arquillian.multiExecute(Arquillian.java:314)
          at org.jboss.arquillian.junit.Arquillian.access$100(Arquillian.java:46)
          at org.jboss.arquillian.junit.Arquillian$3.evaluate(Arquillian.java:199)
          at org.junit.runners.ParentRunner.run(ParentRunner.java:300)
          at org.jboss.arquillian.junit.Arquillian.run(Arquillian.java:147)
          at org.junit.runner.JUnitCore.run(JUnitCore.java:157)
          at org.junit.runner.JUnitCore.run(JUnitCore.java:136)
          at org.jboss.arquillian.junit.container.JUnitTestRunner.execute(JUnitTestRunner.java:65)
          at org.jboss.arquillian.protocol.servlet.runner.ServletTestRunner.executeTest(ServletTestRunner.java:160)
          at org.jboss.arquillian.protocol.servlet.runner.ServletTestRunner.execute(ServletTestRunner.java:126)
          at org.jboss.arquillian.protocol.servlet.runner.ServletTestRunner.doGet(ServletTestRunner.java:90)
          at javax.servlet.http.HttpServlet.service(HttpServlet.java:668)
          at javax.servlet.http.HttpServlet.service(HttpServlet.java:770)
          at org.apache.catalina.core.StandardWrapper.service(StandardWrapper.java:1542)
          at org.apache.catalina.core.StandardWrapperValve.invoke(StandardWrapperValve.java:281)
          at org.apache.catalina.core.StandardContextValve.invoke(StandardContextValve.java:175)
          at org.apache.catalina.core.StandardPipeline.doInvoke(StandardPipeline.java:655)
          at org.apache.catalina.core.StandardPipeline.invoke(StandardPipeline.java:595)
          at org.apache.catalina.core.StandardHostValve.invoke(StandardHostValve.java:161)
          at org.apache.catalina.connector.CoyoteAdapter.doService(CoyoteAdapter.java:331)
          at org.apache.catalina.connector.CoyoteAdapter.service(CoyoteAdapter.java:231)
          at com.sun.enterprise.v3.services.impl.ContainerMapper$AdapterCallable.call(ContainerMapper.java:317)
          at com.sun.enterprise.v3.services.impl.ContainerMapper.service(ContainerMapper.java:195)
          at com.sun.grizzly.http.ProcessorTask.invokeAdapter(ProcessorTask.java:849)
          at com.sun.grizzly.http.ProcessorTask.doProcess(ProcessorTask.java:746)
          at com.sun.grizzly.http.ProcessorTask.process(ProcessorTask.java:1045)
          at com.sun.grizzly.http.DefaultProtocolFilter.execute(DefaultProtocolFilter.java:228)
          at com.sun.grizzly.DefaultProtocolChain.executeProtocolFilter(DefaultProtocolChain.java:137)
          at com.sun.grizzly.DefaultProtocolChain.execute(DefaultProtocolChain.java:104)
          at com.sun.grizzly.DefaultProtocolChain.execute(DefaultProtocolChain.java:90)
          at com.sun.grizzly.http.HttpProtocolChain.execute(HttpProtocolChain.java:79)
          at com.sun.grizzly.ProtocolChainContextTask.doCall(ProtocolChainContextTask.java:54)
          at com.sun.grizzly.SelectionKeyContextTask.call(SelectionKeyContextTask.java:59)
          at com.sun.grizzly.ContextTask.run(ContextTask.java:71)
          at com.sun.grizzly.util.AbstractThreadPool$Worker.doWork(AbstractThreadPool.java:532)
          at com.sun.grizzly.util.AbstractThreadPool$Worker.run(AbstractThreadPool.java:513)
          at java.lang.Thread.run(Thread.java:662)
      Caused by: org.hibernate.exception.ConstraintViolationException: Could not execute JDBC batch update
          at org.hibernate.exception.SQLStateConverter.convert(SQLStateConverter.java:96)
          at org.hibernate.exception.JDBCExceptionHelper.convert(JDBCExceptionHelper.java:66)
          at org.hibernate.jdbc.AbstractBatcher.executeBatch(AbstractBatcher.java:275)
          at org.hibernate.engine.ActionQueue.executeActions(ActionQueue.java:262)
          at org.hibernate.engine.ActionQueue.executeActions(ActionQueue.java:179)
          at org.hibernate.event.def.AbstractFlushingEventListener.performExecutions(AbstractFlushingEventListener.java:321)
          at org.hibernate.event.def.DefaultFlushEventListener.onFlush(DefaultFlushEventListener.java:51)
          at org.hibernate.impl.SessionImpl.flush(SessionImpl.java:1206)
          at org.hibernate.impl.SessionImpl.managedFlush(SessionImpl.java:375)
          at org.hibernate.ejb.AbstractEntityManagerImpl$1.beforeCompletion(AbstractEntityManagerImpl.java:1057)
          ... 170 more
      Caused by: java.sql.BatchUpdateException: Column 'name' cannot be null
          at com.mysql.jdbc.PreparedStatement.executeBatchSerially(PreparedStatement.java:2054)
          at com.mysql.jdbc.PreparedStatement.executeBatch(PreparedStatement.java:1467)
          at com.sun.gjc.spi.base.StatementWrapper.executeBatch(StatementWrapper.java:585)
          at org.hibernate.jdbc.BatchingBatcher.doExecuteBatch(BatchingBatcher.java:70)
          at org.hibernate.jdbc.AbstractBatcher.executeBatch(AbstractBatcher.java:268)
          ... 177 more
      Caused by: com.mysql.jdbc.exceptions.jdbc4.MySQLIntegrityConstraintViolationException: Column 'name' cannot be null
          at sun.reflect.NativeConstructorAccessorImpl.newInstance0(Native Method)
          at sun.reflect.NativeConstructorAccessorImpl.newInstance(NativeConstructorAccessorImpl.java:39)
          at sun.reflect.DelegatingConstructorAccessorImpl.newInstance(DelegatingConstructorAccessorImpl.java:27)
          at java.lang.reflect.Constructor.newInstance(Constructor.java:513)
          at com.mysql.jdbc.Util.handleNewInstance(Util.java:411)
          at com.mysql.jdbc.Util.getInstance(Util.java:386)
          at com.mysql.jdbc.SQLError.createSQLException(SQLError.java:1040)
          at com.mysql.jdbc.MysqlIO.checkErrorPacket(MysqlIO.java:4074)
          at com.mysql.jdbc.MysqlIO.checkErrorPacket(MysqlIO.java:4006)
          at com.mysql.jdbc.MysqlIO.sendCommand(MysqlIO.java:2468)
          at com.mysql.jdbc.MysqlIO.sqlQueryDirect(MysqlIO.java:2629)
          at com.mysql.jdbc.ConnectionImpl.execSQL(ConnectionImpl.java:2719)
          at com.mysql.jdbc.PreparedStatement.executeInternal(PreparedStatement.java:2155)
          at com.mysql.jdbc.PreparedStatement.executeUpdate(PreparedStatement.java:2450)
          at com.mysql.jdbc.PreparedStatement.executeBatchSerially(PreparedStatement.java:2006)
          ... 181 more
      |#]
      

       

      Environment:

      Oracle Glassfish Server 3.1.2

      MySQL 5.1

      Hibernate 3.5.6-Final

      Ubuntu 64 bit

      Apache Maven 3.0.3

      Java version 1.6.0_26

       

      Cheers,

      Marco