1 Reply Latest reply on Jul 10, 2013 7:05 AM by tenzor

    Unable to find jarfile switchyard-as7-tests-1.0.0.Final-tests.jar

    tenzor Newbie

      Guys, I can't build switchyard-release from trunk - https://github.com/jboss-switchyard/release

       

       

      [INFO] ------------------------------------------------------------------------

      [INFO] Reactor Summary:

      [INFO]

      [INFO] SwitchYard: Distribution .......................... SUCCESS [16.024s]

      [INFO] SwitchYard: Release Distribution Tests Utilities .. SUCCESS [2:51.390s]

      [INFO] SwitchYard: Distribution Artifacts ................ SUCCESS [0.144s]

      [INFO] SwitchYard: AS7 Parent ............................ SUCCESS [0.016s]

      [INFO] SwitchYard: AS7 KIE/Drools/jBPM ................... SUCCESS [8:22.171s]

      [INFO] SwitchYard: AS7 Extension ......................... SUCCESS [17.683s]

      [INFO] SwitchYard: AS7 Modules ........................... SUCCESS [2:28.515s]

      [INFO] SwitchYard: AS7 Release Distribution Tests ........ SUCCESS [14.773s]

      [INFO] SwitchYard: AS7 Bundle ............................ SUCCESS [8.953s]

      [INFO] SwitchYard: AS7 Standalone Parent ................. SUCCESS [0.029s]

      [INFO] SwitchYard: AS7 Distribution ...................... FAILURE [23.159s]

      [INFO] SwitchYard: Forge Plugin Distribution ............. SKIPPED

      [INFO] SwitchYard: Tools Distribution .................... SKIPPED

      [INFO] SwitchYard: Forge Installer ....................... SKIPPED

      [INFO] SwitchYard: Installer ............................. SKIPPED

      [INFO] ------------------------------------------------------------------------

      [INFO] BUILD FAILURE

      [INFO] ------------------------------------------------------------------------

      [INFO] Total time: 15:07.307s

      [INFO] Finished at: Wed Jul 10 13:36:46 MSK 2013

      [INFO] Final Memory: 130M/674M

      [INFO] ------------------------------------------------------------------------

      [ERROR] Failed to execute goal org.apache.maven.plugins:maven-dependency-plugin:2.1:unpack (unpack-tests) on project switchyard-as7-standalone-dist: Unable to resolve artifact. Could not transfer artifact org.switchyard:switchyard-as7-tests:jar:tests:1.0.0.Final from/to jboss-eap-repository (file:///path/to/repo/jboss-eap-6.1.X-maven-repository): Repository path /path/to/repo/jboss-eap-6.1.X-maven-repository does not exist, and cannot be created.

      [ERROR] org.switchyard:switchyard-as7-tests:test-jar:1.0.0.Final

       

      Other links are dead -

       

      Downloading: http://repository.jboss.org/nexus/content/groups/public/org/switchyard/switchyard-as7-tests/1.0.0.Final/switchyard-as7-tests-1.0.0.Final-tests.jar

      Downloading: file:///path/to/repo/jboss-eap-6.1.X-maven-repository/org/switchyard/switchyard-as7-tests/1.0.0.Final/switchyard-as7-tests-1.0.0.Final-tests.jar

      Downloading: https://repository.jboss.org/nexus/content/groups/public/org/switchyard/switchyard-as7-tests/1.0.0.Final/switchyard-as7-tests-1.0.0.Final-tests.jar

      Downloading: https://repository.jboss.org/nexus/content/repositories/deprecated/org/switchyard/switchyard-as7-tests/1.0.0.Final/switchyard-as7-tests-1.0.0.Final-tests.jar

      Downloading: http://maven.repository.redhat.com/earlyaccess/all/org/switchyard/switchyard-as7-tests/1.0.0.Final/switchyard-as7-tests-1.0.0.Final-tests.jar

      Downloading: http://snapshots.repository.codehaus.org/org/switchyard/switchyard-as7-tests/1.0.0.Final/switchyard-as7-tests-1.0.0.Final-tests.jar

      Downloading: http://repo.maven.apache.org/maven2/org/switchyard/switchyard-as7-tests/1.0.0.Final/switchyard-as7-tests-1.0.0.Final-tests.jar

       

       

      Could someone please help me to find this artifact? Upload it here or gimme link please!

       

      Thank you in advance!

        • 1. Re: Unable to find jarfile switchyard-as7-tests-1.0.0.Final-tests.jar
          tenzor Newbie

          Update: Looks like problem was successfully fixed, because one of official repositories recommenced.

           

          Thanks!

           

          [INFO] Reactor Summary:

          [INFO]

          [INFO] SwitchYard: Distribution .......................... SUCCESS [0.306s]

          [INFO] SwitchYard: Release Distribution Tests Utilities .. SUCCESS [1.874s]

          [INFO] SwitchYard: Distribution Artifacts ................ SUCCESS [0.112s]

          [INFO] SwitchYard: AS7 Parent ............................ SUCCESS [0.005s]

          [INFO] SwitchYard: AS7 KIE/Drools/jBPM ................... SUCCESS [5.953s]

          [INFO] SwitchYard: AS7 Extension ......................... SUCCESS [3.452s]

          [INFO] SwitchYard: AS7 Modules ........................... SUCCESS [11.015s]

          [INFO] SwitchYard: AS7 Release Distribution Tests ........ SUCCESS [0.442s]

          [INFO] SwitchYard: AS7 Bundle ............................ SUCCESS [5.832s]

          [INFO] SwitchYard: AS7 Standalone Parent ................. SUCCESS [0.007s]

          [INFO] SwitchYard: AS7 Distribution ...................... SUCCESS [11.531s]

          [INFO] SwitchYard: Forge Plugin Distribution ............. SUCCESS [1.891s]

          [INFO] SwitchYard: Tools Distribution .................... SUCCESS [3.462s]

          [INFO] SwitchYard: Forge Installer ....................... SUCCESS [4.170s]

          [INFO] SwitchYard: Installer ............................. SUCCESS [3.254s]

          [INFO] ------------------------------------------------------------------------

          [INFO] BUILD SUCCESS

          [INFO] ------------------------------------------------------------------------

          [INFO] Total time: 54.079s

          [INFO] Finished at: Wed Jul 10 14:58:56 MSK 2013

          [INFO] Final Memory: 135M/1509M

          [INFO] ------------------------------------------------------------------------