1 Reply Latest reply on Aug 29, 2013 8:24 AM by Bartosz Majsak

    Strange error while running arguillian test

    lukas lukasz Newbie

      Hello when i try implements test with arquillian i have got strange error :

       

      Running pl.pisystem.documents.search.solr.SolrIntegrationTest
      lip 31, 2013 10:32:45 AM org.jboss.arquillian.container.impl.MapObject populate
      WARNING: Configuration contain properties not supported by the backing object org.jboss.arquillian.container.glassfish.embedded_3_1.GlassFishConfiguration
      Unused property entries: {allowConnectingToRunningServer=true}
      Supported property names: [configurationXml, resourcesXml, instanceRoot, bindHttpPort, sunResourcesXml, configurationReadOnly, installRoot]
      SLF4J: Class path contains multiple SLF4J bindings.
      SLF4J: Found binding in [jar:file:/home/lukasw44/.m2/repository/org/slf4j/slf4j-log4j12/1.7.5/slf4j-log4j12-1.7.5.jar!/org/slf4j/impl/StaticLoggerBinder.class]
      SLF4J: Found binding in [jar:file:/home/lukasw44/.m2/repository/org/glassfish/main/extras/glassfish-embedded-all/3.1.2/glassfish-embedded-all-3.1.2.jar!/org/slf4j/impl/StaticLoggerBinder.class]
      SLF4J: See http://www.slf4j.org/codes.html#multiple_bindings for an explanation.
      SLF4J: Actual binding is of type [org.slf4j.impl.Log4jLoggerFactory]
      log4j:WARN No appenders could be found for logger (org.hibernate.validator.util.Version).
      log4j:WARN Please initialize the log4j system properly.
      log4j:WARN See http://logging.apache.org/log4j/1.2/faq.html#noconfig for more info.
      lip 31, 2013 10:32:46 AM com.sun.enterprise.v3.services.impl.GrizzlyService createNetworkProxy
      INFO: Network listener https-listener on port 0 disabled per domain.xml
      lip 31, 2013 10:32:46 AM com.sun.enterprise.v3.services.impl.GrizzlyProxy$2$1 onReady
      INFO: Grizzly Framework 1.9.46 started in: 30ms - bound to [0.0.0.0:9999]
      lip 31, 2013 10:32:46 AM com.sun.enterprise.v3.server.AppServerStartup run
      INFO: GlassFish Server Open Source Edition 3.1.2 (java_re-private) startup time : Embedded (467ms), startup services(356ms), total(823ms)
      lip 31, 2013 10:32:46 AM org.glassfish.admin.mbeanserver.JMXStartupService$JMXConnectorsStarterThread run
      INFO: JMX006: JMXStartupService had disabled JMXConnector system
      lip 31, 2013 10:32:46 AM org.jboss.arquillian.container.glassfish.embedded_3_1.GlassFishContainer executeCommand
      INFO: command add-resources result: PlainTextActionReporterSUCCESSDescription: add-resources AdminCommandnull
          JDBC connection pool search-pool created successfully.
          Attribute value (pool-name = test-pool) is not found in list of jdbc connection pools.
      
      lip 31, 2013 10:32:47 AM org.glassfish.api.ActionReport failure
      SEVERE: Exception while deploying the app [test]
      lip 31, 2013 10:32:47 AM com.sun.enterprise.v3.server.ApplicationLifecycle deploy
      SEVERE: Implementing class
      java.lang.IncompatibleClassChangeError: Implementing class
          at java.lang.ClassLoader.defineClass1(Native Method)
          at java.lang.ClassLoader.defineClass(ClassLoader.java:791)
          at java.security.SecureClassLoader.defineClass(SecureClassLoader.java:142)
          at java.net.URLClassLoader.defineClass(URLClassLoader.java:449)
          at java.net.URLClassLoader.access$100(URLClassLoader.java:71)
          at java.net.URLClassLoader$1.run(URLClassLoader.java:361)
          at java.net.URLClassLoader$1.run(URLClassLoader.java:355)
          at java.security.AccessController.doPrivileged(Native Method)
          at java.net.URLClassLoader.findClass(URLClassLoader.java:354)
          at java.lang.ClassLoader.loadClass(ClassLoader.java:423)
          at sun.misc.Launcher$AppClassLoader.loadClass(Launcher.java:308)
          at java.lang.ClassLoader.loadClass(ClassLoader.java:356)
          at org.glassfish.hk2.classmodel.reflect.ParsingContext$Builder.build(ParsingContext.java:161)
          at com.sun.enterprise.v3.server.ApplicationLifecycle.getDeployableTypes(ApplicationLifecycle.java:505)
          at com.sun.enterprise.v3.server.ApplicationLifecycle.deploy(ApplicationLifecycle.java:351)
          at com.sun.enterprise.v3.server.ApplicationLifecycle.deploy(ApplicationLifecycle.java:240)
          at org.glassfish.deployment.admin.DeployCommand.execute(DeployCommand.java:389)
          at com.sun.enterprise.v3.admin.CommandRunnerImpl$1.execute(CommandRunnerImpl.java:348)
          at com.sun.enterprise.v3.admin.CommandRunnerImpl.doCommand(CommandRunnerImpl.java:363)
          at com.sun.enterprise.v3.admin.CommandRunnerImpl.doCommand(CommandRunnerImpl.java:1085)
          at com.sun.enterprise.v3.admin.CommandRunnerImpl.access$1200(CommandRunnerImpl.java:95)
          at com.sun.enterprise.v3.admin.CommandRunnerImpl$ExecutionContext.execute(CommandRunnerImpl.java:1291)
          at com.sun.enterprise.v3.admin.CommandRunnerImpl$ExecutionContext.execute(CommandRunnerImpl.java:1259)
          at com.sun.enterprise.admin.cli.embeddable.DeployerImpl.deploy(DeployerImpl.java:129)
          at com.sun.enterprise.admin.cli.embeddable.DeployerImpl.deploy(DeployerImpl.java:105)
          at org.jboss.arquillian.container.glassfish.embedded_3_1.GlassFishContainer.deploy(GlassFishContainer.java:202)
          at org.jboss.arquillian.container.impl.client.container.ContainerDeployController$3.call(ContainerDeployController.java:161)
          at org.jboss.arquillian.container.impl.client.container.ContainerDeployController$3.call(ContainerDeployController.java:128)
          at org.jboss.arquillian.container.impl.client.container.ContainerDeployController.executeOperation(ContainerDeployController.java:271)
          at org.jboss.arquillian.container.impl.client.container.ContainerDeployController.deploy(ContainerDeployController.java:127)
          at sun.reflect.NativeMethodAccessorImpl.invoke0(Native Method)
          at sun.reflect.NativeMethodAccessorImpl.invoke(NativeMethodAccessorImpl.java:57)
          at sun.reflect.DelegatingMethodAccessorImpl.invoke(DelegatingMethodAccessorImpl.java:43)
          at java.lang.reflect.Method.invoke(Method.java:601)
          at org.jboss.arquillian.core.impl.ObserverImpl.invoke(ObserverImpl.java:90)
          at org.jboss.arquillian.core.impl.EventContextImpl.invokeObservers(EventContextImpl.java:99)
          at org.jboss.arquillian.core.impl.EventContextImpl.proceed(EventContextImpl.java:81)
          at org.jboss.arquillian.container.impl.client.ContainerDeploymentContextHandler.createDeploymentContext(ContainerDeploymentContextHandler.java:78)
          at sun.reflect.NativeMethodAccessorImpl.invoke0(Native Method)
          at sun.reflect.NativeMethodAccessorImpl.invoke(NativeMethodAccessorImpl.java:57)
          at sun.reflect.DelegatingMethodAccessorImpl.invoke(DelegatingMethodAccessorImpl.java:43)
          at java.lang.reflect.Method.invoke(Method.java:601)
          at org.jboss.arquillian.core.impl.ObserverImpl.invoke(ObserverImpl.java:90)
          at org.jboss.arquillian.core.impl.EventContextImpl.proceed(EventContextImpl.java:88)
          at org.jboss.arquillian.container.impl.client.ContainerDeploymentContextHandler.createContainerContext(ContainerDeploymentContextHandler.java:57)
          at sun.reflect.NativeMethodAccessorImpl.invoke0(Native Method)
          at sun.reflect.NativeMethodAccessorImpl.invoke(NativeMethodAccessorImpl.java:57)
          at sun.reflect.DelegatingMethodAccessorImpl.invoke(DelegatingMethodAccessorImpl.java:43)
          at java.lang.reflect.Method.invoke(Method.java:601)
          at org.jboss.arquillian.core.impl.ObserverImpl.invoke(ObserverImpl.java:90)
          at org.jboss.arquillian.core.impl.EventContextImpl.proceed(EventContextImpl.java:88)
          at org.jboss.arquillian.container.impl.client.container.DeploymentExceptionHandler.verifyExpectedExceptionDuringDeploy(DeploymentExceptionHandler.java:50)
          at sun.reflect.NativeMethodAccessorImpl.invoke0(Native Method)
          at sun.reflect.NativeMethodAccessorImpl.invoke(NativeMethodAccessorImpl.java:57)
          at sun.reflect.DelegatingMethodAccessorImpl.invoke(DelegatingMethodAccessorImpl.java:43)
          at java.lang.reflect.Method.invoke(Method.java:601)
          at org.jboss.arquillian.core.impl.ObserverImpl.invoke(ObserverImpl.java:90)
          at org.jboss.arquillian.core.impl.EventContextImpl.proceed(EventContextImpl.java:88)
          at org.jboss.arquillian.core.impl.ManagerImpl.fire(ManagerImpl.java:135)
          at org.jboss.arquillian.core.impl.ManagerImpl.fire(ManagerImpl.java:115)
          at org.jboss.arquillian.core.impl.EventImpl.fire(EventImpl.java:67)
          at org.jboss.arquillian.container.impl.client.container.ContainerDeployController$1.perform(ContainerDeployController.java:95)
          at org.jboss.arquillian.container.impl.client.container.ContainerDeployController$1.perform(ContainerDeployController.java:80)
          at org.jboss.arquillian.container.impl.client.container.ContainerDeployController.forEachDeployment(ContainerDeployController.java:263)
          at org.jboss.arquillian.container.impl.client.container.ContainerDeployController.forEachManagedDeployment(ContainerDeployController.java:239)
          at org.jboss.arquillian.container.impl.client.container.ContainerDeployController.deployManaged(ContainerDeployController.java:79)
          at sun.reflect.NativeMethodAccessorImpl.invoke0(Native Method)
          at sun.reflect.NativeMethodAccessorImpl.invoke(NativeMethodAccessorImpl.java:57)
          at sun.reflect.DelegatingMethodAccessorImpl.invoke(DelegatingMethodAccessorImpl.java:43)
          at java.lang.reflect.Method.invoke(Method.java:601)
          at org.jboss.arquillian.core.impl.ObserverImpl.invoke(ObserverImpl.java:90)
          at org.jboss.arquillian.core.impl.EventContextImpl.invokeObservers(EventContextImpl.java:99)
          at org.jboss.arquillian.core.impl.EventContextImpl.proceed(EventContextImpl.java:81)
          at org.jboss.arquillian.core.impl.ManagerImpl.fire(ManagerImpl.java:135)
          at org.jboss.arquillian.core.impl.ManagerImpl.fire(ManagerImpl.java:115)
          at org.jboss.arquillian.core.impl.EventImpl.fire(EventImpl.java:67)
          at org.jboss.arquillian.container.test.impl.client.ContainerEventController.execute(ContainerEventController.java:101)
          at sun.reflect.NativeMethodAccessorImpl.invoke0(Native Method)
          at sun.reflect.NativeMethodAccessorImpl.invoke(NativeMethodAccessorImpl.java:57)
          at sun.reflect.DelegatingMethodAccessorImpl.invoke(DelegatingMethodAccessorImpl.java:43)
          at java.lang.reflect.Method.invoke(Method.java:601)
          at org.jboss.arquillian.core.impl.ObserverImpl.invoke(ObserverImpl.java:90)
          at org.jboss.arquillian.core.impl.EventContextImpl.invokeObservers(EventContextImpl.java:99)
          at org.jboss.arquillian.core.impl.EventContextImpl.proceed(EventContextImpl.java:81)
          at org.jboss.arquillian.test.impl.TestContextHandler.createClassContext(TestContextHandler.java:75)
          at sun.reflect.NativeMethodAccessorImpl.invoke0(Native Method)
          at sun.reflect.NativeMethodAccessorImpl.invoke(NativeMethodAccessorImpl.java:57)
          at sun.reflect.DelegatingMethodAccessorImpl.invoke(DelegatingMethodAccessorImpl.java:43)
          at java.lang.reflect.Method.invoke(Method.java:601)
          at org.jboss.arquillian.core.impl.ObserverImpl.invoke(ObserverImpl.java:90)
          at org.jboss.arquillian.core.impl.EventContextImpl.proceed(EventContextImpl.java:88)
          at org.jboss.arquillian.test.impl.TestContextHandler.createSuiteContext(TestContextHandler.java:60)
          at sun.reflect.NativeMethodAccessorImpl.invoke0(Native Method)
          at sun.reflect.NativeMethodAccessorImpl.invoke(NativeMethodAccessorImpl.java:57)
          at sun.reflect.DelegatingMethodAccessorImpl.invoke(DelegatingMethodAccessorImpl.java:43)
          at java.lang.reflect.Method.invoke(Method.java:601)
          at org.jboss.arquillian.core.impl.ObserverImpl.invoke(ObserverImpl.java:90)
          at org.jboss.arquillian.core.impl.EventContextImpl.proceed(EventContextImpl.java:88)
          at org.jboss.arquillian.core.impl.ManagerImpl.fire(ManagerImpl.java:135)
          at org.jboss.arquillian.core.impl.ManagerImpl.fire(ManagerImpl.java:115)
          at org.jboss.arquillian.test.impl.EventTestRunnerAdaptor.beforeClass(EventTestRunnerAdaptor.java:80)
          at org.jboss.arquillian.junit.Arquillian$2.evaluate(Arquillian.java:182)
          at org.jboss.arquillian.junit.Arquillian.multiExecute(Arquillian.java:314)
          at org.jboss.arquillian.junit.Arquillian.access$100(Arquillian.java:46)
          at org.jboss.arquillian.junit.Arquillian$3.evaluate(Arquillian.java:199)
          at org.junit.runners.ParentRunner.run(ParentRunner.java:292)
          at org.jboss.arquillian.junit.Arquillian.run(Arquillian.java:147)
          at org.apache.maven.surefire.junit4.JUnit4Provider.execute(JUnit4Provider.java:264)
          at org.apache.maven.surefire.junit4.JUnit4Provider.executeTestSet(JUnit4Provider.java:153)
          at org.apache.maven.surefire.junit4.JUnit4Provider.invoke(JUnit4Provider.java:124)
          at sun.reflect.NativeMethodAccessorImpl.invoke0(Native Method)
          at sun.reflect.NativeMethodAccessorImpl.invoke(NativeMethodAccessorImpl.java:57)
          at sun.reflect.DelegatingMethodAccessorImpl.invoke(DelegatingMethodAccessorImpl.java:43)
          at java.lang.reflect.Method.invoke(Method.java:601)
          at org.apache.maven.surefire.util.ReflectionUtils.invokeMethodWithArray2(ReflectionUtils.java:208)
          at org.apache.maven.surefire.booter.ProviderFactory$ProviderProxy.invoke(ProviderFactory.java:158)
          at org.apache.maven.surefire.booter.ProviderFactory.invokeProvider(ProviderFactory.java:86)
          at org.apache.maven.surefire.booter.ForkedBooter.runSuitesInProcess(ForkedBooter.java:153)
          at org.apache.maven.surefire.booter.ForkedBooter.main(ForkedBooter.java:95)
      
      lip 31, 2013 10:32:47 AM org.glassfish.deployment.admin.DeployCommand execute
      SEVERE: Exception while deploying the app [test] : Implementing class
      lip 31, 2013 10:32:47 AM com.sun.enterprise.web.WebContainer createHttpListener
      INFO: WEB0169: Created HTTP listener [http-listener] on host/port [0.0.0.0:9999]
      lip 31, 2013 10:32:47 AM com.sun.enterprise.web.WebContainer createHosts
      INFO: WEB0171: Created virtual server [server]
      lip 31, 2013 10:32:47 AM com.sun.enterprise.web.WebContainer loadSystemDefaultWebModules
      INFO: WEB0172: Virtual server [server] loaded default web module []
      PlainTextActionReporterFAILUREApplication test is not deployed on this target [server]Tests run: 1, Failures: 0, Errors: 1, Skipped: 0, Time elapsed: 3.445 sec <<< FAILURE!
      should_deploy_solr(pl.pisystem.documents.search.solr.SolrIntegrationTest)  Time elapsed: 0.34 sec  <<< ERROR!
      java.lang.IllegalArgumentException: ArquillianServletRunner not found. Could not determine ContextRoot from ProtocolMetadata, please contact DeployableContainer developer.
          at org.jboss.arquillian.protocol.servlet.ServletUtil.determineBaseURI(ServletUtil.java:64)
          at org.jboss.arquillian.protocol.servlet.ServletURIHandler.locateTestServlet(ServletURIHandler.java:60)
          at org.jboss.arquillian.protocol.servlet.ServletMethodExecutor.invoke(ServletMethodExecutor.java:77)
          at org.jboss.arquillian.container.test.impl.execution.RemoteTestExecuter.execute(RemoteTestExecuter.java:120)
          at sun.reflect.NativeMethodAccessorImpl.invoke0(Native Method)
          at sun.reflect.NativeMethodAccessorImpl.invoke(NativeMethodAccessorImpl.java:57)
          at sun.reflect.DelegatingMethodAccessorImpl.invoke(DelegatingMethodAccessorImpl.java:43)
          at java.lang.reflect.Method.invoke(Method.java:601)
          at org.jboss.arquillian.core.impl.ObserverImpl.invoke(ObserverImpl.java:90)
          at org.jboss.arquillian.core.impl.EventContextImpl.invokeObservers(EventContextImpl.java:99)
          at org.jboss.arquillian.core.impl.EventContextImpl.proceed(EventContextImpl.java:81)
          at org.jboss.arquillian.core.impl.ManagerImpl.fire(ManagerImpl.java:135)
          at org.jboss.arquillian.core.impl.ManagerImpl.fire(ManagerImpl.java:115)
          at org.jboss.arquillian.core.impl.EventImpl.fire(EventImpl.java:67)
          at org.jboss.arquillian.container.test.impl.execution.ClientTestExecuter.execute(ClientTestExecuter.java:57)
          at sun.reflect.NativeMethodAccessorImpl.invoke0(Native Method)
          at sun.reflect.NativeMethodAccessorImpl.invoke(NativeMethodAccessorImpl.java:57)
          at sun.reflect.DelegatingMethodAccessorImpl.invoke(DelegatingMethodAccessorImpl.java:43)
          at java.lang.reflect.Method.invoke(Method.java:601)
          at org.jboss.arquillian.core.impl.ObserverImpl.invoke(ObserverImpl.java:90)
          at org.jboss.arquillian.core.impl.EventContextImpl.invokeObservers(EventContextImpl.java:99)
          at org.jboss.arquillian.core.impl.EventContextImpl.proceed(EventContextImpl.java:81)
          at org.jboss.arquillian.container.test.impl.client.ContainerEventController.createContext(ContainerEventController.java:142)
          at org.jboss.arquillian.container.test.impl.client.ContainerEventController.createTestContext(ContainerEventController.java:129)
          at sun.reflect.NativeMethodAccessorImpl.invoke0(Native Method)
          at sun.reflect.NativeMethodAccessorImpl.invoke(NativeMethodAccessorImpl.java:57)
          at sun.reflect.DelegatingMethodAccessorImpl.invoke(DelegatingMethodAccessorImpl.java:43)
          at java.lang.reflect.Method.invoke(Method.java:601)
          at org.jboss.arquillian.core.impl.ObserverImpl.invoke(ObserverImpl.java:90)
          at org.jboss.arquillian.core.impl.EventContextImpl.proceed(EventContextImpl.java:88)
          at org.jboss.arquillian.test.impl.TestContextHandler.createTestContext(TestContextHandler.java:89)
          at sun.reflect.NativeMethodAccessorImpl.invoke0(Native Method)
          at sun.reflect.NativeMethodAccessorImpl.invoke(NativeMethodAccessorImpl.java:57)
          at sun.reflect.DelegatingMethodAccessorImpl.invoke(DelegatingMethodAccessorImpl.java:43)
          at java.lang.reflect.Method.invoke(Method.java:601)
          at org.jboss.arquillian.core.impl.ObserverImpl.invoke(ObserverImpl.java:90)
          at org.jboss.arquillian.core.impl.EventContextImpl.proceed(EventContextImpl.java:88)
          at org.jboss.arquillian.test.impl.TestContextHandler.createClassContext(TestContextHandler.java:75)
          at sun.reflect.NativeMethodAccessorImpl.invoke0(Native Method)
          at sun.reflect.NativeMethodAccessorImpl.invoke(NativeMethodAccessorImpl.java:57)
          at sun.reflect.DelegatingMethodAccessorImpl.invoke(DelegatingMethodAccessorImpl.java:43)
          at java.lang.reflect.Method.invoke(Method.java:601)
          at org.jboss.arquillian.core.impl.ObserverImpl.invoke(ObserverImpl.java:90)
          at org.jboss.arquillian.core.impl.EventContextImpl.proceed(EventContextImpl.java:88)
          at org.jboss.arquillian.test.impl.TestContextHandler.createSuiteContext(TestContextHandler.java:60)
          at sun.reflect.NativeMethodAccessorImpl.invoke0(Native Method)
          at sun.reflect.NativeMethodAccessorImpl.invoke(NativeMethodAccessorImpl.java:57)
          at sun.reflect.DelegatingMethodAccessorImpl.invoke(DelegatingMethodAccessorImpl.java:43)
          at java.lang.reflect.Method.invoke(Method.java:601)
          at org.jboss.arquillian.core.impl.ObserverImpl.invoke(ObserverImpl.java:90)
          at org.jboss.arquillian.core.impl.EventContextImpl.proceed(EventContextImpl.java:88)
          at org.jboss.arquillian.core.impl.ManagerImpl.fire(ManagerImpl.java:135)
          at org.jboss.arquillian.test.impl.EventTestRunnerAdaptor.test(EventTestRunnerAdaptor.java:111)
          at org.jboss.arquillian.junit.Arquillian$6.evaluate(Arquillian.java:263)
          at org.jboss.arquillian.junit.Arquillian$4.evaluate(Arquillian.java:226)
          at org.jboss.arquillian.junit.Arquillian.multiExecute(Arquillian.java:314)
          at org.jboss.arquillian.junit.Arquillian.access$100(Arquillian.java:46)
          at org.jboss.arquillian.junit.Arquillian$5.evaluate(Arquillian.java:240)
          at org.junit.runners.ParentRunner.runLeaf(ParentRunner.java:263)
          at org.junit.runners.BlockJUnit4ClassRunner.runChild(BlockJUnit4ClassRunner.java:69)
          at org.junit.runners.BlockJUnit4ClassRunner.runChild(BlockJUnit4ClassRunner.java:48)
          at org.junit.runners.ParentRunner$3.run(ParentRunner.java:231)
          at org.junit.runners.ParentRunner$1.schedule(ParentRunner.java:60)
          at org.junit.runners.ParentRunner.runChildren(ParentRunner.java:229)
          at org.junit.runners.ParentRunner.access$000(ParentRunner.java:50)
          at org.junit.runners.ParentRunner$2.evaluate(ParentRunner.java:222)
          at org.jboss.arquillian.junit.Arquillian$2.evaluate(Arquillian.java:185)
          at org.jboss.arquillian.junit.Arquillian.multiExecute(Arquillian.java:314)
          at org.jboss.arquillian.junit.Arquillian.access$100(Arquillian.java:46)
          at org.jboss.arquillian.junit.Arquillian$3.evaluate(Arquillian.java:199)
          at org.junit.runners.ParentRunner.run(ParentRunner.java:292)
          at org.jboss.arquillian.junit.Arquillian.run(Arquillian.java:147)
          at org.apache.maven.surefire.junit4.JUnit4Provider.execute(JUnit4Provider.java:264)
          at org.apache.maven.surefire.junit4.JUnit4Provider.executeTestSet(JUnit4Provider.java:153)
          at org.apache.maven.surefire.junit4.JUnit4Provider.invoke(JUnit4Provider.java:124)
          at sun.reflect.NativeMethodAccessorImpl.invoke0(Native Method)
          at sun.reflect.NativeMethodAccessorImpl.invoke(NativeMethodAccessorImpl.java:57)
          at sun.reflect.DelegatingMethodAccessorImpl.invoke(DelegatingMethodAccessorImpl.java:43)
          at java.lang.reflect.Method.invoke(Method.java:601)
          at org.apache.maven.surefire.util.ReflectionUtils.invokeMethodWithArray2(ReflectionUtils.java:208)
          at org.apache.maven.surefire.booter.ProviderFactory$ProviderProxy.invoke(ProviderFactory.java:158)
          at org.apache.maven.surefire.booter.ProviderFactory.invokeProvider(ProviderFactory.java:86)
          at org.apache.maven.surefire.booter.ForkedBooter.runSuitesInProcess(ForkedBooter.java:153)
          at org.apache.maven.surefire.booter.ForkedBooter.main(ForkedBooter.java:95)
      
      lip 31, 2013 10:32:48 AM org.glassfish.admin.mbeanserver.JMXStartupService shutdown
      INFO: JMX001: JMXStartupService and JMXConnectors have been shut down.
      lip 31, 2013 10:32:48 AM com.sun.enterprise.v3.server.AppServerStartup stop
      INFO: Shutdown procedure finished
      lip 31, 2013 10:32:48 AM AppServerStartup run
      INFO: [Thread[GlassFish Kernel Main Thread,5,main]] exiting
      

       

      Whats mean

      SEVERE: Implementing class

      java.lang.IncompatibleClassChangeError: Implementing class

       

      but which class is incompatible ?? :/

       

      this is my dependencies:

       

       

       <dependency>
            <artifactId>solr-solrj</artifactId>
            <groupId>org.apache.solr</groupId>
            <version>${solr.version}</version>
            <type>jar</type>
            <scope>test</scope>
          </dependency>
          
          <dependency>
            <groupId>org.slf4j</groupId>
            <artifactId>slf4j-api</artifactId>
            <version>1.7.5</version>
          </dependency>
          
          <dependency>
            <groupId>org.slf4j</groupId>
            <artifactId>slf4j-log4j12</artifactId>
            <version>1.7.5</version>
          </dependency>
      
          <dependency>
            <groupId>pl.pisystem.search</groupId>
            <artifactId>documents-search</artifactId>
            <version>${project.version}</version>
            <scope>test</scope>
          </dependency>
      
          <!-- WARNING! Dependencies listed below must be provided in a given order -->
          <dependency>
            <groupId>org.glassfish.main.extras</groupId>
            <artifactId>glassfish-embedded-all</artifactId>
            <version>${glassfish-embedded-all.version}</version>
            <exclusions>
              <exclusion>
                <groupId>org.slf4j</groupId>
                <artifactId>slf4j-api</artifactId>
              </exclusion>
            </exclusions>
            <type>jar</type>
            <scope>test</scope>
          </dependency>
      
      
          <dependency>
            <groupId>org.jboss.arquillian.container</groupId>
            <artifactId>arquillian-glassfish-embedded-3.1</artifactId>
            <version>1.0.0.CR3</version>
            <scope>test</scope>
          </dependency>
      
          <dependency>
            <groupId>org.jboss.arquillian.junit</groupId>
            <artifactId>arquillian-junit-container</artifactId>
            <scope>test</scope>
          </dependency>
      
          <dependency>
            <groupId>javax</groupId>
            <artifactId>javaee-api</artifactId>
            <version>${javaee-api.version}</version>
            <scope>provided</scope>
          </dependency>
      

       

       

      Any Idea what is wrong with my configuration ther is problem with slf4j or something else ???