1 Reply Latest reply on Apr 26, 2015 1:17 PM by Anup Ghosh

    JaCoCo - org.jboss.shrinkwrap.api.importer.ArchiveImportException: Could not import stream

    Rafael Pestano Novice

      Hi everyone,

       

      I've been working with jacoco extension in last days(you can see by my posts here ) and its working great now, except for one project where i receive a org.jboss.shrinkwrap.api.importer.ArchiveImportException: Could not import stream when i activate jacoco profile.

       

      Sorry but i have no idea how to deal with this kind of error, maybe i should checkout sources and debug the extension but for now i have debug output and dependency tree:

       

      -------------------------------------------------------
       T E S T S
      -------------------------------------------------------
      Running com.procergs.test.integration.ChsIt
      (E) ManagerProcessing
          (O) LoadableExtensionLoader.load
          (E) ServiceLoader
      log4j:WARN No appenders could be found for logger (org.jboss.logging).
      log4j:WARN Please initialize the log4j system properly.
      log4j:WARN See http://logging.apache.org/log4j/1.2/faq.html#noconfig for more info.
      (E) ManagerStarted
          (O) ConfigurationRegistrar.loadConfiguration
          (E) ArquillianDescriptor
              (O) ContainerRegistryCreator.createRegistry
              (E) ContainerRegistry
              (O) ScriptingConfigurationClientSideProducer.observe
              (E) ScriptingConfiguration
              (O) JacocoConfigurator.configure
              (E) JacocoConfiguration
              (O) PersistenceConfigurationClientSideProducer.observe
              (E) PersistenceConfiguration
              (O) TransactionConfigurationProducer.loadConfiguration
              (E) TransactionConfiguration
              (O) DBUnitConfigurationClientSideProducer.observe
              (E) DBUnitConfiguration
              (O) ProtocolRegistryCreator.createRegistry
              (E) ProtocolRegistry
      (E) BeforeSuite
          (I) TestContextHandler.createSuiteContext
          (O) GrapheneRuntimeInitializer.injectGrapheneRuntime
          (O) ViewResourcesUnpacker.extractResources
          (O) ReusableRemoteWebDriverExtension.initialize
          (E) ReusedSessionPermanentStorage
      Jun 02, 2014 5:16:58 PM org.jboss.arquillian.drone.webdriver.factory.remote.reusable.ReusedSessionPermanentFileStorage readStore
      Informações: Reused session store is not available at C:\Users\rafael-pestano\.drone-webdriver-session-store, a new one will be created.
          (E) ReusedSessionStore
          (E) InitializationParametersMap
          (O) BrowserCapabilitiesRegistrar.register
          (E) BrowserCapabilitiesRegistry
          (O) ContainerEventController.execute
          (E) ContainerMultiControlEvent
              (O) ClientDeployerCreator.createClientSideDeployer
              (E) Deployer
              (O) ClientContainerControllerCreator.createClientSideContainerController
              (E) ContainerController
              (O) ContainerLifecycleController.setupContainers
              (E) SetupContainer
                  (I) ContainerDeploymentContextHandler.createContainerContext
                  (O) ContainerLifecycleController.setupContainer
                  (E) BeforeSetup
                  (E) Container
                  (E) AfterSetup
          (E) ContainerMultiControlEvent
              (O) ContainerLifecycleController.startSuiteContainers
              (E) StartContainer
                  (I) ContainerDeploymentContextHandler.createContainerContext
                  (O) ContainerLifecycleController.startContainer
                  (E) BeforeStart
                  (E) ManagementClient
                  (E) ArchiveDeployer
                  (E) InitialContext
                  (E) AfterStart
          (O) DroneRegistrar.register
          (E) DroneRegistry
              (O) DroneExecutorService.register
              (E) DroneExecutorService
      (E) BeforeClass
          (I) TestContextHandler.createClassContext
          (E) TestClass
          (I) TestContextHandler.createSuiteContext
          (O) GrapheneConfigurator.configureGraphene
          (E) DroneConfiguration
          (E) GrapheneConfigured
          (O) DroneConfigurator.prepareGlobalDroneConfiguration
          (E) DroneContext
          (E) DroneConfigurationEvent
          (E) DroneConfigurationEvent
              (O) DroneCallableCreator.createDroneCallable
              (E) DroneLifecycleEvent
              (E) DroneLifecycleEvent
          (O) DroneConfigurator.prepareDroneConfiguration
          (O) ContainerRestarter.restart
          (O) ContainerEventController.execute
          (E) ContainerMultiControlEvent
              (O) ContainerLifecycleController.startClassContainers
          (E) Event
              (O) DeploymentGenerator.generateDeployment
      c0928aa0-6aa7-4589-81ec-204ae73e66bd.war:
      /WEB-INF/
      /WEB-INF/lib/
      /WEB-INF/lib/PRAssinador-WS-Client-2.0.1.jar
      /WEB-INF/lib/sca-ws-1.0.3.jar
      /WEB-INF/lib/httpcore-4.2.5.jar
      /WEB-INF/lib/jackson-core-asl-1.5.5.jar
      /WEB-INF/lib/detcredenciadoarq3-2013.07.26_15-55.jar
      /WEB-INF/lib/commons-lang3-3.1.jar
      /WEB-INF/lib/prarqjava4-0.9.11.jar
      /WEB-INF/lib/ied-lib-util-1.0.6.jar
      /WEB-INF/lib/sca-ws-1.0.2.jar
      /WEB-INF/lib/primefaces-extensions-1.2.1.jar
      /WEB-INF/lib/log4j-1.2.13.jar
      /WEB-INF/lib/jasperreports-5.1.2.jar
      /WEB-INF/lib/ed_det-2013.08.13_16-48.jar
      /WEB-INF/lib/omnifaces-1.6.jar
      /WEB-INF/lib/primefaces-4.0.9.jar
      /WEB-INF/lib/gson-2.2.4.jar
      /WEB-INF/lib/PRArqjava-core-1.16.0.jar
      /WEB-INF/lib/detcredenciadows-1.0.1.jar
      /WEB-INF/lib/myfaces-extcdi-bundle-jsf20-1.0.5.jar
      /WEB-INF/faces-config.xml
      /WEB-INF/beans.xml
      /WEB-INF/jboss-deployment-structure.xml
      /WEB-INF/web.xml
      /WEB-INF/jbossas-ds.xml
      /WEB-INF/classes/
      /WEB-INF/classes/messages_pt.properties
      /WEB-INF/classes/messages_en.properties
      /WEB-INF/classes/com/
      /WEB-INF/classes/com/procergs/
      /WEB-INF/classes/com/procergs/test/
      /WEB-INF/classes/com/procergs/test/integration/
      /WEB-INF/classes/com/procergs/test/integration/vagas/
      /WEB-INF/classes/com/procergs/test/integration/vagas/VagasIT.class
      /WEB-INF/classes/com/procergs/test/integration/nfg/
      /WEB-INF/classes/com/procergs/test/integration/nfg/NfgIT.class
      /WEB-INF/classes/com/procergs/test/integration/cidadao/
      /WEB-INF/classes/com/procergs/test/integration/cidadao/CidadaoIT.class
      /WEB-INF/classes/com/procergs/test/integration/BaseIt.class
      /WEB-INF/classes/com/procergs/test/integration/ChsIt.class
      /WEB-INF/classes/com/procergs/test/integration/sorteio/
      /WEB-INF/classes/com/procergs/test/integration/sorteio/SorteioIT.class
      /WEB-INF/classes/com/procergs/test/integration/inscricao/
      /WEB-INF/classes/com/procergs/test/integration/inscricao/InscricaoIT.class
      /WEB-INF/classes/com/procergs/test/database/
      /WEB-INF/classes/com/procergs/test/database/DatabaseController.class
      /WEB-INF/classes/com/procergs/test/util/
      /WEB-INF/classes/com/procergs/test/util/GeradorDados.class
      /WEB-INF/classes/com/procergs/chs/
      /WEB-INF/classes/com/procergs/chs/rest/
      /WEB-INF/classes/com/procergs/chs/rest/rmr/
      /WEB-INF/classes/com/procergs/chs/rest/rmr/RmrMotivoEnum.class
      /WEB-INF/classes/com/procergs/chs/rest/rmr/RmrController.class
      /WEB-INF/classes/com/procergs/chs/rest/rmr/RmrController$1.class
      /WEB-INF/classes/com/procergs/chs/rest/rmr/InscricaoRestED.class
      /WEB-INF/classes/com/procergs/chs/sorteio/
      /WEB-INF/classes/com/procergs/chs/sorteio/SorteioRN.class
      /WEB-INF/classes/com/procergs/chs/sorteio/SorteioBD.class
      /WEB-INF/classes/com/procergs/chs/sorteio/SorteioRNVal.class
      /WEB-INF/classes/com/procergs/chs/infra/
      /WEB-INF/classes/com/procergs/chs/infra/AppBD.class
      /WEB-INF/classes/com/procergs/chs/infra/AppInterceptorImpl.class
      /WEB-INF/classes/com/procergs/chs/infra/AppInterceptor.class
      /WEB-INF/classes/com/procergs/chs/infra/AppBDKgid.class
      /WEB-INF/classes/com/procergs/chs/infra/AppFormMB.class
      /WEB-INF/classes/com/procergs/chs/infra/AppED.class
      /WEB-INF/classes/com/procergs/chs/infra/AutocompleteComposite.class
      /WEB-INF/classes/com/procergs/chs/infra/DaemonThreadFactory.class
      /WEB-INF/classes/com/procergs/chs/infra/ThreadExecutor.class
      /WEB-INF/classes/com/procergs/chs/infra/AppListMB.class
      /WEB-INF/classes/com/procergs/chs/infra/Finder.class
      /WEB-INF/classes/com/procergs/chs/infra/AppRN.class
      /WEB-INF/classes/com/procergs/chs/infra/ScaSessionED.class
      /WEB-INF/classes/com/procergs/chs/infra/AppKgidED.class
      /WEB-INF/classes/com/procergs/chs/inscricao/
      /WEB-INF/classes/com/procergs/chs/inscricao/homologacao/
      /WEB-INF/classes/com/procergs/chs/inscricao/homologacao/InscricaoHomologacaoRNVal.class
      /WEB-INF/classes/com/procergs/chs/inscricao/homologacao/InscricaoHomologacaoBD.class
      /WEB-INF/classes/com/procergs/chs/inscricao/homologacao/InscricaoHomologacaoRN.class
      /WEB-INF/classes/com/procergs/chs/inscricao/Kgid161dBD.class
      /WEB-INF/classes/com/procergs/chs/inscricao/ed/
      /WEB-INF/classes/com/procergs/chs/inscricao/ed/InscricaoCupomED.class
      /WEB-INF/classes/com/procergs/chs/inscricao/InscricaoRNVal.class
      /WEB-INF/classes/com/procergs/chs/inscricao/InscricaoRN$1.class
      /WEB-INF/classes/com/procergs/chs/inscricao/InscricaoRN.class
      /WEB-INF/classes/com/procergs/chs/inscricao/InscricaoBD.class
      /WEB-INF/classes/com/procergs/chs/web/
      /WEB-INF/classes/com/procergs/chs/web/CidadaoListMB.class
      /WEB-INF/classes/com/procergs/chs/web/CidadaoFormMB.class
      /WEB-INF/classes/com/procergs/chs/web/SorteioFormMB$1.class
      /WEB-INF/classes/com/procergs/chs/web/AcompanhamentoListMB$1.class
      /WEB-INF/classes/com/procergs/chs/web/ApplicationCache.class
      /WEB-INF/classes/com/procergs/chs/web/SorteioListMB.class
      /WEB-INF/classes/com/procergs/chs/web/AcompanhamentoListMB.class
      /WEB-INF/classes/com/procergs/chs/web/servlet/
      /WEB-INF/classes/com/procergs/chs/web/SessionCache.class
      /WEB-INF/classes/com/procergs/chs/web/InscricaoFormMB.class
      /WEB-INF/classes/com/procergs/chs/web/HomologacaoDetranListMB.class
      /WEB-INF/classes/com/procergs/chs/web/ListasSessionMB.class
      /WEB-INF/classes/com/procergs/chs/web/InscricaoListMB.class
      /WEB-INF/classes/com/procergs/chs/web/SorteioFormMB.class
      /WEB-INF/classes/com/procergs/chs/converter/
      /WEB-INF/classes/com/procergs/chs/converter/TipoDocumentoConverter.class
      /WEB-INF/classes/com/procergs/chs/converter/TipoSituacaoSorteioConverter.class
      /WEB-INF/classes/com/procergs/chs/converter/StringTrimConverter.class
      /WEB-INF/classes/com/procergs/chs/converter/SituacaoRenachConverter.class
      /WEB-INF/classes/com/procergs/chs/converter/TipoServicoConverter.class
      /WEB-INF/classes/com/procergs/chs/converter/TipoProcessoSeletivoConverter.class
      /WEB-INF/classes/com/procergs/chs/converter/TipoSituacaoInscricaoConverter.class
      /WEB-INF/classes/com/procergs/chs/converter/TipoInscricaoConverter.class
      /WEB-INF/classes/com/procergs/chs/validator/
      /WEB-INF/classes/com/procergs/chs/validator/NomeValidator.class
      /WEB-INF/classes/com/procergs/chs/validator/CnhValidator.class
      /WEB-INF/classes/com/procergs/chs/validator/CpfValidator.class
      /WEB-INF/classes/com/procergs/chs/validator/DtNascValidator.class
      /WEB-INF/classes/com/procergs/chs/validator/NisValidator.class
      /WEB-INF/classes/com/procergs/chs/diaLoteProc/
      /WEB-INF/classes/com/procergs/chs/diaLoteProc/DiaLoteProcBD.class
      /WEB-INF/classes/com/procergs/chs/vagas/
      /WEB-INF/classes/com/procergs/chs/vagas/VagasRN.class
      /WEB-INF/classes/com/procergs/chs/vagas/VagasBD.class
      /WEB-INF/classes/com/procergs/chs/vagas/VagasRNVal.class
      /WEB-INF/classes/com/procergs/chs/cidadao/
      /WEB-INF/classes/com/procergs/chs/cidadao/CidadaoRNVal.class
      /WEB-INF/classes/com/procergs/chs/cidadao/CidadaoRN.class
      /WEB-INF/classes/com/procergs/chs/cidadao/CidadaoBD.class
      /WEB-INF/classes/com/procergs/chs/chamada/
      /WEB-INF/classes/com/procergs/chs/chamada/ChamadaRNVal.class
      /WEB-INF/classes/com/procergs/chs/chamada/ChamadaRN.class
      /WEB-INF/classes/com/procergs/chs/chamada/ChamadaBD.class
      /WEB-INF/classes/com/procergs/chs/event/
      /WEB-INF/classes/com/procergs/chs/event/PeriodoChangeEvent.class
      /WEB-INF/classes/com/procergs/chs/arquivo/
      /WEB-INF/classes/com/procergs/chs/arquivo/ArquivoRN.class
      /WEB-INF/classes/com/procergs/chs/arquivo/ArquivoBD.class
      /WEB-INF/classes/com/procergs/chs/arquivo/ArquivoRN$1.class
      /WEB-INF/classes/com/procergs/chs/nfg/
      /WEB-INF/classes/com/procergs/chs/nfg/CupomReader.class
      /WEB-INF/classes/com/procergs/chs/nfg/HashReader.class
      /WEB-INF/classes/com/procergs/chs/nfg/NfgRN.class
      /WEB-INF/classes/com/procergs/chs/gid/
      /WEB-INF/classes/com/procergs/chs/gid/GidController.class
      /WEB-INF/classes/com/procergs/chs/ed/
      /WEB-INF/classes/com/procergs/chs/ed/CredenciadoED.class
      /WEB-INF/classes/com/procergs/chs/ed/VagasED.class
      /WEB-INF/classes/com/procergs/chs/ed/ArquivoED.class
      /WEB-INF/classes/com/procergs/chs/ed/InscricaoED$1.class
      /WEB-INF/classes/com/procergs/chs/ed/InscricaoHomologacaoED.class
      /WEB-INF/classes/com/procergs/chs/ed/enums/
      /WEB-INF/classes/com/procergs/chs/ed/enums/TipoDocumentoEnum$1.class
      /WEB-INF/classes/com/procergs/chs/ed/enums/SituacaoRenachEnum.class
      /WEB-INF/classes/com/procergs/chs/ed/enums/TipoProcessoSeletivoEnum.class
      /WEB-INF/classes/com/procergs/chs/ed/enums/EstadosEnum.class
      /WEB-INF/classes/com/procergs/chs/ed/enums/TipoServicoEnum.class
      /WEB-INF/classes/com/procergs/chs/ed/enums/TipoArquivoEnum.class
      /WEB-INF/classes/com/procergs/chs/ed/enums/NumeroSorteioEnum.class
      /WEB-INF/classes/com/procergs/chs/ed/enums/NumeroSorteioEnum$1.class
      /WEB-INF/classes/com/procergs/chs/ed/enums/TipoDocumentoEnum.class
      /WEB-INF/classes/com/procergs/chs/ed/enums/TipoVagaEnum.class
      /WEB-INF/classes/com/procergs/chs/ed/enums/TipoSituacaoSorteioEnum.class
      /WEB-INF/classes/com/procergs/chs/ed/enums/TipoCategoriaEnum.class
      /WEB-INF/classes/com/procergs/chs/ed/enums/NomeCampoCondutor.class
      /WEB-INF/classes/com/procergs/chs/ed/enums/TipoSituacaoInscricaoEnum.class
      /WEB-INF/classes/com/procergs/chs/ed/VagasED$1.class
      /WEB-INF/classes/com/procergs/chs/ed/DiaLoteProcessadoED.class
      /WEB-INF/classes/com/procergs/chs/ed/CidadaoED.class
      /WEB-INF/classes/com/procergs/chs/ed/PremioED.class
      /WEB-INF/classes/com/procergs/chs/ed/BalanceamentoED.class
      /WEB-INF/classes/com/procergs/chs/ed/ResultadoNfgED.class
      /WEB-INF/classes/com/procergs/chs/ed/ChamadaED.class
      /WEB-INF/classes/com/procergs/chs/ed/CotasED.class
      /WEB-INF/classes/com/procergs/chs/ed/DiaLoteProcessadoPK.class
      /WEB-INF/classes/com/procergs/chs/ed/report/
      /WEB-INF/classes/com/procergs/chs/ed/report/InscritoReportED.class
      /WEB-INF/classes/com/procergs/chs/ed/report/ContempladoReportED.class
      /WEB-INF/classes/com/procergs/chs/ed/report/ComprovanteReportED.class
      /WEB-INF/classes/com/procergs/chs/ed/TesteGidED.class
      /WEB-INF/classes/com/procergs/chs/ed/DadosCondutorED.class
      /WEB-INF/classes/com/procergs/chs/ed/SorteioED.class
      /WEB-INF/classes/com/procergs/chs/ed/kgid/
      /WEB-INF/classes/com/procergs/chs/ed/kgid/Kgid161dED.class
      /WEB-INF/classes/com/procergs/chs/ed/InscricaoED.class
      /WEB-INF/classes/com/procergs/chs/cotas/
      /WEB-INF/classes/com/procergs/chs/cotas/CotasRN.class
      /WEB-INF/classes/com/procergs/chs/cotas/CotasBD.class
      /WEB-INF/classes/com/procergs/chs/annotation/
      /WEB-INF/classes/com/procergs/chs/annotation/Ignore.class
      /WEB-INF/classes/com/procergs/chs/annotation/SorteioCorrente$PeriodoSorteioCorrente.class
      /WEB-INF/classes/com/procergs/chs/annotation/Batch.class
      /WEB-INF/classes/com/procergs/chs/annotation/SorteioCorrente.class
      /WEB-INF/classes/com/procergs/chs/annotation/SituacaoSorteio.class
      /WEB-INF/classes/com/procergs/chs/annotation/DateFormat.class
      /WEB-INF/classes/com/procergs/chs/util/
      /WEB-INF/classes/com/procergs/chs/util/ChsVersion.class
      /WEB-INF/classes/com/procergs/chs/util/ChsGCIUnisys.class
      /WEB-INF/classes/com/procergs/chs/util/UtilChs.class
      /WEB-INF/classes/com/procergs/chs/util/ArquivoController.class
      /WEB-INF/classes/com/procergs/chs/util/Producers.class
      /WEB-INF/classes/com/procergs/chs/util/DadosSessaoUtil.class
      /WEB-INF/classes/com/procergs/chs/util/FormatadorGCI.class
      /WEB-INF/classes/com/procergs/chs/util/ChsWebUtil.class
      /WEB-INF/classes/com/procergs/chs/util/UtilChs$1.class
      /WEB-INF/classes/com/procergs/chs/balanceamento/
      /WEB-INF/classes/com/procergs/chs/balanceamento/BalanceamentoController.class
      /WEB-INF/classes/com/procergs/chs/credenciado/
      /WEB-INF/classes/com/procergs/chs/credenciado/DetCredenciadoRemote.class
      /WEB-INF/classes/com/procergs/chs/credenciado/CredenciadoController.class
      /WEB-INF/classes/META-INF/
      /WEB-INF/classes/META-INF/persistence.xml
      /WEB-INF/classes/sorteios_nfg/
      /WEB-INF/classes/sorteios_nfg/SorteioCHS_00007.txt
      /WEB-INF/classes/sorteios_nfg/SorteioCHS_00006.txt
      /WEB-INF/classes/sorteios_nfg/SorteioCHS_00003.txt
      /WEB-INF/classes/sorteios_nfg/SorteioCHS_00002.txt
      /WEB-INF/classes/sorteios_nfg/SorteioCHS_Bilhetes_Inv_00001.txt
      /WEB-INF/classes/sorteios_nfg/SorteioCHS_00008.txt
      /WEB-INF/classes/sorteios_nfg/SorteioCHS_Premios_Inv_00001.txt
      /WEB-INF/classes/sorteios_nfg/SorteioCHS_00004.txt
      /WEB-INF/classes/sorteios_nfg/SorteioCHS_00001.txt
      /WEB-INF/classes/sorteios_nfg/SorteioCHS_00005.txt
      /WEB-INF/classes/application.properties
              (E) ArchiveImportException
              (E) ArchiveImportException
          (E) ArchiveImportException
          (E) ArchiveImportException
      (E) AfterClass
          (I) TestContextHandler.createClassContext
          (E) TestClass
          (I) TestContextHandler.createSuiteContext
          (O) ClientBeforeAfterLifecycleEventExecuter.on
          (O) DroneDestructor.destroyClassScopedDrone
          (O) ContainerEventController.execute
          (E) ContainerMultiControlEvent
              (O) ContainerDeployController.undeployManaged
          (E) ContainerMultiControlEvent
              (O) ContainerLifecycleController.stopManualContainers
          (E) ContainerMultiControlEvent
              (O) ContainerLifecycleController.stopClassContainers
          (O) ServerSetupObserver.afterTestClass
          (O) GrapheneConfigurator.unconfigureGraphene
          (E) GrapheneUnconfigured
      Tests run: 1, Failures: 0, Errors: 1, Skipped: 0, Time elapsed: 6.987 sec <<< FAILURE! - in com.procergs.test.integration.ChsIt
      com.procergs.test.integration.ChsIt  Time elapsed: 6.986 sec  <<< ERROR!
      org.jboss.shrinkwrap.api.importer.ArchiveImportException: Could not import stream
          at org.jboss.shrinkwrap.impl.base.importer.zip.ZipImporterImpl.importFrom(ZipImporterImpl.java:125)
          at org.jboss.shrinkwrap.impl.base.importer.zip.ZipImporterImpl.importFrom(ZipImporterImpl.java:45)
          at org.jboss.shrinkwrap.impl.base.ArchiveBase.getAsType(ArchiveBase.java:307)
          at org.jboss.shrinkwrap.impl.base.ArchiveBase.getAsType(ArchiveBase.java:259)
          at org.jboss.shrinkwrap.impl.base.container.ContainerBase.getAsType(ContainerBase.java:433)
          at org.jboss.arquillian.extension.jacoco.client.ApplicationArchiveInstrumenter.processArchive(ApplicationArchiveInstrumenter.java:67)
          at org.jboss.arquillian.extension.jacoco.client.ApplicationArchiveInstrumenter.process(ApplicationArchiveInstrumenter.java:74)
          at org.jboss.arquillian.container.test.impl.client.deployment.DeploymentGenerator.applyApplicationProcessors(DeploymentGenerator.java:223)
          at org.jboss.arquillian.container.test.impl.client.deployment.DeploymentGenerator.buildTestableDeployments(DeploymentGenerator.java:172)
          at org.jboss.arquillian.container.test.impl.client.deployment.DeploymentGenerator.createTestableDeployments(DeploymentGenerator.java:148)
          at org.jboss.arquillian.container.test.impl.client.deployment.DeploymentGenerator.generateDeployment(DeploymentGenerator.java:85)
          at sun.reflect.NativeMethodAccessorImpl.invoke0(Native Method)
          at sun.reflect.NativeMethodAccessorImpl.invoke(NativeMethodAccessorImpl.java:57)
          at sun.reflect.DelegatingMethodAccessorImpl.invoke(DelegatingMethodAccessorImpl.java:43)
          at java.lang.reflect.Method.invoke(Method.java:606)
          at org.jboss.arquillian.core.impl.ObserverImpl.invoke(ObserverImpl.java:94)
          at org.jboss.arquillian.core.impl.EventContextImpl.invokeObservers(EventContextImpl.java:99)
          at org.jboss.arquillian.core.impl.EventContextImpl.proceed(EventContextImpl.java:81)
          at org.jboss.arquillian.core.impl.ManagerImpl.fire(ManagerImpl.java:145)
          at org.jboss.arquillian.core.impl.ManagerImpl.fire(ManagerImpl.java:116)
          at org.jboss.arquillian.core.impl.EventImpl.fire(EventImpl.java:67)
          at org.jboss.arquillian.container.test.impl.client.ContainerEventController.execute(ContainerEventController.java:100)
          at sun.reflect.NativeMethodAccessorImpl.invoke0(Native Method)
          at sun.reflect.NativeMethodAccessorImpl.invoke(NativeMethodAccessorImpl.java:57)
          at sun.reflect.DelegatingMethodAccessorImpl.invoke(DelegatingMethodAccessorImpl.java:43)
          at java.lang.reflect.Method.invoke(Method.java:606)
          at org.jboss.arquillian.core.impl.ObserverImpl.invoke(ObserverImpl.java:94)
          at org.jboss.arquillian.core.impl.EventContextImpl.invokeObservers(EventContextImpl.java:99)
          at org.jboss.arquillian.core.impl.EventContextImpl.proceed(EventContextImpl.java:81)
          at org.jboss.arquillian.test.impl.TestContextHandler.createSuiteContext(TestContextHandler.java:65)
          at sun.reflect.NativeMethodAccessorImpl.invoke0(Native Method)
          at sun.reflect.NativeMethodAccessorImpl.invoke(NativeMethodAccessorImpl.java:57)
          at sun.reflect.DelegatingMethodAccessorImpl.invoke(DelegatingMethodAccessorImpl.java:43)
          at java.lang.reflect.Method.invoke(Method.java:606)
          at org.jboss.arquillian.core.impl.ObserverImpl.invoke(ObserverImpl.java:94)
          at org.jboss.arquillian.core.impl.EventContextImpl.proceed(EventContextImpl.java:88)
          at org.jboss.arquillian.test.impl.TestContextHandler.createClassContext(TestContextHandler.java:84)
          at sun.reflect.NativeMethodAccessorImpl.invoke0(Native Method)
          at sun.reflect.NativeMethodAccessorImpl.invoke(NativeMethodAccessorImpl.java:57)
          at sun.reflect.DelegatingMethodAccessorImpl.invoke(DelegatingMethodAccessorImpl.java:43)
          at java.lang.reflect.Method.invoke(Method.java:606)
          at org.jboss.arquillian.core.impl.ObserverImpl.invoke(ObserverImpl.java:94)
          at org.jboss.arquillian.core.impl.EventContextImpl.proceed(EventContextImpl.java:88)
          at org.jboss.arquillian.core.impl.ManagerImpl.fire(ManagerImpl.java:145)
          at org.jboss.arquillian.core.impl.ManagerImpl.fire(ManagerImpl.java:116)
          at org.jboss.arquillian.test.impl.EventTestRunnerAdaptor.beforeClass(EventTestRunnerAdaptor.java:80)
          at org.jboss.arquillian.junit.Arquillian$2.evaluate(Arquillian.java:185)
          at org.jboss.arquillian.junit.Arquillian.multiExecute(Arquillian.java:317)
          at org.jboss.arquillian.junit.Arquillian.access$200(Arquillian.java:46)
          at org.jboss.arquillian.junit.Arquillian$3.evaluate(Arquillian.java:202)
          at org.junit.runners.ParentRunner.run(ParentRunner.java:236)
          at org.jboss.arquillian.junit.Arquillian.run(Arquillian.java:150)
          at org.apache.maven.surefire.junit4.JUnit4Provider.execute(JUnit4Provider.java:264)
          at org.apache.maven.surefire.junit4.JUnit4Provider.executeTestSet(JUnit4Provider.java:153)
          at org.apache.maven.surefire.junit4.JUnit4Provider.invoke(JUnit4Provider.java:124)
          at org.apache.maven.surefire.booter.ForkedBooter.invokeProviderInSameClassLoader(ForkedBooter.java:200)
          at org.apache.maven.surefire.booter.ForkedBooter.runSuitesInProcess(ForkedBooter.java:153)
          at org.apache.maven.surefire.booter.ForkedBooter.main(ForkedBooter.java:103)
      Caused by: java.util.zip.ZipException: invalid entry size (expected 2249523208 but got 916 bytes)
          at java.util.zip.ZipInputStream.readEnd(ZipInputStream.java:403)
          at java.util.zip.ZipInputStream.read(ZipInputStream.java:195)
          at java.io.FilterInputStream.read(FilterInputStream.java:107)
          at org.jboss.shrinkwrap.impl.base.io.IOUtil.copy(IOUtil.java:138)
          at org.jboss.shrinkwrap.impl.base.importer.zip.ZipImporterImpl.importFrom(ZipImporterImpl.java:120)
          at org.jboss.shrinkwrap.impl.base.importer.zip.ZipImporterImpl.importFrom(ZipImporterImpl.java:45)
          at org.jboss.shrinkwrap.impl.base.ArchiveBase.getAsType(ArchiveBase.java:307)
          at org.jboss.shrinkwrap.impl.base.ArchiveBase.getAsType(ArchiveBase.java:259)
          at org.jboss.shrinkwrap.impl.base.container.ContainerBase.getAsType(ContainerBase.java:433)
          at org.jboss.arquillian.extension.jacoco.client.ApplicationArchiveInstrumenter.processArchive(ApplicationArchiveInstrumenter.java:67)
          at org.jboss.arquillian.extension.jacoco.client.ApplicationArchiveInstrumenter.process(ApplicationArchiveInstrumenter.java:74)
          at org.jboss.arquillian.container.test.impl.client.deployment.DeploymentGenerator.applyApplicationProcessors(DeploymentGenerator.java:223)
          at org.jboss.arquillian.container.test.impl.client.deployment.DeploymentGenerator.buildTestableDeployments(DeploymentGenerator.java:172)
          at org.jboss.arquillian.container.test.impl.client.deployment.DeploymentGenerator.createTestableDeployments(DeploymentGenerator.java:148)
          at org.jboss.arquillian.container.test.impl.client.deployment.DeploymentGenerator.generateDeployment(DeploymentGenerator.java:85)
          at sun.reflect.NativeMethodAccessorImpl.invoke0(Native Method)
          at sun.reflect.NativeMethodAccessorImpl.invoke(NativeMethodAccessorImpl.java:57)
          at sun.reflect.DelegatingMethodAccessorImpl.invoke(DelegatingMethodAccessorImpl.java:43)
          at java.lang.reflect.Method.invoke(Method.java:606)
          at org.jboss.arquillian.core.impl.ObserverImpl.invoke(ObserverImpl.java:94)
          at org.jboss.arquillian.core.impl.EventContextImpl.invokeObservers(EventContextImpl.java:99)
          at org.jboss.arquillian.core.impl.EventContextImpl.proceed(EventContextImpl.java:81)
          at org.jboss.arquillian.core.impl.ManagerImpl.fire(ManagerImpl.java:145)
          at org.jboss.arquillian.core.impl.ManagerImpl.fire(ManagerImpl.java:116)
          at org.jboss.arquillian.core.impl.EventImpl.fire(EventImpl.java:67)
          at org.jboss.arquillian.container.test.impl.client.ContainerEventController.execute(ContainerEventController.java:100)
          at sun.reflect.NativeMethodAccessorImpl.invoke0(Native Method)
          at sun.reflect.NativeMethodAccessorImpl.invoke(NativeMethodAccessorImpl.java:57)
          at sun.reflect.DelegatingMethodAccessorImpl.invoke(DelegatingMethodAccessorImpl.java:43)
          at java.lang.reflect.Method.invoke(Method.java:606)
          at org.jboss.arquillian.core.impl.ObserverImpl.invoke(ObserverImpl.java:94)
          at org.jboss.arquillian.core.impl.EventContextImpl.invokeObservers(EventContextImpl.java:99)
          at org.jboss.arquillian.core.impl.EventContextImpl.proceed(EventContextImpl.java:81)
          at org.jboss.arquillian.test.impl.TestContextHandler.createSuiteContext(TestContextHandler.java:65)
          at sun.reflect.NativeMethodAccessorImpl.invoke0(Native Method)
          at sun.reflect.NativeMethodAccessorImpl.invoke(NativeMethodAccessorImpl.java:57)
          at sun.reflect.DelegatingMethodAccessorImpl.invoke(DelegatingMethodAccessorImpl.java:43)
          at java.lang.reflect.Method.invoke(Method.java:606)
          at org.jboss.arquillian.core.impl.ObserverImpl.invoke(ObserverImpl.java:94)
          at org.jboss.arquillian.core.impl.EventContextImpl.proceed(EventContextImpl.java:88)
          at org.jboss.arquillian.test.impl.TestContextHandler.createClassContext(TestContextHandler.java:84)
          at sun.reflect.NativeMethodAccessorImpl.invoke0(Native Method)
          at sun.reflect.NativeMethodAccessorImpl.invoke(NativeMethodAccessorImpl.java:57)
          at sun.reflect.DelegatingMethodAccessorImpl.invoke(DelegatingMethodAccessorImpl.java:43)
          at java.lang.reflect.Method.invoke(Method.java:606)
          at org.jboss.arquillian.core.impl.ObserverImpl.invoke(ObserverImpl.java:94)
          at org.jboss.arquillian.core.impl.EventContextImpl.proceed(EventContextImpl.java:88)
          at org.jboss.arquillian.core.impl.ManagerImpl.fire(ManagerImpl.java:145)
          at org.jboss.arquillian.core.impl.ManagerImpl.fire(ManagerImpl.java:116)
          at org.jboss.arquillian.test.impl.EventTestRunnerAdaptor.beforeClass(EventTestRunnerAdaptor.java:80)
          at org.jboss.arquillian.junit.Arquillian$2.evaluate(Arquillian.java:185)
          at org.jboss.arquillian.junit.Arquillian.multiExecute(Arquillian.java:317)
          at org.jboss.arquillian.junit.Arquillian.access$200(Arquillian.java:46)
          at org.jboss.arquillian.junit.Arquillian$3.evaluate(Arquillian.java:202)
          at org.junit.runners.ParentRunner.run(ParentRunner.java:236)
          at org.jboss.arquillian.junit.Arquillian.run(Arquillian.java:150)
          at org.apache.maven.surefire.junit4.JUnit4Provider.execute(JUnit4Provider.java:264)
          at org.apache.maven.surefire.junit4.JUnit4Provider.executeTestSet(JUnit4Provider.java:153)
          at org.apache.maven.surefire.junit4.JUnit4Provider.invoke(JUnit4Provider.java:124)
          at org.apache.maven.surefire.booter.ForkedBooter.invokeProviderInSameClassLoader(ForkedBooter.java:200)
          at org.apache.maven.surefire.booter.ForkedBooter.runSuitesInProcess(ForkedBooter.java:153)
          at org.apache.maven.surefire.booter.ForkedBooter.main(ForkedBooter.java:103)
      
      (E) AfterSuite
          (I) TestContextHandler.createSuiteContext
          (O) GrapheneRuntimeInitializer.cleanGrapheneRuntime
          (O) ContainerEventController.execute
          (E) ContainerMultiControlEvent
              (O) ContainerLifecycleController.stopSuiteContainers
              (E) StopContainer
                  (I) ContainerDeploymentContextHandler.createContainerContext
                  (O) ContainerLifecycleController.stopContainer
                  (E) BeforeStop
                      (O) ArquillianServiceDeployer.undeploy
                  (E) AfterStop
      (E) ManagerStopping
          (O) DroneExecutorService.shutdown
      
      Results :
      
      Tests in error: 
        ChsIt.com.procergs.test.integration.ChsIt » ArchiveImport Could not import str...
      
      Tests run: 1, Failures: 0, Errors: 1, Skipped: 0
      
      [INFO] ------------------------------------------------------------------------
      [INFO] BUILD FAILURE
      [INFO] ------------------------------------------------------------------------
      [INFO] Total time: 19.363 s
      [INFO] Finished at: 2014-06-02T17:17:01-03:00
      [INFO] Final Memory: 53M/515M
      

       

      [INFO] Building chs 1.4.1
      [INFO] ------------------------------------------------------------------------
      [INFO] 
      [INFO] --- maven-dependency-plugin:2.8:tree (default-cli) @ chs ---
      [INFO] com.procergs.chs:chs:war:1.4.1
      [INFO] +- org.hibernate:hibernate-core:jar:4.1.3.Final:provided
      [INFO] |  +- antlr:antlr:jar:2.7.7:provided
      [INFO] |  +- org.jboss.logging:jboss-logging:jar:3.1.0.GA:provided
      [INFO] |  +- org.jboss.spec.javax.transaction:jboss-transaction-api_1.1_spec:jar:1.0.0.Final:provided
      [INFO] |  +- dom4j:dom4j:jar:1.6.1:provided
      [INFO] |  +- org.hibernate.javax.persistence:hibernate-jpa-2.0-api:jar:1.0.1.Final:provided
      [INFO] |  +- org.javassist:javassist:jar:3.15.0-GA:provided
      [INFO] |  \- org.hibernate.common:hibernate-commons-annotations:jar:4.0.1.Final:provided
      [INFO] +- org.hibernate:hibernate-entitymanager:jar:4.1.3.Final:provided
      [INFO] +- org.hibernate:hibernate-validator:jar:4.3.1.Final:provided
      [INFO] |  \- javax.validation:validation-api:jar:1.0.0.GA:provided
      [INFO] +- junit:junit:jar:4.8.2:test
      [INFO] +- org.powermock:powermock-module-junit4:jar:1.5:test
      [INFO] |  \- org.powermock:powermock-module-junit4-common:jar:1.5:test
      [INFO] |     +- org.powermock:powermock-core:jar:1.5:test
      [INFO] |     \- org.powermock:powermock-reflect:jar:1.5:test
      [INFO] |        \- org.objenesis:objenesis:jar:1.2:test
      [INFO] +- org.powermock:powermock-api-mockito:jar:1.5:test
      [INFO] |  +- org.mockito:mockito-all:jar:1.9.5:test
      [INFO] |  \- org.powermock:powermock-api-support:jar:1.5:test
      [INFO] +- org.apache.poi:poi:jar:3.7:compile
      [INFO] +- cglib:cglib-nodep:jar:2.1_3:compile
      [INFO] +- com.procergs.acr:prarqjava4:jar:0.9.11:compile
      [INFO] |  +- com.acrs:PRAssinador-WS-Client:jar:2.0.1:compile
      [INFO] |  \- com.procergs.sca:sca-ws:jar:1.0.3:compile
      [INFO] +- com.procergs.irs:prarqjava4-composite:jar:0.1.1:compile
      [INFO] +- com.procergs.det:detcredenciadows:jar:1.0.1:compile
      [INFO] +- org.jboss.resteasy:resteasy-jackson-provider:jar:2.3.5.Final:test
      [INFO] |  +- org.codehaus.jackson:jackson-mapper-asl:jar:1.9.9:test
      [INFO] |  +- org.codehaus.jackson:jackson-jaxrs:jar:1.9.9:test
      [INFO] |  \- org.codehaus.jackson:jackson-xc:jar:1.9.9:test
      [INFO] +- org.jboss.resteasy:resteasy-jaxrs:jar:2.3.3.Final:provided
      [INFO] |  +- org.jboss.resteasy:jaxrs-api:jar:2.3.3.Final:provided
      [INFO] |  +- org.scannotation:scannotation:jar:1.0.3:provided
      [INFO] |  |  \- javassist:javassist:jar:3.12.1.GA:provided
      [INFO] |  +- javax.annotation:jsr250-api:jar:1.0:provided
      [INFO] |  +- javax.activation:activation:jar:1.1:compile
      [INFO] |  +- commons-httpclient:commons-httpclient:jar:3.1:provided
      [INFO] |  |  \- commons-codec:commons-codec:jar:1.2:provided
      [INFO] |  +- org.apache.httpcomponents:httpclient:jar:4.1.2:provided
      [INFO] |  \- net.jcip:jcip-annotations:jar:1.0:provided
      [INFO] +- org.jboss.resteasy:resteasy-multipart-provider:jar:2.3.3.Final:provided
      [INFO] |  +- javax.mail:mail:jar:1.4.4:provided
      [INFO] |  +- org.apache.james:apache-mime4j:jar:0.6:provided
      [INFO] |  \- javax.servlet:servlet-api:jar:2.5:provided
      [INFO] +- org.codehaus.jackson:jackson-core-asl:jar:1.5.5:provided
      [INFO] +- org.jboss.resteasy:resteasy-jaxb-provider:jar:2.3.3.Final:compile
      [INFO] |  \- com.sun.xml.bind:jaxb-impl:jar:2.2.4:compile
      [INFO] |     \- javax.xml.bind:jaxb-api:jar:2.2.3:compile
      [INFO] |        \- javax.xml.stream:stax-api:jar:1.0-2:compile
      [INFO] +- org.primefaces:primefaces:jar:4.0.9:compile
      [INFO] +- org.primefaces.extensions:primefaces-extensions:jar:1.2.1:compile
      [INFO] |  +- com.google.code.gson:gson:jar:2.2.4:compile
      [INFO] |  \- org.apache.commons:commons-lang3:jar:3.1:compile
      [INFO] +- org.omnifaces:omnifaces:jar:1.6:compile
      [INFO] +- org.apache.myfaces.extensions.cdi.bundles:myfaces-extcdi-bundle-jsf20:jar:1.0.5:compile
      [INFO] +- org.slf4j:slf4j-api:jar:1.6.1:provided
      [INFO] +- net.bull.javamelody:javamelody-core:jar:1.45.0:compile
      [INFO] |  \- org.jrobin:jrobin:jar:1.5.9:compile
      [INFO] +- com.thoughtworks.xstream:xstream:jar:1.4.2:compile
      [INFO] |  +- xmlpull:xmlpull:jar:1.1.3.1:compile
      [INFO] |  \- xpp3:xpp3_min:jar:1.1.4c:compile
      [INFO] +- com.procergs.acr:PRArqjava-core:jar:1.16.0:compile
      [INFO] +- com.procergs.red:detcredenciadoarq3:jar:2013.07.26_15-55:compile
      [INFO] +- com.procergs.red:ed_det:jar:2013.08.13_16-48:compile
      [INFO] +- net.sf.jasperreports:jasperreports:jar:5.1.2:compile
      [INFO] |  +- commons-beanutils:commons-beanutils:jar:1.8.0:compile
      [INFO] |  +- commons-digester:commons-digester:jar:2.1:compile
      [INFO] |  +- commons-logging:commons-logging:jar:1.1.1:compile
      [INFO] |  +- jfree:jcommon:jar:1.0.15:compile
      [INFO] |  +- jfree:jfreechart:jar:1.0.12:compile
      [INFO] |  +- eclipse:jdtcore:jar:3.1.0:compile
      [INFO] |  +- org.codehaus.castor:castor:jar:1.2:compile
      [INFO] |  +- com.fasterxml.jackson.core:jackson-core:jar:2.0.5:compile
      [INFO] |  +- com.fasterxml.jackson.core:jackson-databind:jar:2.0.5:compile
      [INFO] |  \- com.fasterxml.jackson.core:jackson-annotations:jar:2.0.5:compile
      [INFO] +- com.lowagie:itext:jar:2.1.7:compile
      [INFO] |  +- bouncycastle:bcmail-jdk14:jar:138:compile
      [INFO] |  +- bouncycastle:bcprov-jdk14:jar:138:compile
      [INFO] |  \- org.bouncycastle:bctsp-jdk14:jar:1.38:compile
      [INFO] |     +- org.bouncycastle:bcprov-jdk14:jar:1.38:compile
      [INFO] |     \- org.bouncycastle:bcmail-jdk14:jar:1.38:compile
      [INFO] +- commons-fileupload:commons-fileupload:jar:1.2:compile
      [INFO] +- commons-io:commons-io:jar:2.4:compile
      [INFO] +- org.jboss.arquillian.junit:arquillian-junit-container:jar:1.1.4.Final:test
      [INFO] |  +- org.jboss.arquillian.junit:arquillian-junit-core:jar:1.1.4.Final:test
      [INFO] |  +- org.jboss.arquillian.test:arquillian-test-api:jar:1.1.4.Final:test
      [INFO] |  +- org.jboss.arquillian.test:arquillian-test-spi:jar:1.1.4.Final:test
      [INFO] |  +- org.jboss.arquillian.container:arquillian-container-test-api:jar:1.1.4.Final:test
      [INFO] |  +- org.jboss.arquillian.container:arquillian-container-test-spi:jar:1.1.4.Final:test
      [INFO] |  +- org.jboss.arquillian.core:arquillian-core-impl-base:jar:1.1.4.Final:test
      [INFO] |  +- org.jboss.arquillian.test:arquillian-test-impl-base:jar:1.1.4.Final:test
      [INFO] |  +- org.jboss.arquillian.container:arquillian-container-impl-base:jar:1.1.4.Final:test
      [INFO] |  |  \- org.jboss.arquillian.config:arquillian-config-impl-base:jar:1.1.4.Final:test
      [INFO] |  +- org.jboss.arquillian.container:arquillian-container-test-impl-base:jar:1.1.4.Final:test
      [INFO] |  \- org.jboss.shrinkwrap:shrinkwrap-impl-base:jar:1.2.2:test
      [INFO] |     \- org.jboss.shrinkwrap:shrinkwrap-spi:jar:1.2.2:test
      [INFO] +- org.jboss.arquillian.extension:arquillian-persistence-api:jar:1.0.0.Alpha7:test
      [INFO] +- org.jboss.arquillian.extension:arquillian-persistence-dbunit:jar:1.0.0.Alpha7:test
      [INFO] |  +- org.jboss.arquillian.extension:arquillian-persistence-spi:jar:1.0.0.Alpha7:test
      [INFO] |  +- org.jboss.arquillian.extension:arquillian-persistence-core:jar:1.0.0.Alpha7:test
      [INFO] |  |  \- org.jboss.arquillian.extension:arquillian-transaction-jta:jar:1.0.1.Final:test
      [INFO] |  |     \- org.jboss.arquillian.extension:arquillian-transaction-impl-base:jar:1.0.1.Final:test
      [INFO] |  +- org.jboss.arquillian.extension:arquillian-transaction-spi:jar:1.0.1.Final:test
      [INFO] |  |  \- org.jboss.arquillian.extension:arquillian-transaction-api:jar:1.0.1.Final:test
      [INFO] |  +- org.dbunit:dbunit:jar:2.5.0:test
      [INFO] |  +- org.yaml:snakeyaml:jar:1.10:test
      [INFO] |  +- org.jboss.arquillian.core:arquillian-core-spi:jar:1.1.4.Final:test
      [INFO] |  +- org.jboss.arquillian.container:arquillian-container-spi:jar:1.1.4.Final:test
      [INFO] |  +- org.jboss.arquillian.config:arquillian-config-api:jar:1.1.4.Final:test
      [INFO] |  \- org.jboss.shrinkwrap.descriptors:shrinkwrap-descriptors-api-base:jar:2.0.0-alpha-5:test
      [INFO] +- org.jboss.shrinkwrap.resolver:shrinkwrap-resolver-depchain:pom:2.1.0:test
      [INFO] |  +- org.jboss.shrinkwrap.resolver:shrinkwrap-resolver-api:jar:2.1.0:test
      [INFO] |  +- org.jboss.shrinkwrap.resolver:shrinkwrap-resolver-spi:jar:2.1.0:test
      [INFO] |  +- org.jboss.shrinkwrap.resolver:shrinkwrap-resolver-api-maven:jar:2.1.0:test
      [INFO] |  +- org.jboss.shrinkwrap.resolver:shrinkwrap-resolver-spi-maven:jar:2.1.0:test
      [INFO] |  +- org.jboss.shrinkwrap.resolver:shrinkwrap-resolver-api-maven-archive:jar:2.1.0:test
      [INFO] |  +- org.jboss.shrinkwrap.resolver:shrinkwrap-resolver-impl-maven:jar:2.1.0:test
      [INFO] |  |  +- org.eclipse.aether:aether-api:jar:0.9.0.M2:test
      [INFO] |  |  +- org.eclipse.aether:aether-impl:jar:0.9.0.M2:test
      [INFO] |  |  +- org.eclipse.aether:aether-spi:jar:0.9.0.M2:test
      [INFO] |  |  +- org.eclipse.aether:aether-util:jar:0.9.0.M2:test
      [INFO] |  |  +- org.eclipse.aether:aether-connector-wagon:jar:0.9.0.M2:test
      [INFO] |  |  +- org.apache.maven:maven-aether-provider:jar:3.1.1:test
      [INFO] |  |  +- org.apache.maven:maven-model:jar:3.1.1:test
      [INFO] |  |  +- org.apache.maven:maven-model-builder:jar:3.1.1:test
      [INFO] |  |  |  \- org.codehaus.plexus:plexus-component-annotations:jar:1.5.5:test
      [INFO] |  |  +- org.apache.maven:maven-repository-metadata:jar:3.1.1:test
      [INFO] |  |  +- org.apache.maven:maven-settings:jar:3.1.1:test
      [INFO] |  |  +- org.apache.maven:maven-settings-builder:jar:3.1.1:test
      [INFO] |  |  +- org.codehaus.plexus:plexus-interpolation:jar:1.19:test
      [INFO] |  |  +- org.codehaus.plexus:plexus-utils:jar:3.0.15:test
      [INFO] |  |  +- org.sonatype.plexus:plexus-sec-dispatcher:jar:1.3:test
      [INFO] |  |  |  \- org.sonatype.plexus:plexus-cipher:jar:1.4:test
      [INFO] |  |  +- org.apache.maven.wagon:wagon-provider-api:jar:2.6:test
      [INFO] |  |  +- org.apache.maven.wagon:wagon-file:jar:2.6:test
      [INFO] |  |  \- org.apache.maven.wagon:wagon-http-lightweight:jar:2.6:test
      [INFO] |  |     \- org.apache.maven.wagon:wagon-http-shared:jar:2.6:test
      [INFO] |  |        \- org.jsoup:jsoup:jar:1.7.2:test
      [INFO] |  \- org.jboss.shrinkwrap.resolver:shrinkwrap-resolver-impl-maven-archive:jar:2.1.0:test
      [INFO] |     +- org.jboss.shrinkwrap.resolver:shrinkwrap-resolver-spi-maven-archive:jar:2.1.0:test
      [INFO] |     +- org.eclipse.sisu:org.eclipse.sisu.plexus:jar:0.0.0.M5:test
      [INFO] |     |  +- com.google.guava:guava:jar:10.0.1:test
      [INFO] |     |  |  \- com.google.code.findbugs:jsr305:jar:1.3.9:test
      [INFO] |     |  +- org.sonatype.sisu:sisu-guice:jar:no_aop:3.1.0:test
      [INFO] |     |  |  \- aopalliance:aopalliance:jar:1.0:test
      [INFO] |     |  \- org.eclipse.sisu:org.eclipse.sisu.inject:jar:0.0.0.M5:test
      [INFO] |     \- org.codehaus.plexus:plexus-compiler-javac:jar:2.3:test
      [INFO] |        \- org.codehaus.plexus:plexus-compiler-api:jar:2.3:test
      [INFO] +- org.jboss.arquillian.graphene:graphene-webdriver:pom:2.0.2.Final:test
      [INFO] |  +- org.jboss.arquillian.graphene:graphene-webdriver-api:jar:2.0.2.Final:test
      [INFO] |  +- org.jboss.arquillian.graphene:graphene-webdriver-spi:jar:2.0.2.Final:test
      [INFO] |  +- org.jboss.arquillian.graphene:graphene-webdriver-impl:jar:2.0.2.Final:test
      [INFO] |  |  +- org.jboss.arquillian.extension:arquillian-drone-impl:jar:1.3.0.Final:test
      [INFO] |  |  \- org.jboss.arquillian.extension:arquillian-drone-configuration:jar:1.3.0.Final:test
      [INFO] |  +- org.jboss.arquillian.extension:arquillian-drone-webdriver-depchain:pom:1.3.0.Final:test
      [INFO] |  |  +- org.jboss.arquillian.extension:arquillian-drone-api:jar:1.3.0.Final:test
      [INFO] |  |  +- org.jboss.arquillian.extension:arquillian-drone-spi:jar:1.3.0.Final:test
      [INFO] |  |  +- org.jboss.arquillian.extension:arquillian-drone-webdriver:jar:1.3.0.Final:test
      [INFO] |  |  +- org.seleniumhq.selenium:selenium-api:jar:2.41.0:test
      [INFO] |  |  |  \- org.json:json:jar:20080701:test
      [INFO] |  |  +- org.seleniumhq.selenium:selenium-support:jar:2.41.0:test
      [INFO] |  |  +- org.seleniumhq.selenium:selenium-chrome-driver:jar:2.41.0:test
      [INFO] |  |  +- org.seleniumhq.selenium:selenium-firefox-driver:jar:2.41.0:test
      [INFO] |  |  |  \- org.apache.commons:commons-exec:jar:1.1:test
      [INFO] |  |  +- org.seleniumhq.selenium:selenium-htmlunit-driver:jar:2.41.0:test
      [INFO] |  |  |  \- net.sourceforge.htmlunit:htmlunit:jar:2.13:test
      [INFO] |  |  |     +- xalan:xalan:jar:2.7.1:test
      [INFO] |  |  |     |  \- xalan:serializer:jar:2.7.1:test
      [INFO] |  |  |     +- org.apache.httpcomponents:httpmime:jar:4.3.1:test
      [INFO] |  |  |     +- net.sourceforge.htmlunit:htmlunit-core-js:jar:2.13:test
      [INFO] |  |  |     +- xerces:xercesImpl:jar:2.11.0:test
      [INFO] |  |  |     +- net.sourceforge.nekohtml:nekohtml:jar:1.9.19:test
      [INFO] |  |  |     +- net.sourceforge.cssparser:cssparser:jar:0.9.11:test
      [INFO] |  |  |     |  \- org.w3c.css:sac:jar:1.3:test
      [INFO] |  |  |     \- org.eclipse.jetty:jetty-websocket:jar:8.1.12.v20130726:test
      [INFO] |  |  |        +- org.eclipse.jetty:jetty-util:jar:8.1.12.v20130726:test
      [INFO] |  |  |        +- org.eclipse.jetty:jetty-io:jar:8.1.12.v20130726:test
      [INFO] |  |  |        \- org.eclipse.jetty:jetty-http:jar:8.1.12.v20130726:test
      [INFO] |  |  +- org.seleniumhq.selenium:selenium-ie-driver:jar:2.41.0:test
      [INFO] |  |  |  +- net.java.dev.jna:jna:jar:3.4.0:test
      [INFO] |  |  |  \- net.java.dev.jna:platform:jar:3.4.0:test
      [INFO] |  |  +- org.seleniumhq.selenium:selenium-remote-driver:jar:2.41.0:test
      [INFO] |  |  \- com.opera:operadriver:jar:1.5:test
      [INFO] |  |     +- com.opera:operalaunchers:jar:1.1:test
      [INFO] |  |     +- com.google.protobuf:protobuf-java:jar:2.4.1:test
      [INFO] |  |     +- commons-jxpath:commons-jxpath:jar:1.3:test
      [INFO] |  |     \- org.ini4j:ini4j:jar:0.5.2:test
      [INFO] |  \- org.seleniumhq.selenium:selenium-java:jar:2.41.0:test
      [INFO] |     +- org.seleniumhq.selenium:selenium-safari-driver:jar:2.41.0:test
      [INFO] |     \- org.webbitserver:webbit:jar:0.4.14:test
      [INFO] |        \- io.netty:netty:jar:3.5.2.Final:test
      [INFO] +- org.jboss.arquillian.extension:arquillian-phantom-driver:jar:1.1.2.Final:test
      [INFO] |  \- com.github.detro.ghostdriver:phantomjsdriver:jar:1.1.0:test
      [INFO] |     \- org.seleniumhq.selenium:selenium-server:jar:2.41.0:test
      [INFO] |        +- org.bouncycastle:bcprov-jdk15on:jar:1.48:test
      [INFO] |        +- org.bouncycastle:bcpkix-jdk15on:jar:1.48:test
      [INFO] |        +- mx4j:mx4j-tools:jar:3.0.1:test
      [INFO] |        +- org.mortbay.jetty:servlet-api-2.5:jar:6.1.9:test
      [INFO] |        \- org.seleniumhq.selenium:jetty-repacked:jar:7.6.1:test
      [INFO] +- org.jboss.arquillian.jbehave:arquillian-jbehave-core:jar:1.0.2:test
      [INFO] |  +- org.jbehave:jbehave-core:zip:resources:3.7:test
      [INFO] |  |  +- junit:junit-dep:jar:4.8.2:test
      [INFO] |  |  +- org.hamcrest:hamcrest-core:jar:1.1:test
      [INFO] |  |  +- org.hamcrest:hamcrest-library:jar:1.1:test
      [INFO] |  |  +- org.hamcrest:hamcrest-integration:jar:1.1:test
      [INFO] |  |  +- commons-lang:commons-lang:jar:2.5:test
      [INFO] |  |  +- org.freemarker:freemarker:jar:2.3.16:test
      [INFO] |  |  \- com.thoughtworks.paranamer:paranamer:jar:2.4:test
      [INFO] |  +- org.jbehave:jbehave-core:jar:3.7:test
      [INFO] |  \- org.jbehave.site:jbehave-site-resources:zip:3.1.1:test
      [INFO] +- org.jboss.spec.javax.annotation:jboss-annotations-api_1.1_spec:jar:1.0.1.Final:provided
      [INFO] +- org.jboss.spec.javax.ejb:jboss-ejb-api_3.1_spec:jar:1.0.2.Final:provided
      [INFO] +- org.jboss.arquillian.protocol:arquillian-protocol-servlet:jar:1.1.4.Final:test
      [INFO] |  \- org.jboss.shrinkwrap.descriptors:shrinkwrap-descriptors-spi:jar:2.0.0-alpha-5:test
      [INFO] |     \- org.easytesting:fest-assert:jar:1.4:test
      [INFO] |        \- org.easytesting:fest-util:jar:1.1.6:test
      [INFO] +- org.apache.httpcomponents:httpcore:jar:4.2.5:test
      [INFO] +- commons-collections:commons-collections:jar:3.2.1:compile
      [INFO] +- xml-apis:xml-apis:jar:1.4.01:test
      [INFO] +- org.slf4j:slf4j-log4j12:jar:1.7.5:test
      [INFO] |  \- log4j:log4j:jar:1.2.17:compile
      [INFO] +- javax.enterprise:cdi-api:jar:1.0:test
      [INFO] |  +- org.jboss.interceptor:jboss-interceptor-api:jar:1.1:test
      [INFO] |  \- javax.inject:javax.inject:jar:1:test
      [INFO] +- com.procergs.ied:ied-lib-util:jar:1.0.6:compile
      [INFO] +- com.procergs.acr:PRAutentica:jar:2.9.0:provided
      [INFO] +- com.procergs.acr:PRUtil_j2ee:jar:1.10.2:provided
      [INFO] +- com.procergs.acr:PRGCISrvJava:jar:1.0.0.2:compile
      [INFO] +- com.procergs.acr:PRGCIJava:jar:2.0.0.3:compile
      [INFO] +- org.jboss.ejb3:jboss-ejb3-ext-api:jar:2.1.0:provided
      [INFO] +- javax:javaee-api:jar:6.0:provided
      [INFO] +- org.jboss.as:jboss-as-arquillian-container-managed:jar:7.2.0.Final:test
      [INFO] |  +- org.jboss.as:jboss-as-arquillian-common:jar:7.2.0.Final:test
      [INFO] |  |  +- org.jboss.arquillian.container:arquillian-container-osgi:jar:1.0.3.Final:test
      [INFO] |  |  +- org.jboss.arquillian.testenricher:arquillian-testenricher-cdi:jar:1.1.4.Final:test
      [INFO] |  |  +- org.jboss.arquillian.testenricher:arquillian-testenricher-ejb:jar:1.1.4.Final:test
      [INFO] |  |  +- org.jboss.arquillian.testenricher:arquillian-testenricher-initialcontext:jar:1.1.4.Final:test
      [INFO] |  |  +- org.jboss.arquillian.testenricher:arquillian-testenricher-osgi:jar:1.0.3.Final:test
      [INFO] |  |  +- org.jboss.arquillian.testenricher:arquillian-testenricher-resource:jar:1.1.4.Final:test
      [INFO] |  |  +- org.jboss.as:jboss-as-arquillian-testenricher-msc:jar:7.2.0.Final:test
      [INFO] |  |  |  +- org.jboss.as:jboss-as-server:jar:7.2.0.Final:test
      [INFO] |  |  |  |  +- org.jboss.as:jboss-as-controller:jar:7.2.0.Final:test
      [INFO] |  |  |  |  |  \- org.jboss:staxmapper:jar:1.1.0.Final:test
      [INFO] |  |  |  |  +- org.jboss.as:jboss-as-domain-http-interface:jar:7.2.0.Final:test
      [INFO] |  |  |  |  |  +- org.jboss.as:jboss-as-domain-management:jar:7.2.0.Final:test
      [INFO] |  |  |  |  |  \- org.jboss.com.sun.httpserver:httpserver:jar:1.0.1.Final:test
      [INFO] |  |  |  |  +- org.jboss.as:jboss-as-deployment-repository:jar:7.2.0.Final:test
      [INFO] |  |  |  |  +- org.jboss.as:jboss-as-platform-mbean:jar:7.2.0.Final:test
      [INFO] |  |  |  |  +- org.jboss.as:jboss-as-process-controller:jar:7.2.0.Final:test
      [INFO] |  |  |  |  |  \- system:jdk-tools:jar:jdk:system
      [INFO] |  |  |  |  +- org.jboss.as:jboss-as-remoting:jar:7.2.0.Final:test
      [INFO] |  |  |  |  |  \- org.jboss.as:jboss-as-network:jar:7.2.0.Final:test
      [INFO] |  |  |  |  +- org.jboss.as:jboss-as-version:jar:7.2.0.Final:test
      [INFO] |  |  |  |  +- org.jboss:jandex:jar:1.0.3.Final:test
      [INFO] |  |  |  |  +- org.jboss.invocation:jboss-invocation:jar:1.1.1.Final:test
      [INFO] |  |  |  |  +- org.jboss.logmanager:log4j-jboss-logmanager:jar:1.0.1.Final:test
      [INFO] |  |  |  |  +- org.jboss.stdio:jboss-stdio:jar:1.0.1.GA:test
      [INFO] |  |  |  |  \- org.jboss:jboss-vfs:jar:3.1.0.Final:test
      [INFO] |  |  |  \- org.jboss.msc:jboss-msc:jar:1.0.4.GA:test
      [INFO] |  |  +- org.jboss.as:jboss-as-controller-client:jar:7.2.0.Final:test
      [INFO] |  |  |  +- org.jboss.as:jboss-as-protocol:jar:7.2.0.Final:test
      [INFO] |  |  |  +- org.jboss:jboss-dmr:jar:1.1.6.Final:test
      [INFO] |  |  |  \- org.jboss.threads:jboss-threads:jar:2.1.0.Final:test
      [INFO] |  |  +- org.jboss.as:jboss-as-jmx:jar:7.2.0.Final:test
      [INFO] |  |  |  +- org.jboss:jboss-common-core:jar:2.2.17.GA:test
      [INFO] |  |  |  \- org.jboss.as:jboss-as-naming:jar:7.2.0.Final:test
      [INFO] |  |  |     \- org.jboss:jboss-remote-naming:jar:1.0.5.Final:test
      [INFO] |  |  |        \- org.jboss:jboss-ejb-client:jar:1.0.0.Final:test
      [INFO] |  |  +- org.jboss.osgi.spi:jbosgi-spi:jar:3.2.0.Final:test
      [INFO] |  |  |  +- org.jboss.osgi.metadata:jbosgi-metadata:jar:2.1.1.CR9:test
      [INFO] |  |  |  \- org.jboss.osgi.vfs:jbosgi-vfs30:jar:1.2.0.Final:test
      [INFO] |  |  |     \- org.jboss.osgi.vfs:jbosgi-vfs:jar:1.2.0.Final:test
      [INFO] |  |  \- org.osgi:org.osgi.core:jar:4.2.0:test
      [INFO] |  +- org.jboss.as:jboss-as-arquillian-protocol-jmx:jar:7.2.0.Final:test
      [INFO] |  |  +- org.jboss.as:jboss-as-osgi-service:jar:7.2.0.Final:test
      [INFO] |  |  |  +- org.jboss.as:jboss-as-ee:jar:7.2.0.Final:test
      [INFO] |  |  |  |  +- org.jboss.metadata:jboss-metadata-common:jar:7.0.8.Final:test
      [INFO] |  |  |  |  +- org.jboss.metadata:jboss-metadata-ear:jar:7.0.8.Final:test
      [INFO] |  |  |  |  \- org.jboss.spec.javax.interceptor:jboss-interceptors-api_1.1_spec:jar:1.0.1.Final:test
      [INFO] |  |  |  +- org.jboss.modules:jboss-modules:jar:1.2.0.CR1:test
      [INFO] |  |  |  +- org.jboss.osgi.framework:jbosgi-framework-core:jar:2.1.0.CR12:test
      [INFO] |  |  |  |  +- org.jboss.osgi.deployment:jbosgi-deployment:jar:1.3.0.CR1:test
      [INFO] |  |  |  |  \- org.jboss.osgi.resolver:jbosgi-resolver-felix:jar:3.0.1.Final:test
      [INFO] |  |  |  +- org.jboss.osgi.resolver:jbosgi-resolver-api:jar:3.0.1.Final:test
      [INFO] |  |  |  +- org.jboss.osgi.repository:jbosgi-repository-api:jar:2.1.0.Final:test
      [INFO] |  |  |  \- org.jboss.osgi.repository:jbosgi-repository-core:jar:2.1.0.Final:test
      [INFO] |  |  \- org.jboss.arquillian.protocol:arquillian-protocol-jmx:jar:1.1.4.Final:test
      [INFO] |  +- org.jboss.remoting3:jboss-remoting:jar:3.2.14.GA:test
      [INFO] |  |  \- org.jboss.xnio:xnio-api:jar:3.0.7.GA:test
      [INFO] |  +- org.jboss.remotingjmx:remoting-jmx:jar:1.1.0.Final:test
      [INFO] |  |  +- org.jboss.logmanager:jboss-logmanager:jar:1.4.0.Final:test
      [INFO] |  |  +- org.jboss.logging:jboss-logging-processor:jar:1.1.0.Final:test
      [INFO] |  |  |  \- org.jboss.jdeparser:jdeparser:jar:1.0.0.Final:test
      [INFO] |  |  +- org.jboss.marshalling:jboss-marshalling:jar:1.3.16.GA:test
      [INFO] |  |  +- org.jboss.marshalling:jboss-marshalling-river:jar:1.3.16.GA:test
      [INFO] |  |  \- org.jboss.xnio:xnio-nio:jar:3.0.7.GA:test
      [INFO] |  +- org.jboss.sasl:jboss-sasl:jar:1.0.3.Final:test
      [INFO] |  +- org.jboss.arquillian.core:arquillian-core-api:jar:1.1.4.Final:test
      [INFO] |  \- org.jboss.as:jboss-as-build-config:jar:7.2.0.Final:test
      [INFO] +- org.jboss.arquillian.extension:arquillian-jacoco:jar:1.0.0.Alpha6:test
      [INFO] |  \- org.jboss.shrinkwrap:shrinkwrap-api:jar:1.2.2:test
      [INFO] \- org.jacoco:org.jacoco.core:jar:0.7.1.201405082137:test
      [INFO]    \- org.ow2.asm:asm-debug-all:jar:5.0.1:test
      

       

       

      Any hint is welcome, thanks in advance.