7 Replies Latest reply on Feb 16, 2017 7:37 AM by Donato Marrazzo

    Continuation of WARN  XXX failed and will not be available for authoring.

    Fernando Pena Cantu Newbie

      Hello so this kind of a continuation of the problem with WARN  XXX failed and will not be available for authoring. and Creating a text message Service Task

       

      However i will restate the problem right here so there is no need of going and looking at those discussions. I am using Jboss BPM Suit 6.4.0

      So I am trying to create a new Service task which will be able to send Messages to people.  However I am getting this error when I try to build a process using my service task.

       

      13:45:07,081 WARN  [org.kie.workbench.common.services.backend.builder.ClassVerifier] (http-127.0.0.1/127.0.0.1:8080-8) Verification of class com.google.common.reflect.Types$JavaVersion$4 failed and will not be available for authoring.

      Please check the necessary external dependencies for this project are configured correctly.

      13:45:07,112 WARN  [org.kie.workbench.common.services.backend.builder.ClassVerifier] (http-127.0.0.1/127.0.0.1:8080-8) Verification of class org.apache.commons.logging.impl.LogKitLogger failed and will not be available for authoring.

      Please check the necessary external dependencies for this project are configured correctly.

      13:45:33,709 WARN  [org.kie.workbench.common.services.backend.builder.ClassVerifier] (http-127.0.0.1/127.0.0.1:8080-8) Verification of class com.google.common.base.CaseFormat$5 failed and will not be available for authoring.

      Please check the necessary external dependencies for this project are configured correctly.

      13:45:33,711 WARN  [org.kie.workbench.common.services.backend.builder.ClassVerifier] (http-127.0.0.1/127.0.0.1:8080-8) Verification of class com.google.common.base.CaseFormat$4 failed and will not be available for authoring.

      Please check the necessary external dependencies for this project are configured correctly.

      13:45:33,715 WARN  [org.kie.workbench.common.services.backend.builder.ClassVerifier] (http-127.0.0.1/127.0.0.1:8080-8) Verification of class com.google.common.base.CaseFormat$3 failed and will not be available for authoring.

      Please check the necessary external dependencies for this project are configured correctly.

      13:45:33,718 WARN  [org.kie.workbench.common.services.backend.builder.ClassVerifier] (http-127.0.0.1/127.0.0.1:8080-8) Verification of class com.google.common.base.CaseFormat$2 failed and will not be available for authoring.

      Please check the necessary external dependencies for this project are configured correctly.

      13:45:33,723 WARN  [org.kie.workbench.common.services.backend.builder.ClassVerifier] (http-127.0.0.1/127.0.0.1:8080-8) Verification of class com.google.common.base.Predicates$ContainsPatternFromStringPredicate failed and will not be available for authoring.

      Please check the necessary external dependencies for this project are configured correctly.

      13:45:33,737 WARN  [org.kie.workbench.common.services.backend.builder.ClassVerifier] (http-127.0.0.1/127.0.0.1:8080-8) Verification of class com.google.common.base.Suppliers$SupplierFunctionImpl failed and will not be available for authoring.

      Please check the necessary external dependencies for this project are configured correctly.

      13:45:33,772 WARN  [org.kie.workbench.common.services.backend.builder.ClassVerifier] (http-127.0.0.1/127.0.0.1:8080-8) Verification of class com.google.common.cache.CacheBuilderSpec$RecordStatsParser failed and will not be available for authoring.

      Please check the necessary external dependencies for this project are configured correctly.

      13:45:33,890 WARN  [org.kie.workbench.common.services.backend.builder.ClassVerifier] (http-127.0.0.1/127.0.0.1:8080-8) Verification of class com.google.common.util.concurrent.MoreExecutors$DirectExecutorService failed and will not be available for authoring.

      Please check the necessary external dependencies for this project are configured correctly.

      13:45:33,898 WARN  [org.kie.workbench.common.services.backend.builder.ClassVerifier] (http-127.0.0.1/127.0.0.1:8080-8) Verification of class com.google.common.util.concurrent.Service$State$1 failed and will not be available for authoring.

      Please check the necessary external dependencies for this project are configured correctly.

      13:45:33,900 WARN  [org.kie.workbench.common.services.backend.builder.ClassVerifier] (http-127.0.0.1/127.0.0.1:8080-8) Verification of class com.google.common.util.concurrent.Service$State$3 failed and will not be available for authoring.

      Please check the necessary external dependencies for this project are configured correctly.

      13:45:33,905 WARN  [org.kie.workbench.common.services.backend.builder.ClassVerifier] (http-127.0.0.1/127.0.0.1:8080-8) Verification of class com.google.common.util.concurrent.Service$State$2 failed and will not be available for authoring.

      Please check the necessary external dependencies for this project are configured correctly.

      13:45:33,911 WARN  [org.kie.workbench.common.services.backend.builder.ClassVerifier] (http-127.0.0.1/127.0.0.1:8080-8) Verification of class com.google.common.util.concurrent.Service$State$5 failed and will not be available for authoring.

      Please check the necessary external dependencies for this project are configured correctly.

      13:45:33,917 WARN  [org.kie.workbench.common.services.backend.builder.ClassVerifier] (http-127.0.0.1/127.0.0.1:8080-8) Verification of class com.google.common.util.concurrent.Service$State$4 failed and will not be available for authoring.

      Please check the necessary external dependencies for this project are configured correctly.

      13:45:33,921 WARN  [org.kie.workbench.common.services.backend.builder.ClassVerifier] (http-127.0.0.1/127.0.0.1:8080-8) Verification of class com.google.common.util.concurrent.Service$State$6 failed and will not be available for authoring.

      Please check the necessary external dependencies for this project are configured correctly.

      13:45:33,929 WARN  [org.kie.workbench.common.services.backend.builder.ClassVerifier] (http-127.0.0.1/127.0.0.1:8080-8) Verification of class com.google.common.util.concurrent.Striped$SmallLazyStriped failed and will not be available for authoring.

      Please check the necessary external dependencies for this project are configured correctly.

      13:45:33,931 WARN  [org.kie.workbench.common.services.backend.builder.ClassVerifier] (http-127.0.0.1/127.0.0.1:8080-8) Verification of class com.google.common.util.concurrent.ServiceManager$ServiceListener failed and will not be available for authoring.

      Please check the necessary external dependencies for this project are configured correctly.

      13:45:33,944 WARN  [org.kie.workbench.common.services.backend.builder.ClassVerifier] (http-127.0.0.1/127.0.0.1:8080-8) Verification of class com.google.common.util.concurrent.Futures$WrappedCombiner failed and will not be available for authoring.

      Please check the necessary external dependencies for this project are configured correctly.

      13:45:33,946 WARN  [org.kie.workbench.common.services.backend.builder.ClassVerifier] (http-127.0.0.1/127.0.0.1:8080-8) Verification of class com.google.common.util.concurrent.Striped$LargeLazyStriped failed and will not be available for authoring.

      Please check the necessary external dependencies for this project are configured correctly.

      13:45:33,951 WARN  [org.kie.workbench.common.services.backend.builder.ClassVerifier] (http-127.0.0.1/127.0.0.1:8080-8) Verification of class com.google.common.util.concurrent.Futures$CombinerFuture failed and will not be available for authoring.

      Please check the necessary external dependencies for this project are configured correctly.

      13:45:33,958 WARN  [org.kie.workbench.common.services.backend.builder.ClassVerifier] (http-127.0.0.1/127.0.0.1:8080-8) Verification of class com.google.common.util.concurrent.AbstractScheduledService$3 failed and will not be available for authoring.

      Please check the necessary external dependencies for this project are configured correctly.

      13:45:33,973 WARN  [org.kie.workbench.common.services.backend.builder.ClassVerifier] (http-127.0.0.1/127.0.0.1:8080-8) Verification of class com.google.common.util.concurrent.ServiceManager failed and will not be available for authoring.

      Please check the necessary external dependencies for this project are configured correctly.

      13:45:34,024 WARN  [org.kie.workbench.common.services.backend.builder.ClassVerifier] (http-127.0.0.1/127.0.0.1:8080-8) Verification of class com.google.common.collect.RegularImmutableTable$CellSet$1 failed and will not be available for authoring.

      Please check the necessary external dependencies for this project are configured correctly.

      13:45:34,028 WARN  [org.kie.workbench.common.services.backend.builder.ClassVerifier] (http-127.0.0.1/127.0.0.1:8080-8) Verification of class com.google.common.collect.AbstractMapBasedMultimap$KeySet$1 failed and will not be available for authoring.

      Please check the necessary external dependencies for this project are configured correctly.

      13:45:34,038 WARN  [org.kie.workbench.common.services.backend.builder.ClassVerifier] (http-127.0.0.1/127.0.0.1:8080-8) Verification of class com.google.common.collect.AbstractNavigableMap$1 failed and will not be available for authoring.

      Please check the necessary external dependencies for this project are configured correctly.

      13:45:34,049 WARN  [org.kie.workbench.common.services.backend.builder.ClassVerifier] (http-127.0.0.1/127.0.0.1:8080-8) Verification of class com.google.common.collect.DescendingMultiset$1 failed and will not be available for authoring.

      Please check the necessary external dependencies for this project are configured correctly.

      13:45:34,052 WARN  [org.kie.workbench.common.services.backend.builder.ClassVerifier] (http-127.0.0.1/127.0.0.1:8080-8) Verification of class com.google.common.collect.DenseImmutableTable$Column failed and will not be available for authoring.

      Please check the necessary external dependencies for this project are configured correctly.

      13:45:34,054 WARN  [org.kie.workbench.common.services.backend.builder.ClassVerifier] (http-127.0.0.1/127.0.0.1:8080-8) Verification of class com.google.common.collect.FilteredEntryMultimap$Keys failed and will not be available for authoring.

      Please check the necessary external dependencies for this project are configured correctly.

      13:45:34,058 WARN  [org.kie.workbench.common.services.backend.builder.ClassVerifier] (http-127.0.0.1/127.0.0.1:8080-8) Verification of class com.google.common.collect.UnmodifiableSortedMultiset failed and will not be available for authoring.

      Please check the necessary external dependencies for this project are configured correctly.

      13:45:34,062 WARN  [org.kie.workbench.common.services.backend.builder.ClassVerifier] (http-127.0.0.1/127.0.0.1:8080-8) Verification of class com.google.common.collect.DenseImmutableTable$RowMap failed and will not be available for authoring.

      Please check the necessary external dependencies for this project are configured correctly.

      13:45:34,063 WARN  [org.kie.workbench.common.services.backend.builder.ClassVerifier] (http-127.0.0.1/127.0.0.1:8080-8) Verification of class com.google.common.collect.HashBiMap$Inverse$InverseKeySet failed and will not be available for authoring.

      Please check the necessary external dependencies for this project are configured correctly.

      13:45:34,070 WARN  [org.kie.workbench.common.services.backend.builder.ClassVerifier] (http-127.0.0.1/127.0.0.1:8080-8) Verification of class com.google.common.collect.HashBiMap$Itr failed and will not be available for authoring.

      Please check the necessary external dependencies for this project are configured correctly.

      13:45:34,072 WARN  [org.kie.workbench.common.services.backend.builder.ClassVerifier] (http-127.0.0.1/127.0.0.1:8080-8) Verification of class com.google.common.collect.HashBiMap$Inverse$1 failed and will not be available for authoring.

      Please check the necessary external dependencies for this project are configured correctly.

      13:45:34,075 WARN  [org.kie.workbench.common.services.backend.builder.ClassVerifier] (http-127.0.0.1/127.0.0.1:8080-8) Verification of class com.google.common.collect.Maps$FilteredEntryBiMap failed and will not be available for authoring.

      Please check the necessary external dependencies for this project are configured correctly.

      13:45:34,082 WARN  [org.kie.workbench.common.services.backend.builder.ClassVerifier] (http-127.0.0.1/127.0.0.1:8080-8) Verification of class com.google.common.collect.FilteredEntrySetMultimap failed and will not be available for authoring.

      Please check the necessary external dependencies for this project are configured correctly.

      13:45:34,088 WARN  [org.kie.workbench.common.services.backend.builder.ClassVerifier] (http-127.0.0.1/127.0.0.1:8080-8) Verification of class com.google.common.collect.AbstractMapBasedMultimap$WrappedNavigableSet failed and will not be available for authoring.

      Please check the necessary external dependencies for this project are configured correctly.

      13:45:34,090 WARN  [org.kie.workbench.common.services.backend.builder.ClassVerifier] (http-127.0.0.1/127.0.0.1:8080-8) Verification of class com.google.common.collect.TreeRangeMap$AsMapOfRanges failed and will not be available for authoring.

      Please check the necessary external dependencies for this project are configured correctly.

      13:45:34,093 WARN  [org.kie.workbench.common.services.backend.builder.ClassVerifier] (http-127.0.0.1/127.0.0.1:8080-8) Verification of class com.google.common.collect.AbstractMapBasedMultimap$Itr failed and will not be available for authoring.

      Please check the necessary external dependencies for this project are configured correctly.

      13:45:34,099 WARN  [org.kie.workbench.common.services.backend.builder.ClassVerifier] (http-127.0.0.1/127.0.0.1:8080-8) Verification of class com.google.common.collect.ImmutableRangeSet$1 failed and will not be available for authoring.

      Please check the necessary external dependencies for this project are configured correctly.

      13:45:34,104 WARN  [org.kie.workbench.common.services.backend.builder.ClassVerifier] (http-127.0.0.1/127.0.0.1:8080-8) Verification of class com.google.common.collect.AbstractMapBasedMultimap$1 failed and will not be available for authoring.

      Please check the necessary external dependencies for this project are configured correctly.

      13:45:34,107 WARN  [org.kie.workbench.common.services.backend.builder.ClassVerifier] (http-127.0.0.1/127.0.0.1:8080-8) Verification of class com.google.common.collect.AbstractMapBasedMultimap$2 failed and will not be available for authoring.

      Please check the necessary external dependencies for this project are configured correctly.

      13:45:34,109 WARN  [org.kie.workbench.common.services.backend.builder.ClassVerifier] (http-127.0.0.1/127.0.0.1:8080-8) Verification of class com.google.common.collect.ImmutableMap$MapViewOfValuesAsSingletonSets$1$1$1 failed and will not be available for authoring.

      Please check the necessary external dependencies for this project are configured correctly.

      13:45:34,112 WARN  [org.kie.workbench.common.services.backend.builder.ClassVerifier] (http-127.0.0.1/127.0.0.1:8080-8) Verification of class com.google.common.collect.AbstractMapBasedMultimap failed and will not be available for authoring.

      Please check the necessary external dependencies for this project are configured correctly.

      13:45:34,115 WARN  [org.kie.workbench.common.services.backend.builder.ClassVerifier] (http-127.0.0.1/127.0.0.1:8080-8) Verification of class com.google.common.collect.FilteredEntryMultimap$Keys$1 failed and will not be available for authoring.

      Please check the necessary external dependencies for this project are configured correctly.

      13:45:34,121 WARN  [org.kie.workbench.common.services.backend.builder.ClassVerifier] (http-127.0.0.1/127.0.0.1:8080-8) Verification of class com.google.common.collect.Multisets$4$1 failed and will not be available for authoring.

      Please check the necessary external dependencies for this project are configured correctly.

      13:45:34,126 WARN  [org.kie.workbench.common.services.backend.builder.ClassVerifier] (http-127.0.0.1/127.0.0.1:8080-8) Verification of class com.google.common.collect.RegularImmutableBiMap$Inverse$InverseEntrySet$1 failed and will not be available for authoring.

      Please check the necessary external dependencies for this project are configured correctly.

      13:45:34,133 WARN  [org.kie.workbench.common.services.backend.builder.ClassVerifier] (http-127.0.0.1/127.0.0.1:8080-8) Verification of class com.google.common.collect.ImmutableEnumMap$2 failed and will not be available for authoring.

      Please check the necessary external dependencies for this project are configured correctly.

      13:45:34,137 WARN  [org.kie.workbench.common.services.backend.builder.ClassVerifier] (http-127.0.0.1/127.0.0.1:8080-8) Verification of class com.google.common.collect.FilteredKeySetMultimap failed and will not be available for authoring.

      Please check the necessary external dependencies for this project are configured correctly.

      13:45:34,141 WARN  [org.kie.workbench.common.services.backend.builder.ClassVerifier] (http-127.0.0.1/127.0.0.1:8080-8) Verification of class com.google.common.collect.AbstractMapBasedMultimap$WrappedSet failed and will not be available for authoring.

      Please check the necessary external dependencies for this project are configured correctly.

      13:45:34,145 WARN  [org.kie.workbench.common.services.backend.builder.ClassVerifier] (http-127.0.0.1/127.0.0.1:8080-8) Verification of class com.google.common.collect.TreeRangeMap$1 failed and will not be available for authoring.

      Please check the necessary external dependencies for this project are configured correctly.

      13:45:34,149 WARN  [org.kie.workbench.common.services.backend.builder.ClassVerifier] (http-127.0.0.1/127.0.0.1:8080-8) Verification of class com.google.common.collect.Synchronized$SynchronizedDeque failed and will not be available for authoring.

      Please check the necessary external dependencies for this project are configured correctly.

      13:45:34,151 WARN  [org.kie.workbench.common.services.backend.builder.ClassVerifier] (http-127.0.0.1/127.0.0.1:8080-8) Verification of class com.google.common.collect.AbstractMapBasedMultimap$WrappedSortedSet failed and will not be available for authoring.

      Please check the necessary external dependencies for this project are configured correctly.

      13:45:34,156 WARN  [org.kie.workbench.common.services.backend.builder.ClassVerifier] (http-127.0.0.1/127.0.0.1:8080-8) Verification of class com.google.common.collect.TreeRangeMap$SubRangeMap$SubRangeMapAsMap failed and will not be available for authoring.

      Please check the necessary external dependencies for this project are configured correctly.

      13:45:34,160 WARN  [org.kie.workbench.common.services.backend.builder.ClassVerifier] (http-127.0.0.1/127.0.0.1:8080-8) Verification of class com.google.common.collect.TreeRangeMap$SubRangeMap failed and will not be available for authoring.

      Please check the necessary external dependencies for this project are configured correctly.

      13:45:34,162 WARN  [org.kie.workbench.common.services.backend.builder.ClassVerifier] (http-127.0.0.1/127.0.0.1:8080-8) Verification of class com.google.common.collect.FilteredKeySetMultimap$EntrySet failed and will not be available for authoring.

      Please check the necessary external dependencies for this project are configured correctly.

      13:45:34,164 WARN  [org.kie.workbench.common.services.backend.builder.ClassVerifier] (http-127.0.0.1/127.0.0.1:8080-8) Verification of class com.google.common.collect.AbstractMapBasedMultimap$AsMap failed and will not be available for authoring.

      Please check the necessary external dependencies for this project are configured correctly.

      13:45:34,167 WARN  [org.kie.workbench.common.services.backend.builder.ClassVerifier] (http-127.0.0.1/127.0.0.1:8080-8) Verification of class com.google.common.collect.ImmutableEnumMap failed and will not be available for authoring.

      Please check the necessary external dependencies for this project are configured correctly.

      13:45:34,173 WARN  [org.kie.workbench.common.services.backend.builder.ClassVerifier] (http-127.0.0.1/127.0.0.1:8080-8) Verification of class com.google.common.collect.ImmutableRangeSet$AsSet failed and will not be available for authoring.

      Please check the necessary external dependencies for this project are configured correctly.

      13:45:34,181 WARN  [org.kie.workbench.common.services.backend.builder.ClassVerifier] (http-127.0.0.1/127.0.0.1:8080-8) Verification of class com.google.common.collect.ForwardingSortedMultiset failed and will not be available for authoring.

      Please check the necessary external dependencies for this project are configured correctly.

      13:45:34,183 WARN  [org.kie.workbench.common.services.backend.builder.ClassVerifier] (http-127.0.0.1/127.0.0.1:8080-8) Verification of class com.google.common.collect.HashBiMap$EntrySet$1 failed and will not be available for authoring.

      Please check the necessary external dependencies for this project are configured correctly.

      13:45:34,187 WARN  [org.kie.workbench.common.services.backend.builder.ClassVerifier] (http-127.0.0.1/127.0.0.1:8080-8) Verification of class com.google.common.collect.ArrayTable$1$1 failed and will not be available for authoring.

      Please check the necessary external dependencies for this project are configured correctly.

      13:45:34,189 WARN  [org.kie.workbench.common.services.backend.builder.ClassVerifier] (http-127.0.0.1/127.0.0.1:8080-8) Verification of class com.google.common.collect.FilteredEntryMultimap$AsMap failed and will not be available for authoring.

      Please check the necessary external dependencies for this project are configured correctly.

      13:45:34,192 WARN  [org.kie.workbench.common.services.backend.builder.ClassVerifier] (http-127.0.0.1/127.0.0.1:8080-8) Verification of class com.google.common.collect.Maps$FilteredEntrySortedMap$SortedKeySet failed and will not be available for authoring.

      Please check the necessary external dependencies for this project are configured correctly.

      13:45:34,196 WARN  [org.kie.workbench.common.services.backend.builder.ClassVerifier] (http-127.0.0.1/127.0.0.1:8080-8) Verification of class com.google.common.collect.AbstractMapBasedMultimap$SortedAsMap failed and will not be available for authoring.

      Please check the necessary external dependencies for this project are configured correctly.

      13:45:34,202 WARN  [org.kie.workbench.common.services.backend.builder.ClassVerifier] (http-127.0.0.1/127.0.0.1:8080-8) Verification of class com.google.common.collect.AbstractMapBasedMultimap$RandomAccessWrappedList failed and will not be available for authoring.

      Please check the necessary external dependencies for this project are configured correctly.

      13:45:34,204 WARN  [org.kie.workbench.common.services.backend.builder.ClassVerifier] (http-127.0.0.1/127.0.0.1:8080-8) Verification of class com.google.common.collect.Maps$SortedKeySet failed and will not be available for authoring.

      Please check the necessary external dependencies for this project are configured correctly.

      13:45:34,208 WARN  [org.kie.workbench.common.services.backend.builder.ClassVerifier] (http-127.0.0.1/127.0.0.1:8080-8) Verification of class com.google.common.collect.TreeRangeMap$SubRangeMap$SubRangeMapAsMap$3 failed and will not be available for authoring.

      Please check the necessary external dependencies for this project are configured correctly.

      13:45:34,212 WARN  [org.kie.workbench.common.services.backend.builder.ClassVerifier] (http-127.0.0.1/127.0.0.1:8080-8) Verification of class com.google.common.collect.FilteredKeyMultimap failed and will not be available for authoring.

      Please check the necessary external dependencies for this project are configured correctly.

      13:45:34,216 WARN  [org.kie.workbench.common.services.backend.builder.ClassVerifier] (http-127.0.0.1/127.0.0.1:8080-8) Verification of class com.google.common.collect.TreeRangeMap$SubRangeMap$SubRangeMapAsMap$1 failed and will not be available for authoring.

      Please check the necessary external dependencies for this project are configured correctly.

      13:45:34,222 WARN  [org.kie.workbench.common.services.backend.builder.ClassVerifier] (http-127.0.0.1/127.0.0.1:8080-8) Verification of class com.google.common.collect.TreeRangeMap$SubRangeMap$SubRangeMapAsMap$2 failed and will not be available for authoring.

      Please check the necessary external dependencies for this project are configured correctly.

      13:45:34,233 WARN  [org.kie.workbench.common.services.backend.builder.ClassVerifier] (http-127.0.0.1/127.0.0.1:8080-8) Verification of class com.google.common.collect.DenseImmutableTable$ColumnMap failed and will not be available for authoring.

      Please check the necessary external dependencies for this project are configured correctly.

      13:45:34,234 WARN  [org.kie.workbench.common.services.backend.builder.ClassVerifier] (http-127.0.0.1/127.0.0.1:8080-8) Verification of class com.google.common.collect.Lists$TransformingRandomAccessList$1 failed and will not be available for authoring.

      Please check the necessary external dependencies for this project are configured correctly.

      13:45:34,240 WARN  [org.kie.workbench.common.services.backend.builder.ClassVerifier] (http-127.0.0.1/127.0.0.1:8080-8) Verification of class com.google.common.collect.Multisets$4 failed and will not be available for authoring.

      Please check the necessary external dependencies for this project are configured correctly.

      13:45:34,246 WARN  [org.kie.workbench.common.services.backend.builder.ClassVerifier] (http-127.0.0.1/127.0.0.1:8080-8) Verification of class com.google.common.collect.Multisets$3 failed and will not be available for authoring.

      Please check the necessary external dependencies for this project are configured correctly.

      13:45:34,250 WARN  [org.kie.workbench.common.services.backend.builder.ClassVerifier] (http-127.0.0.1/127.0.0.1:8080-8) Verification of class com.google.common.collect.AbstractNavigableMap$DescendingMap failed and will not be available for authoring.

      Please check the necessary external dependencies for this project are configured correctly.

      13:45:34,255 WARN  [org.kie.workbench.common.services.backend.builder.ClassVerifier] (http-127.0.0.1/127.0.0.1:8080-8) Verification of class com.google.common.collect.AbstractMultimap$Entries failed and will not be available for authoring.

      Please check the necessary external dependencies for this project are configured correctly.

      13:45:34,261 WARN  [org.kie.workbench.common.services.backend.builder.ClassVerifier] (http-127.0.0.1/127.0.0.1:8080-8) Verification of class com.google.common.collect.AbstractMapBasedMultimap$AsMap$AsMapEntries failed and will not be available for authoring.

      Please check the necessary external dependencies for this project are configured correctly.

      13:45:34,264 WARN  [org.kie.workbench.common.services.backend.builder.ClassVerifier] (http-127.0.0.1/127.0.0.1:8080-8) Verification of class com.google.common.collect.MapMaker$ComputingMapAdapter failed and will not be available for authoring.

      Please check the necessary external dependencies for this project are configured correctly.

      13:45:34,268 WARN  [org.kie.workbench.common.services.backend.builder.ClassVerifier] (http-127.0.0.1/127.0.0.1:8080-8) Verification of class com.google.common.collect.HashBiMap$Inverse$1$1 failed and will not be available for authoring.

      Please check the necessary external dependencies for this project are configured correctly.

      13:45:34,273 WARN  [org.kie.workbench.common.services.backend.builder.ClassVerifier] (http-127.0.0.1/127.0.0.1:8080-8) Verification of class com.google.common.collect.ImmutableRangeMap$Builder failed and will not be available for authoring.

      Please check the necessary external dependencies for this project are configured correctly.

      13:45:34,278 WARN  [org.kie.workbench.common.services.backend.builder.ClassVerifier] (http-127.0.0.1/127.0.0.1:8080-8) Verification of class com.google.common.collect.Maps$FilteredMapValues failed and will not be available for authoring.

      Please check the necessary external dependencies for this project are configured correctly.

      13:45:34,286 WARN  [org.kie.workbench.common.services.backend.builder.ClassVerifier] (http-127.0.0.1/127.0.0.1:8080-8) Verification of class com.google.common.collect.AbstractNavigableMap failed and will not be available for authoring.

      Please check the necessary external dependencies for this project are configured correctly.

      13:45:34,291 WARN  [org.kie.workbench.common.services.backend.builder.ClassVerifier] (http-127.0.0.1/127.0.0.1:8080-8) Verification of class com.google.common.collect.ImmutableMap$MapViewOfValuesAsSingletonSets failed and will not be available for authoring.

      Please check the necessary external dependencies for this project are configured correctly.

      13:45:34,294 WARN  [org.kie.workbench.common.services.backend.builder.ClassVerifier] (http-127.0.0.1/127.0.0.1:8080-8) Verification of class com.google.common.collect.FilteredEntryMultimap failed and will not be available for authoring.

      Please check the necessary external dependencies for this project are configured correctly.

      13:45:34,297 WARN  [org.kie.workbench.common.services.backend.builder.ClassVerifier] (http-127.0.0.1/127.0.0.1:8080-8) Verification of class com.google.common.collect.ImmutableMap$MapViewOfValuesAsSingletonSets$1 failed and will not be available for authoring.

      Please check the necessary external dependencies for this project are configured correctly.

      13:45:34,300 WARN  [org.kie.workbench.common.services.backend.builder.ClassVerifier] (http-127.0.0.1/127.0.0.1:8080-8) Verification of class com.google.common.collect.AbstractMapBasedMultimap$WrappedCollection failed and will not be available for authoring.

      Please check the necessary external dependencies for this project are configured correctly.

      13:45:34,303 WARN  [org.kie.workbench.common.services.backend.builder.ClassVerifier] (http-127.0.0.1/127.0.0.1:8080-8) Verification of class com.google.common.collect.ForwardingSortedMap$StandardKeySet failed and will not be available for authoring.

      Please check the necessary external dependencies for this project are configured correctly.

      13:45:34,307 WARN  [org.kie.workbench.common.services.backend.builder.ClassVerifier] (http-127.0.0.1/127.0.0.1:8080-8) Verification of class com.google.common.collect.DenseImmutableTable$Row failed and will not be available for authoring.

      Please check the necessary external dependencies for this project are configured correctly.

      13:45:34,311 WARN  [org.kie.workbench.common.services.backend.builder.ClassVerifier] (http-127.0.0.1/127.0.0.1:8080-8) Verification of class com.google.common.collect.ImmutableRangeMap$2 failed and will not be available for authoring.

      Please check the necessary external dependencies for this project are configured correctly.

      13:45:34,316 WARN  [org.kie.workbench.common.services.backend.builder.ClassVerifier] (http-127.0.0.1/127.0.0.1:8080-8) Verification of class com.google.common.collect.ImmutableRangeMap$1 failed and will not be available for authoring.

      Please check the necessary external dependencies for this project are configured correctly.

      13:45:34,318 WARN  [org.kie.workbench.common.services.backend.builder.ClassVerifier] (http-127.0.0.1/127.0.0.1:8080-8) Verification of class com.google.common.collect.TreeRangeMap failed and will not be available for authoring.

      Please check the necessary external dependencies for this project are configured correctly.

      13:45:34,322 WARN  [org.kie.workbench.common.services.backend.builder.ClassVerifier] (http-127.0.0.1/127.0.0.1:8080-8) Verification of class com.google.common.collect.FilteredEntryMultimap$AsMap$2$1 failed and will not be available for authoring.

      Please check the necessary external dependencies for this project are configured correctly.

      13:45:34,329 WARN  [org.kie.workbench.common.services.backend.builder.ClassVerifier] (http-127.0.0.1/127.0.0.1:8080-8) Verification of class com.google.common.collect.ImmutableRangeSet$ComplementRanges failed and will not be available for authoring.

      Please check the necessary external dependencies for this project are configured correctly.

      13:45:34,332 WARN  [org.kie.workbench.common.services.backend.builder.ClassVerifier] (http-127.0.0.1/127.0.0.1:8080-8) Verification of class com.google.common.collect.FilteredKeyMultimap$Entries failed and will not be available for authoring.

      Please check the necessary external dependencies for this project are configured correctly.

      13:45:34,336 WARN  [org.kie.workbench.common.services.backend.builder.ClassVerifier] (http-127.0.0.1/127.0.0.1:8080-8) Verification of class com.google.common.collect.ImmutableRangeSet$Builder failed and will not be available for authoring.

      Please check the necessary external dependencies for this project are configured correctly.

      13:45:34,340 WARN  [org.kie.workbench.common.services.backend.builder.ClassVerifier] (http-127.0.0.1/127.0.0.1:8080-8) Verification of class com.google.common.collect.ImmutableRangeMap failed and will not be available for authoring.

      Please check the necessary external dependencies for this project are configured correctly.

      13:45:34,342 WARN  [org.kie.workbench.common.services.backend.builder.ClassVerifier] (http-127.0.0.1/127.0.0.1:8080-8) Verification of class com.google.common.collect.SparseImmutableTable failed and will not be available for authoring.

      Please check the necessary external dependencies for this project are configured correctly.

      13:45:34,347 WARN  [org.kie.workbench.common.services.backend.builder.ClassVerifier] (http-127.0.0.1/127.0.0.1:8080-8) Verification of class com.google.common.collect.AbstractRangeSet failed and will not be available for authoring.

      Please check the necessary external dependencies for this project are configured correctly.

      13:45:34,350 WARN  [org.kie.workbench.common.services.backend.builder.ClassVerifier] (http-127.0.0.1/127.0.0.1:8080-8) Verification of class com.google.common.collect.ImmutableMapEntry$TerminalEntry failed and will not be available for authoring.

      Please check the necessary external dependencies for this project are configured correctly.

      13:45:34,356 WARN  [org.kie.workbench.common.services.backend.builder.ClassVerifier] (http-127.0.0.1/127.0.0.1:8080-8) Verification of class com.google.common.collect.ForwardingSortedMultiset$StandardElementSet failed and will not be available for authoring.

      Please check the necessary external dependencies for this project are configured correctly.

      13:45:34,360 WARN  [org.kie.workbench.common.services.backend.builder.ClassVerifier] (http-127.0.0.1/127.0.0.1:8080-8) Verification of class com.google.common.collect.ImmutableMultiset$EntrySet$1 failed and will not be available for authoring.

      Please check the necessary external dependencies for this project are configured correctly.

      13:45:34,364 WARN  [org.kie.workbench.common.services.backend.builder.ClassVerifier] (http-127.0.0.1/127.0.0.1:8080-8) Verification of class com.google.common.collect.DenseImmutableTable$ImmutableArrayMap$1$1 failed and will not be available for authoring.

      Please check the necessary external dependencies for this project are configured correctly.

      13:45:34,368 WARN  [org.kie.workbench.common.services.backend.builder.ClassVerifier] (http-127.0.0.1/127.0.0.1:8080-8) Verification of class com.google.common.collect.DenseImmutableTable$ImmutableArrayMap$1 failed and will not be available for authoring.

      Please check the necessary external dependencies for this project are configured correctly.

      13:45:34,374 WARN  [org.kie.workbench.common.services.backend.builder.ClassVerifier] (http-127.0.0.1/127.0.0.1:8080-8) Verification of class com.google.common.collect.Multisets$FilteredMultiset$1 failed and will not be available for authoring.

      Please check the necessary external dependencies for this project are configured correctly.

      13:45:34,380 WARN  [org.kie.workbench.common.services.backend.builder.ClassVerifier] (http-127.0.0.1/127.0.0.1:8080-8) Verification of class com.google.common.collect.TreeRangeSet$Complement failed and will not be available for authoring.

      Please check the necessary external dependencies for this project are configured correctly.

      13:45:34,385 WARN  [org.kie.workbench.common.services.backend.builder.ClassVerifier] (http-127.0.0.1/127.0.0.1:8080-8) Verification of class com.google.common.collect.FilteredEntryMultimap$ValuePredicate failed and will not be available for authoring.

      Please check the necessary external dependencies for this project are configured correctly.

      13:45:34,388 WARN  [org.kie.workbench.common.services.backend.builder.ClassVerifier] (http-127.0.0.1/127.0.0.1:8080-8) Verification of class com.google.common.collect.AbstractSortedKeySortedSetMultimap failed and will not be available for authoring.

      Please check the necessary external dependencies for this project are configured correctly.

      13:45:34,396 WARN  [org.kie.workbench.common.services.backend.builder.ClassVerifier] (http-127.0.0.1/127.0.0.1:8080-8) Verification of class com.google.common.collect.Multisets$3$1 failed and will not be available for authoring.

      Please check the necessary external dependencies for this project are configured correctly.

      13:45:34,402 WARN  [org.kie.workbench.common.services.backend.builder.ClassVerifier] (http-127.0.0.1/127.0.0.1:8080-8) Verification of class com.google.common.collect.HashBiMap$BiEntry failed and will not be available for authoring.

      Please check the necessary external dependencies for this project are configured correctly.

      13:45:34,406 WARN  [org.kie.workbench.common.services.backend.builder.ClassVerifier] (http-127.0.0.1/127.0.0.1:8080-8) Verification of class com.google.common.collect.HashBiMap$KeySet$1 failed and will not be available for authoring.

      Please check the necessary external dependencies for this project are configured correctly.

      13:45:34,410 WARN  [org.kie.workbench.common.services.backend.builder.ClassVerifier] (http-127.0.0.1/127.0.0.1:8080-8) Verification of class com.google.common.collect.ImmutableEnumMap$2$1 failed and will not be available for authoring.

      Please check the necessary external dependencies for this project are configured correctly.

      13:45:34,413 WARN  [org.kie.workbench.common.services.backend.builder.ClassVerifier] (http-127.0.0.1/127.0.0.1:8080-8) Verification of class com.google.common.collect.Multisets$FilteredMultiset failed and will not be available for authoring.

      Please check the necessary external dependencies for this project are configured correctly.

      13:45:34,416 WARN  [org.kie.workbench.common.services.backend.builder.ClassVerifier] (http-127.0.0.1/127.0.0.1:8080-8) Verification of class com.google.common.collect.RegularImmutableBiMap$NonTerminalBiMapEntry failed and will not be available for authoring.

      Please check the necessary external dependencies for this project are configured correctly.

      13:45:34,420 WARN  [org.kie.workbench.common.services.backend.builder.ClassVerifier] (http-127.0.0.1/127.0.0.1:8080-8) Verification of class com.google.common.collect.AbstractMapBasedMultimap$WrappedList failed and will not be available for authoring.

      Please check the necessary external dependencies for this project are configured correctly.

      13:45:34,424 WARN  [org.kie.workbench.common.services.backend.builder.ClassVerifier] (http-127.0.0.1/127.0.0.1:8080-8) Verification of class com.google.common.collect.Synchronized$SynchronizedQueue failed and will not be available for authoring.

      Please check the necessary external dependencies for this project are configured correctly.

      13:45:34,430 WARN  [org.kie.workbench.common.services.backend.builder.ClassVerifier] (http-127.0.0.1/127.0.0.1:8080-8) Verification of class com.google.common.collect.ImmutableMap$MapViewOfValuesAsSingletonSets$1$1 failed and will not be available for authoring.

      Please check the necessary external dependencies for this project are configured correctly.

      13:45:34,436 WARN  [org.kie.workbench.common.services.backend.builder.ClassVerifier] (http-127.0.0.1/127.0.0.1:8080-8) Verification of class com.google.common.collect.FilteredEntryMultimap$AsMap$1 failed and will not be available for authoring.

      Please check the necessary external dependencies for this project are configured correctly.

      13:45:34,442 WARN  [org.kie.workbench.common.services.backend.builder.ClassVerifier] (http-127.0.0.1/127.0.0.1:8080-8) Verification of class com.google.common.collect.FilteredEntryMultimap$AsMap$2 failed and will not be available for authoring.

      Please check the necessary external dependencies for this project are configured correctly.

      13:45:34,445 WARN  [org.kie.workbench.common.services.backend.builder.ClassVerifier] (http-127.0.0.1/127.0.0.1:8080-8) Verification of class com.google.common.collect.FilteredEntryMultimap$AsMap$3 failed and will not be available for authoring.

      Please check the necessary external dependencies for this project are configured correctly.

      13:45:34,449 WARN  [org.kie.workbench.common.services.backend.builder.ClassVerifier] (http-127.0.0.1/127.0.0.1:8080-8) Verification of class com.google.common.collect.HashBiMap$Inverse failed and will not be available for authoring.

      Please check the necessary external dependencies for this project are configured correctly.

      13:45:34,453 WARN  [org.kie.workbench.common.services.backend.builder.ClassVerifier] (http-127.0.0.1/127.0.0.1:8080-8) Verification of class com.google.common.collect.Maps$10 failed and will not be available for authoring.

      Please check the necessary external dependencies for this project are configured correctly.

      13:45:34,455 WARN  [org.kie.workbench.common.services.backend.builder.ClassVerifier] (http-127.0.0.1/127.0.0.1:8080-8) Verification of class com.google.common.collect.TreeRangeMap$RangeMapEntry failed and will not be available for authoring.

      Please check the necessary external dependencies for this project are configured correctly.

      13:45:34,458 WARN  [org.kie.workbench.common.services.backend.builder.ClassVerifier] (http-127.0.0.1/127.0.0.1:8080-8) Verification of class com.google.common.collect.TreeRangeSet$SubRangeSet failed and will not be available for authoring.

      Please check the necessary external dependencies for this project are configured correctly.

      13:45:34,461 WARN  [org.kie.workbench.common.services.backend.builder.ClassVerifier] (http-127.0.0.1/127.0.0.1:8080-8) Verification of class com.google.common.collect.HashBiMap$EntrySet failed and will not be available for authoring.

      Please check the necessary external dependencies for this project are configured correctly.

      13:45:34,465 WARN  [org.kie.workbench.common.services.backend.builder.ClassVerifier] (http-127.0.0.1/127.0.0.1:8080-8) Verification of class com.google.common.collect.HashBiMap$Inverse$1$1$InverseEntry failed and will not be available for authoring.

      Please check the necessary external dependencies for this project are configured correctly.

      13:45:34,468 WARN  [org.kie.workbench.common.services.backend.builder.ClassVerifier] (http-127.0.0.1/127.0.0.1:8080-8) Verification of class com.google.common.collect.AbstractMultimap$EntrySet failed and will not be available for authoring.

      Please check the necessary external dependencies for this project are configured correctly.

      13:45:34,474 WARN  [org.kie.workbench.common.services.backend.builder.ClassVerifier] (http-127.0.0.1/127.0.0.1:8080-8) Verification of class com.google.common.collect.AbstractMapBasedMultimap$AsMap$AsMapIterator failed and will not be available for authoring.

      Please check the necessary external dependencies for this project are configured correctly.

      13:45:34,478 WARN  [org.kie.workbench.common.services.backend.builder.ClassVerifier] (http-127.0.0.1/127.0.0.1:8080-8) Verification of class com.google.common.collect.RegularImmutableBiMap$Inverse$InverseEntrySet failed and will not be available for authoring.

      Please check the necessary external dependencies for this project are configured correctly.

      13:45:34,480 WARN  [org.kie.workbench.common.services.backend.builder.ClassVerifier] (http-127.0.0.1/127.0.0.1:8080-8) Verification of class com.google.common.collect.AbstractMapBasedMultimap$NavigableKeySet failed and will not be available for authoring.

      Please check the necessary external dependencies for this project are configured correctly.

      13:45:34,483 WARN  [org.kie.workbench.common.services.backend.builder.ClassVerifier] (http-127.0.0.1/127.0.0.1:8080-8) Verification of class com.google.common.collect.DenseImmutableTable failed and will not be available for authoring.

      Please check the necessary external dependencies for this project are configured correctly.

      13:45:34,487 WARN  [org.kie.workbench.common.services.backend.builder.ClassVerifier] (http-127.0.0.1/127.0.0.1:8080-8) Verification of class com.google.common.collect.AbstractMapBasedMultimap$SortedKeySet failed and will not be available for authoring.

      Please check the necessary external dependencies for this project are configured correctly.

      13:45:34,490 WARN  [org.kie.workbench.common.services.backend.builder.ClassVerifier] (http-127.0.0.1/127.0.0.1:8080-8) Verification of class com.google.common.collect.HashBiMap$KeySet failed and will not be available for authoring.

      Please check the necessary external dependencies for this project are configured correctly.

      13:45:34,493 WARN  [org.kie.workbench.common.services.backend.builder.ClassVerifier] (http-127.0.0.1/127.0.0.1:8080-8) Verification of class com.google.common.collect.DenseImmutableTable$ImmutableArrayMap failed and will not be available for authoring.

      Please check the necessary external dependencies for this project are configured correctly.

      13:45:34,498 WARN  [org.kie.workbench.common.services.backend.builder.ClassVerifier] (http-127.0.0.1/127.0.0.1:8080-8) Verification of class com.google.common.collect.AbstractMapBasedMultimap$NavigableAsMap failed and will not be available for authoring.

      Please check the necessary external dependencies for this project are configured correctly.

      13:45:34,500 WARN  [org.kie.workbench.common.services.backend.builder.ClassVerifier] (http-127.0.0.1/127.0.0.1:8080-8) Verification of class com.google.common.collect.Sets$FilteredNavigableSet failed and will not be available for authoring.

      Please check the necessary external dependencies for this project are configured correctly.

      13:45:34,504 WARN  [org.kie.workbench.common.services.backend.builder.ClassVerifier] (http-127.0.0.1/127.0.0.1:8080-8) Verification of class com.google.common.collect.HashBiMap$EntrySet$1$MapEntry failed and will not be available for authoring.

      Please check the necessary external dependencies for this project are configured correctly.

      13:45:34,512 WARN  [org.kie.workbench.common.services.backend.builder.ClassVerifier] (http-127.0.0.1/127.0.0.1:8080-8) Verification of class com.google.common.collect.ImmutableRangeSet failed and will not be available for authoring.

      Please check the necessary external dependencies for this project are configured correctly.

      13:45:34,514 WARN  [org.kie.workbench.common.services.backend.builder.ClassVerifier] (http-127.0.0.1/127.0.0.1:8080-8) Verification of class com.google.common.collect.SortedMultisets$NavigableElementSet failed and will not be available for authoring.

      Please check the necessary external dependencies for this project are configured correctly.

      13:45:34,522 WARN  [org.kie.workbench.common.services.backend.builder.ClassVerifier] (http-127.0.0.1/127.0.0.1:8080-8) Verification of class com.google.common.collect.AbstractMapBasedMultimap$KeySet failed and will not be available for authoring.

      Please check the necessary external dependencies for this project are configured correctly.

      13:45:34,529 WARN  [org.kie.workbench.common.services.backend.builder.ClassVerifier] (http-127.0.0.1/127.0.0.1:8080-8) Verification of class com.google.common.collect.RegularImmutableTable$CellSet failed and will not be available for authoring.

      Please check the necessary external dependencies for this project are configured correctly.

      13:45:34,534 WARN  [org.kie.workbench.common.services.backend.builder.ClassVerifier] (http-127.0.0.1/127.0.0.1:8080-8) Verification of class com.google.common.collect.ImmutableMapEntry failed and will not be available for authoring.

      Please check the necessary external dependencies for this project are configured correctly.

      13:45:34,539 WARN  [org.kie.workbench.common.services.backend.builder.ClassVerifier] (http-127.0.0.1/127.0.0.1:8080-8) Verification of class com.google.common.collect.RegularImmutableBiMap$Inverse failed and will not be available for authoring.

      Please check the necessary external dependencies for this project are configured correctly.

      13:45:34,544 WARN  [org.kie.workbench.common.services.backend.builder.ClassVerifier] (http-127.0.0.1/127.0.0.1:8080-8) Verification of class com.google.common.collect.Maps$FilteredEntryNavigableMap$1 failed and will not be available for authoring.

      Please check the necessary external dependencies for this project are configured correctly.

      13:45:34,551 WARN  [org.kie.workbench.common.services.backend.builder.ClassVerifier] (http-127.0.0.1/127.0.0.1:8080-8) Verification of class com.google.common.collect.TreeRangeMap$SubRangeMap$SubRangeMapAsMap$2$1 failed and will not be available for authoring.

      Please check the necessary external dependencies for this project are configured correctly.

      13:45:34,555 WARN  [org.kie.workbench.common.services.backend.builder.ClassVerifier] (http-127.0.0.1/127.0.0.1:8080-8) Verification of class com.google.common.collect.HashBiMap$Inverse$InverseKeySet$1 failed and will not be available for authoring.

      Please check the necessary external dependencies for this project are configured correctly.

      13:45:34,560 WARN  [org.kie.workbench.common.services.backend.builder.ClassVerifier] (http-127.0.0.1/127.0.0.1:8080-8) Verification of class com.google.common.collect.FilteredKeyListMultimap failed and will not be available for authoring.

      Please check the necessary external dependencies for this project are configured correctly.

      13:45:34,563 WARN  [org.kie.workbench.common.services.backend.builder.ClassVerifier] (http-127.0.0.1/127.0.0.1:8080-8) Verification of class com.google.common.collect.RegularImmutableBiMap$1 failed and will not be available for authoring.

      Please check the necessary external dependencies for this project are configured correctly.

      13:45:34,567 WARN  [org.kie.workbench.common.services.backend.builder.ClassVerifier] (http-127.0.0.1/127.0.0.1:8080-8) Verification of class com.google.common.collect.RegularImmutableMap$NonTerminalMapEntry failed and will not be available for authoring.

      Please check the necessary external dependencies for this project are configured correctly.

      13:45:34,571 WARN  [org.kie.workbench.common.services.backend.builder.ClassVerifier] (http-127.0.0.1/127.0.0.1:8080-8) Verification of class com.google.common.collect.FilteredEntryMultimap$Keys$1$1 failed and will not be available for authoring.

      Please check the necessary external dependencies for this project are configured correctly.

      13:45:34,573 WARN  [org.kie.workbench.common.services.backend.builder.ClassVerifier] (http-127.0.0.1/127.0.0.1:8080-8) Verification of class com.google.common.collect.AbstractTable$1 failed and will not be available for authoring.

      Please check the necessary external dependencies for this project are configured correctly.

      13:45:34,605 WARN  [org.kie.workbench.common.services.backend.builder.ClassVerifier] (http-127.0.0.1/127.0.0.1:8080-8) Verification of class com.google.common.hash.AbstractByteHasher failed and will not be available for authoring.

      Please check the necessary external dependencies for this project are configured correctly.

      13:45:34,607 WARN  [org.kie.workbench.common.services.backend.builder.ClassVerifier] (http-127.0.0.1/127.0.0.1:8080-8) Verification of class com.google.common.hash.ChecksumHashFunction failed and will not be available for authoring.

      Please check the necessary external dependencies for this project are configured correctly.

      13:45:34,614 WARN  [org.kie.workbench.common.services.backend.builder.ClassVerifier] (http-127.0.0.1/127.0.0.1:8080-8) Verification of class com.google.common.hash.Crc32cHashFunction failed and will not be available for authoring.

      Please check the necessary external dependencies for this project are configured correctly.

      13:45:34,616 WARN  [org.kie.workbench.common.services.backend.builder.ClassVerifier] (http-127.0.0.1/127.0.0.1:8080-8) Verification of class com.google.common.hash.SipHashFunction failed and will not be available for authoring.

      Please check the necessary external dependencies for this project are configured correctly.

      13:45:34,619 WARN  [org.kie.workbench.common.services.backend.builder.ClassVerifier] (http-127.0.0.1/127.0.0.1:8080-8) Verification of class com.google.common.hash.ChecksumHashFunction$ChecksumHasher failed and will not be available for authoring.

      Please check the necessary external dependencies for this project are configured correctly.

      13:45:34,622 WARN  [org.kie.workbench.common.services.backend.builder.ClassVerifier] (http-127.0.0.1/127.0.0.1:8080-8) Verification of class com.google.common.hash.BloomFilterStrategies$2 failed and will not be available for authoring.

      Please check the necessary external dependencies for this project are configured correctly.

      13:45:34,626 WARN  [org.kie.workbench.common.services.backend.builder.ClassVerifier] (http-127.0.0.1/127.0.0.1:8080-8) Verification of class com.google.common.hash.Crc32cHashFunction$Crc32cHasher failed and will not be available for authoring.

      Please check the necessary external dependencies for this project are configured correctly.

      13:45:34,755 WARN  [org.kie.workbench.common.services.backend.builder.ClassVerifier] (http-127.0.0.1/127.0.0.1:8080-8) Verification of class org.joda.time.format.PeriodFormatterBuilder$RegExAffix failed and will not be available for authoring.

      Please check the necessary external dependencies for this project are configured correctly.

      13:45:34,761 WARN  [org.kie.workbench.common.services.backend.builder.ClassVerifier] (http-127.0.0.1/127.0.0.1:8080-8) Verification of class org.joda.time.format.PeriodFormatterBuilder$IgnorableAffix failed and will not be available for authoring.

      Please check the necessary external dependencies for this project are configured correctly.

      13:45:35,397 INFO  [org.jbpm.console.ng.bd.backend.server.DeploymentManagerEntryPointImpl] (http-127.0.0.1/127.0.0.1:8080-8) Deploying unit MyRespositor:SMS2:1.0

      13:45:36,651 WARN  [org.jbpm.runtime.manager.impl.DefaultRegisterableItemsFactory] (http-127.0.0.1/127.0.0.1:8080-8) Unable to find ObjectModelResolver for Enter resolver type

      13:45:36,656 ERROR [org.kie.remote.services.rest.jaxb.DynamicJaxbContextManager] (http-127.0.0.1/127.0.0.1:8080-8) JAXB context instance could not be found when undeploying deployment 'MyRespositor:SMS2:1.0'!

      13:45:36,659 INFO  [org.jbpm.kie.services.impl.store.DeploymentSynchronizer] (http-127.0.0.1/127.0.0.1:8080-8) Deployment unit MyRespositor:SMS2:1.0 removed successfully

      13:45:36,661 WARN  [org.jbpm.kie.services.impl.KModuleDeploymentService] (http-127.0.0.1/127.0.0.1:8080-8) Unexpected error while deploying unit MyRespositor:SMS2:1.0: java.lang.RuntimeException: java.lang.NullPointerException

        at org.jbpm.kie.services.impl.AbstractDeploymentService.commonDeploy(AbstractDeploymentService.java:161) [jbpm-kie-services-6.5.0.Final-redhat-2.jar:6.5.0.Final-redhat-2]

        at org.jbpm.kie.services.impl.KModuleDeploymentService.deploy(KModuleDeploymentService.java:196) [jbpm-kie-services-6.5.0.Final-redhat-2.jar:6.5.0.Final-redhat-2]

        at org.jbpm.services.cdi.impl.DeploymentServiceCDIImpl$Proxy$_$$_WeldClientProxy.deploy(DeploymentServiceCDIImpl$Proxy$_$$_WeldClientProxy.java) [jbpm-services-cdi-6.5.0.Final-redhat-2.jar:6.5.0.Final-redhat-2]

        at org.jbpm.console.ng.bd.backend.server.DeploymentManagerEntryPointImpl.deploy(DeploymentManagerEntryPointImpl.java:194) [jbpm-console-ng-business-domain-backend-6.5.0.Final-redhat-2.jar:6.5.0.Final-redhat-2]

        at org.jbpm.console.ng.bd.backend.server.DeploymentManagerEntryPointImpl.deploy(DeploymentManagerEntryPointImpl.java:158) [jbpm-console-ng-business-domain-backend-6.5.0.Final-redhat-2.jar:6.5.0.Final-redhat-2]

        at org.jbpm.console.ng.bd.backend.server.DeploymentManagerEntryPointImpl.process(DeploymentManagerEntryPointImpl.java:517) [jbpm-console-ng-business-domain-backend-6.5.0.Final-redhat-2.jar:6.5.0.Final-redhat-2]

        at org.jbpm.console.ng.bd.backend.server.DeploymentManagerEntryPointImpl$Proxy$_$$_WeldClientProxy.process(DeploymentManagerEntryPointImpl$Proxy$_$$_WeldClientProxy.java) [jbpm-console-ng-business-domain-backend-6.5.0.Final-redhat-2.jar:6.5.0.Final-redhat-2]

        at org.kie.workbench.common.services.backend.builder.BuildServiceImpl.doBuildAndDeploy(BuildServiceImpl.java:164) [kie-wb-common-services-backend-6.5.0.Final-redhat-2.jar:6.5.0.Final-redhat-2]

        at org.kie.workbench.common.services.backend.builder.BuildServiceImpl.buildAndDeploy(BuildServiceImpl.java:120) [kie-wb-common-services-backend-6.5.0.Final-redhat-2.jar:6.5.0.Final-redhat-2]

        at org.kie.workbench.common.services.backend.builder.BuildServiceImpl$Proxy$_$$_WeldClientProxy.buildAndDeploy(BuildServiceImpl$Proxy$_$$_WeldClientProxy.java) [kie-wb-common-services-backend-6.5.0.Final-redhat-2.jar:6.5.0.Final-redhat-2]

        at sun.reflect.NativeMethodAccessorImpl.invoke0(Native Method) [rt.jar:1.8.0_71]

        at sun.reflect.NativeMethodAccessorImpl.invoke(NativeMethodAccessorImpl.java:62) [rt.jar:1.8.0_71]

        at sun.reflect.DelegatingMethodAccessorImpl.invoke(DelegatingMethodAccessorImpl.java:43) [rt.jar:1.8.0_71]

        at java.lang.reflect.Method.invoke(Method.java:497) [rt.jar:1.8.0_71]

        at org.jboss.errai.bus.server.io.AbstractRPCMethodCallback.invokeMethodFromMessage(AbstractRPCMethodCallback.java:48) [errai-bus-3.2.4.Final-redhat-1.jar:3.2.4.Final-redhat-1]

        at org.jboss.errai.bus.server.io.ValueReplyRPCEndpointCallback.callback(ValueReplyRPCEndpointCallback.java:24) [errai-bus-3.2.4.Final-redhat-1.jar:3.2.4.Final-redhat-1]

        at org.jboss.errai.bus.server.io.RemoteServiceCallback.callback(RemoteServiceCallback.java:54) [errai-bus-3.2.4.Final-redhat-1.jar:3.2.4.Final-redhat-1]

        at org.jboss.errai.cdi.server.CDIExtensionPoints$2.callback(CDIExtensionPoints.java:396) [errai-weld-integration-3.0.6.Final-redhat-1.jar:3.0.6.Final-redhat-1]

        at org.jboss.errai.bus.server.DeliveryPlan.deliver(DeliveryPlan.java:47) [errai-bus-3.2.4.Final-redhat-1.jar:3.2.4.Final-redhat-1]

        at org.jboss.errai.bus.server.ServerMessageBusImpl.sendGlobal(ServerMessageBusImpl.java:296) [errai-bus-3.2.4.Final-redhat-1.jar:3.2.4.Final-redhat-1]

        at org.jboss.errai.bus.server.SimpleDispatcher.dispatchGlobal(SimpleDispatcher.java:46) [errai-bus-3.2.4.Final-redhat-1.jar:3.2.4.Final-redhat-1]

        at org.jboss.errai.bus.server.service.ErraiServiceImpl.store(ErraiServiceImpl.java:97) [errai-bus-3.2.4.Final-redhat-1.jar:3.2.4.Final-redhat-1]

        at org.jboss.errai.bus.server.service.ErraiServiceImpl.store(ErraiServiceImpl.java:114) [errai-bus-3.2.4.Final-redhat-1.jar:3.2.4.Final-redhat-1]

        at org.jboss.errai.bus.server.servlet.DefaultBlockingServlet.doPost(DefaultBlockingServlet.java:142) [errai-bus-3.2.4.Final-redhat-1.jar:3.2.4.Final-redhat-1]

        at javax.servlet.http.HttpServlet.service(HttpServlet.java:754) [jboss-servlet-api_3.0_spec-1.0.2.Final-redhat-2.jar:1.0.2.Final-redhat-2]

        at javax.servlet.http.HttpServlet.service(HttpServlet.java:847) [jboss-servlet-api_3.0_spec-1.0.2.Final-redhat-2.jar:1.0.2.Final-redhat-2]

        at org.apache.catalina.core.ApplicationFilterChain.internalDoFilter(ApplicationFilterChain.java:295) [jbossweb-7.5.7.Final-redhat-1.jar:7.5.7.Final-redhat-1]

        at org.apache.catalina.core.ApplicationFilterChain.doFilter(ApplicationFilterChain.java:214) [jbossweb-7.5.7.Final-redhat-1.jar:7.5.7.Final-redhat-1]

        at org.uberfire.ext.security.server.SecureHeadersFilter.doFilter(SecureHeadersFilter.java:69) [uberfire-servlet-security-0.9.0.Final-redhat-3.jar:0.9.0.Final-redhat-3]

        at org.apache.catalina.core.ApplicationFilterChain.internalDoFilter(ApplicationFilterChain.java:246) [jbossweb-7.5.7.Final-redhat-1.jar:7.5.7.Final-redhat-1]

        at org.apache.catalina.core.ApplicationFilterChain.doFilter(ApplicationFilterChain.java:214) [jbossweb-7.5.7.Final-redhat-1.jar:7.5.7.Final-redhat-1]

        at org.uberfire.ext.security.server.SecurityIntegrationFilter.doFilter(SecurityIntegrationFilter.java:57) [uberfire-servlet-security-0.9.0.Final-redhat-3.jar:0.9.0.Final-redhat-3]

        at org.apache.catalina.core.ApplicationFilterChain.internalDoFilter(ApplicationFilterChain.java:246) [jbossweb-7.5.7.Final-redhat-1.jar:7.5.7.Final-redhat-1]

        at org.apache.catalina.core.ApplicationFilterChain.doFilter(ApplicationFilterChain.java:214) [jbossweb-7.5.7.Final-redhat-1.jar:7.5.7.Final-redhat-1]

        at org.apache.catalina.core.StandardWrapperValve.invoke(StandardWrapperValve.java:231) [jbossweb-7.5.7.Final-redhat-1.jar:7.5.7.Final-redhat-1]

        at org.apache.catalina.core.StandardContextValve.invoke(StandardContextValve.java:149) [jbossweb-7.5.7.Final-redhat-1.jar:7.5.7.Final-redhat-1]

        at org.apache.catalina.authenticator.AuthenticatorBase.invoke(AuthenticatorBase.java:512) [jbossweb-7.5.7.Final-redhat-1.jar:7.5.7.Final-redhat-1]

        at org.jboss.as.jpa.interceptor.WebNonTxEmCloserValve.invoke(WebNonTxEmCloserValve.java:50) [jboss-as-jpa-7.5.0.Final-redhat-21.jar:7.5.0.Final-redhat-21]

        at org.jboss.as.jpa.interceptor.WebNonTxEmCloserValve.invoke(WebNonTxEmCloserValve.java:50) [jboss-as-jpa-7.5.0.Final-redhat-21.jar:7.5.0.Final-redhat-21]

        at org.jboss.as.web.security.SecurityContextAssociationValve.invoke(SecurityContextAssociationValve.java:169) [jboss-as-web-7.5.0.Final-redhat-21.jar:7.5.0.Final-redhat-21]

        at org.apache.catalina.core.StandardHostValve.invoke(StandardHostValve.java:150) [jbossweb-7.5.7.Final-redhat-1.jar:7.5.7.Final-redhat-1]

        at org.apache.catalina.valves.ErrorReportValve.invoke(ErrorReportValve.java:97) [jbossweb-7.5.7.Final-redhat-1.jar:7.5.7.Final-redhat-1]

        at org.apache.catalina.authenticator.SingleSignOn.invoke(SingleSignOn.java:419) [jbossweb-7.5.7.Final-redhat-1.jar:7.5.7.Final-redhat-1]

        at org.apache.catalina.core.StandardEngineValve.invoke(StandardEngineValve.java:102) [jbossweb-7.5.7.Final-redhat-1.jar:7.5.7.Final-redhat-1]

        at org.apache.catalina.connector.CoyoteAdapter.service(CoyoteAdapter.java:344) [jbossweb-7.5.7.Final-redhat-1.jar:7.5.7.Final-redhat-1]

        at org.apache.coyote.http11.Http11Processor.process(Http11Processor.java:854) [jbossweb-7.5.7.Final-redhat-1.jar:7.5.7.Final-redhat-1]

        at org.apache.coyote.http11.Http11Protocol$Http11ConnectionHandler.process(Http11Protocol.java:653) [jbossweb-7.5.7.Final-redhat-1.jar:7.5.7.Final-redhat-1]

        at org.apache.tomcat.util.net.JIoEndpoint$Worker.run(JIoEndpoint.java:926) [jbossweb-7.5.7.Final-redhat-1.jar:7.5.7.Final-redhat-1]

        at java.lang.Thread.run(Thread.java:745) [rt.jar:1.8.0_71]

      Caused by: java.lang.NullPointerException

        at org.jbpm.runtime.manager.impl.DefaultRegisterableItemsFactory.getInstanceFromModel(DefaultRegisterableItemsFactory.java:211) [jbpm-runtime-manager-6.5.0.Final-redhat-2.jar:6.5.0.Final-redhat-2]

        at org.jbpm.runtime.manager.impl.DefaultRegisterableItemsFactory.getGlobalsFromDescriptor(DefaultRegisterableItemsFactory.java:291) [jbpm-runtime-manager-6.5.0.Final-redhat-2.jar:6.5.0.Final-redhat-2]

        at org.jbpm.services.cdi.impl.manager.InjectableRegisterableItemsFactory.getGlobals(InjectableRegisterableItemsFactory.java:278) [jbpm-services-cdi-6.5.0.Final-redhat-2.jar:6.5.0.Final-redhat-2]

        at org.jbpm.runtime.manager.impl.AbstractRuntimeManager.registerItems(AbstractRuntimeManager.java:125) [jbpm-runtime-manager-6.5.0.Final-redhat-2.jar:6.5.0.Final-redhat-2]

        at org.jbpm.runtime.manager.impl.SingletonRuntimeManager.init(SingletonRuntimeManager.java:104) [jbpm-runtime-manager-6.5.0.Final-redhat-2.jar:6.5.0.Final-redhat-2]

        at org.jbpm.runtime.manager.impl.RuntimeManagerFactoryImpl.newSingletonRuntimeManager(RuntimeManagerFactoryImpl.java:64) [jbpm-runtime-manager-6.5.0.Final-redhat-2.jar:6.5.0.Final-redhat-2]

        at org.jbpm.services.cdi.impl.manager.RuntimeManagerFactoryCDIImpl$Proxy$_$$_WeldClientProxy.newSingletonRuntimeManager(RuntimeManagerFactoryCDIImpl$Proxy$_$$_WeldClientProxy.java) [jbpm-services-cdi-6.5.0.Final-redhat-2.jar:6.5.0.Final-redhat-2]

        at org.jbpm.kie.services.impl.AbstractDeploymentService.commonDeploy(AbstractDeploymentService.java:134) [jbpm-kie-services-6.5.0.Final-redhat-2.jar:6.5.0.Final-redhat-2]

        ... 48 more

       

       

      13:45:36,823 WARN  [org.jbpm.console.ng.bd.backend.server.DeploymentManagerEntryPointImpl] (http-127.0.0.1/127.0.0.1:8080-8) Deployment of unit MyRespositor:SMS2:1.0 failed: java.lang.RuntimeException: java.lang.NullPointerException: java.lang.RuntimeException: java.lang.RuntimeException: java.lang.NullPointerException

        at org.jbpm.kie.services.impl.KModuleDeploymentService.deploy(KModuleDeploymentService.java:201) [jbpm-kie-services-6.5.0.Final-redhat-2.jar:6.5.0.Final-redhat-2]

        at org.jbpm.services.cdi.impl.DeploymentServiceCDIImpl$Proxy$_$$_WeldClientProxy.deploy(DeploymentServiceCDIImpl$Proxy$_$$_WeldClientProxy.java) [jbpm-services-cdi-6.5.0.Final-redhat-2.jar:6.5.0.Final-redhat-2]

        at org.jbpm.console.ng.bd.backend.server.DeploymentManagerEntryPointImpl.deploy(DeploymentManagerEntryPointImpl.java:194) [jbpm-console-ng-business-domain-backend-6.5.0.Final-redhat-2.jar:6.5.0.Final-redhat-2]

        at org.jbpm.console.ng.bd.backend.server.DeploymentManagerEntryPointImpl.deploy(DeploymentManagerEntryPointImpl.java:158) [jbpm-console-ng-business-domain-backend-6.5.0.Final-redhat-2.jar:6.5.0.Final-redhat-2]

        at org.jbpm.console.ng.bd.backend.server.DeploymentManagerEntryPointImpl.process(DeploymentManagerEntryPointImpl.java:517) [jbpm-console-ng-business-domain-backend-6.5.0.Final-redhat-2.jar:6.5.0.Final-redhat-2]

        at org.jbpm.console.ng.bd.backend.server.DeploymentManagerEntryPointImpl$Proxy$_$$_WeldClientProxy.process(DeploymentManagerEntryPointImpl$Proxy$_$$_WeldClientProxy.java) [jbpm-console-ng-business-domain-backend-6.5.0.Final-redhat-2.jar:6.5.0.Final-redhat-2]

        at org.kie.workbench.common.services.backend.builder.BuildServiceImpl.doBuildAndDeploy(BuildServiceImpl.java:164) [kie-wb-common-services-backend-6.5.0.Final-redhat-2.jar:6.5.0.Final-redhat-2]

        at org.kie.workbench.common.services.backend.builder.BuildServiceImpl.buildAndDeploy(BuildServiceImpl.java:120) [kie-wb-common-services-backend-6.5.0.Final-redhat-2.jar:6.5.0.Final-redhat-2]

        at org.kie.workbench.common.services.backend.builder.BuildServiceImpl$Proxy$_$$_WeldClientProxy.buildAndDeploy(BuildServiceImpl$Proxy$_$$_WeldClientProxy.java) [kie-wb-common-services-backend-6.5.0.Final-redhat-2.jar:6.5.0.Final-redhat-2]

        at sun.reflect.NativeMethodAccessorImpl.invoke0(Native Method) [rt.jar:1.8.0_71]

        at sun.reflect.NativeMethodAccessorImpl.invoke(NativeMethodAccessorImpl.java:62) [rt.jar:1.8.0_71]

        at sun.reflect.DelegatingMethodAccessorImpl.invoke(DelegatingMethodAccessorImpl.java:43) [rt.jar:1.8.0_71]

        at java.lang.reflect.Method.invoke(Method.java:497) [rt.jar:1.8.0_71]

        at org.jboss.errai.bus.server.io.AbstractRPCMethodCallback.invokeMethodFromMessage(AbstractRPCMethodCallback.java:48) [errai-bus-3.2.4.Final-redhat-1.jar:3.2.4.Final-redhat-1]

        at org.jboss.errai.bus.server.io.ValueReplyRPCEndpointCallback.callback(ValueReplyRPCEndpointCallback.java:24) [errai-bus-3.2.4.Final-redhat-1.jar:3.2.4.Final-redhat-1]

        at org.jboss.errai.bus.server.io.RemoteServiceCallback.callback(RemoteServiceCallback.java:54) [errai-bus-3.2.4.Final-redhat-1.jar:3.2.4.Final-redhat-1]

        at org.jboss.errai.cdi.server.CDIExtensionPoints$2.callback(CDIExtensionPoints.java:396) [errai-weld-integration-3.0.6.Final-redhat-1.jar:3.0.6.Final-redhat-1]

        at org.jboss.errai.bus.server.DeliveryPlan.deliver(DeliveryPlan.java:47) [errai-bus-3.2.4.Final-redhat-1.jar:3.2.4.Final-redhat-1]

        at org.jboss.errai.bus.server.ServerMessageBusImpl.sendGlobal(ServerMessageBusImpl.java:296) [errai-bus-3.2.4.Final-redhat-1.jar:3.2.4.Final-redhat-1]

        at org.jboss.errai.bus.server.SimpleDispatcher.dispatchGlobal(SimpleDispatcher.java:46) [errai-bus-3.2.4.Final-redhat-1.jar:3.2.4.Final-redhat-1]

        at org.jboss.errai.bus.server.service.ErraiServiceImpl.store(ErraiServiceImpl.java:97) [errai-bus-3.2.4.Final-redhat-1.jar:3.2.4.Final-redhat-1]

        at org.jboss.errai.bus.server.service.ErraiServiceImpl.store(ErraiServiceImpl.java:114) [errai-bus-3.2.4.Final-redhat-1.jar:3.2.4.Final-redhat-1]

        at org.jboss.errai.bus.server.servlet.DefaultBlockingServlet.doPost(DefaultBlockingServlet.java:142) [errai-bus-3.2.4.Final-redhat-1.jar:3.2.4.Final-redhat-1]

        at javax.servlet.http.HttpServlet.service(HttpServlet.java:754) [jboss-servlet-api_3.0_spec-1.0.2.Final-redhat-2.jar:1.0.2.Final-redhat-2]

        at javax.servlet.http.HttpServlet.service(HttpServlet.java:847) [jboss-servlet-api_3.0_spec-1.0.2.Final-redhat-2.jar:1.0.2.Final-redhat-2]

        at org.apache.catalina.core.ApplicationFilterChain.internalDoFilter(ApplicationFilterChain.java:295) [jbossweb-7.5.7.Final-redhat-1.jar:7.5.7.Final-redhat-1]

        at org.apache.catalina.core.ApplicationFilterChain.doFilter(ApplicationFilterChain.java:214) [jbossweb-7.5.7.Final-redhat-1.jar:7.5.7.Final-redhat-1]

        at org.uberfire.ext.security.server.SecureHeadersFilter.doFilter(SecureHeadersFilter.java:69) [uberfire-servlet-security-0.9.0.Final-redhat-3.jar:0.9.0.Final-redhat-3]

        at org.apache.catalina.core.ApplicationFilterChain.internalDoFilter(ApplicationFilterChain.java:246) [jbossweb-7.5.7.Final-redhat-1.jar:7.5.7.Final-redhat-1]

        at org.apache.catalina.core.ApplicationFilterChain.doFilter(ApplicationFilterChain.java:214) [jbossweb-7.5.7.Final-redhat-1.jar:7.5.7.Final-redhat-1]

        at org.uberfire.ext.security.server.SecurityIntegrationFilter.doFilter(SecurityIntegrationFilter.java:57) [uberfire-servlet-security-0.9.0.Final-redhat-3.jar:0.9.0.Final-redhat-3]

        at org.apache.catalina.core.ApplicationFilterChain.internalDoFilter(ApplicationFilterChain.java:246) [jbossweb-7.5.7.Final-redhat-1.jar:7.5.7.Final-redhat-1]

        at org.apache.catalina.core.ApplicationFilterChain.doFilter(ApplicationFilterChain.java:214) [jbossweb-7.5.7.Final-redhat-1.jar:7.5.7.Final-redhat-1]

        at org.apache.catalina.core.StandardWrapperValve.invoke(StandardWrapperValve.java:231) [jbossweb-7.5.7.Final-redhat-1.jar:7.5.7.Final-redhat-1]

        at org.apache.catalina.core.StandardContextValve.invoke(StandardContextValve.java:149) [jbossweb-7.5.7.Final-redhat-1.jar:7.5.7.Final-redhat-1]

        at org.apache.catalina.authenticator.AuthenticatorBase.invoke(AuthenticatorBase.java:512) [jbossweb-7.5.7.Final-redhat-1.jar:7.5.7.Final-redhat-1]

        at org.jboss.as.jpa.interceptor.WebNonTxEmCloserValve.invoke(WebNonTxEmCloserValve.java:50) [jboss-as-jpa-7.5.0.Final-redhat-21.jar:7.5.0.Final-redhat-21]

        at org.jboss.as.jpa.interceptor.WebNonTxEmCloserValve.invoke(WebNonTxEmCloserValve.java:50) [jboss-as-jpa-7.5.0.Final-redhat-21.jar:7.5.0.Final-redhat-21]

        at org.jboss.as.web.security.SecurityContextAssociationValve.invoke(SecurityContextAssociationValve.java:169) [jboss-as-web-7.5.0.Final-redhat-21.jar:7.5.0.Final-redhat-21]

        at org.apache.catalina.core.StandardHostValve.invoke(StandardHostValve.java:150) [jbossweb-7.5.7.Final-redhat-1.jar:7.5.7.Final-redhat-1]

        at org.apache.catalina.valves.ErrorReportValve.invoke(ErrorReportValve.java:97) [jbossweb-7.5.7.Final-redhat-1.jar:7.5.7.Final-redhat-1]

        at org.apache.catalina.authenticator.SingleSignOn.invoke(SingleSignOn.java:419) [jbossweb-7.5.7.Final-redhat-1.jar:7.5.7.Final-redhat-1]

        at org.apache.catalina.core.StandardEngineValve.invoke(StandardEngineValve.java:102) [jbossweb-7.5.7.Final-redhat-1.jar:7.5.7.Final-redhat-1]

        at org.apache.catalina.connector.CoyoteAdapter.service(CoyoteAdapter.java:344) [jbossweb-7.5.7.Final-redhat-1.jar:7.5.7.Final-redhat-1]

        at org.apache.coyote.http11.Http11Processor.process(Http11Processor.java:854) [jbossweb-7.5.7.Final-redhat-1.jar:7.5.7.Final-redhat-1]

        at org.apache.coyote.http11.Http11Protocol$Http11ConnectionHandler.process(Http11Protocol.java:653) [jbossweb-7.5.7.Final-redhat-1.jar:7.5.7.Final-redhat-1]

        at org.apache.tomcat.util.net.JIoEndpoint$Worker.run(JIoEndpoint.java:926) [jbossweb-7.5.7.Final-redhat-1.jar:7.5.7.Final-redhat-1]

        at java.lang.Thread.run(Thread.java:745) [rt.jar:1.8.0_71]

      Caused by: java.lang.RuntimeException: java.lang.NullPointerException

        at org.jbpm.kie.services.impl.AbstractDeploymentService.commonDeploy(AbstractDeploymentService.java:161) [jbpm-kie-services-6.5.0.Final-redhat-2.jar:6.5.0.Final-redhat-2]

        at org.jbpm.kie.services.impl.KModuleDeploymentService.deploy(KModuleDeploymentService.java:196) [jbpm-kie-services-6.5.0.Final-redhat-2.jar:6.5.0.Final-redhat-2]

        ... 47 more

      Caused by: java.lang.NullPointerException

        at org.jbpm.runtime.manager.impl.DefaultRegisterableItemsFactory.getInstanceFromModel(DefaultRegisterableItemsFactory.java:211) [jbpm-runtime-manager-6.5.0.Final-redhat-2.jar:6.5.0.Final-redhat-2]

        at org.jbpm.runtime.manager.impl.DefaultRegisterableItemsFactory.getGlobalsFromDescriptor(DefaultRegisterableItemsFactory.java:291) [jbpm-runtime-manager-6.5.0.Final-redhat-2.jar:6.5.0.Final-redhat-2]

        at org.jbpm.services.cdi.impl.manager.InjectableRegisterableItemsFactory.getGlobals(InjectableRegisterableItemsFactory.java:278) [jbpm-services-cdi-6.5.0.Final-redhat-2.jar:6.5.0.Final-redhat-2]

        at org.jbpm.runtime.manager.impl.AbstractRuntimeManager.registerItems(AbstractRuntimeManager.java:125) [jbpm-runtime-manager-6.5.0.Final-redhat-2.jar:6.5.0.Final-redhat-2]

        at org.jbpm.runtime.manager.impl.SingletonRuntimeManager.init(SingletonRuntimeManager.java:104) [jbpm-runtime-manager-6.5.0.Final-redhat-2.jar:6.5.0.Final-redhat-2]

        at org.jbpm.runtime.manager.impl.RuntimeManagerFactoryImpl.newSingletonRuntimeManager(RuntimeManagerFactoryImpl.java:64) [jbpm-runtime-manager-6.5.0.Final-redhat-2.jar:6.5.0.Final-redhat-2]

        at org.jbpm.services.cdi.impl.manager.RuntimeManagerFactoryCDIImpl$Proxy$_$$_WeldClientProxy.newSingletonRuntimeManager(RuntimeManagerFactoryCDIImpl$Proxy$_$$_WeldClientProxy.java) [jbpm-services-cdi-6.5.0.Final-redhat-2.jar:6.5.0.Final-redhat-2]

        at org.jbpm.kie.services.impl.AbstractDeploymentService.commonDeploy(AbstractDeploymentService.java:134) [jbpm-kie-services-6.5.0.Final-redhat-2.jar:6.5.0.Final-redhat-2]

        ... 48 more

       

       

      13:45:37,071 ERROR [org.jbpm.console.ng.bd.backend.server.DeploymentManagerEntryPointImpl] (http-127.0.0.1/127.0.0.1:8080-8) Deployment of unit MyRespositor:SMS2:1.0 failed: java.lang.RuntimeException: java.lang.NullPointerException: org.jbpm.console.ng.bd.exception.DeploymentException: java.lang.RuntimeException: java.lang.NullPointerException

        at org.jbpm.console.ng.bd.backend.server.DeploymentManagerEntryPointImpl.deploy(DeploymentManagerEntryPointImpl.java:203) [jbpm-console-ng-business-domain-backend-6.5.0.Final-redhat-2.jar:6.5.0.Final-redhat-2]

        at org.jbpm.console.ng.bd.backend.server.DeploymentManagerEntryPointImpl.deploy(DeploymentManagerEntryPointImpl.java:158) [jbpm-console-ng-business-domain-backend-6.5.0.Final-redhat-2.jar:6.5.0.Final-redhat-2]

        at org.jbpm.console.ng.bd.backend.server.DeploymentManagerEntryPointImpl.process(DeploymentManagerEntryPointImpl.java:517) [jbpm-console-ng-business-domain-backend-6.5.0.Final-redhat-2.jar:6.5.0.Final-redhat-2]

        at org.jbpm.console.ng.bd.backend.server.DeploymentManagerEntryPointImpl$Proxy$_$$_WeldClientProxy.process(DeploymentManagerEntryPointImpl$Proxy$_$$_WeldClientProxy.java) [jbpm-console-ng-business-domain-backend-6.5.0.Final-redhat-2.jar:6.5.0.Final-redhat-2]

        at org.kie.workbench.common.services.backend.builder.BuildServiceImpl.doBuildAndDeploy(BuildServiceImpl.java:164) [kie-wb-common-services-backend-6.5.0.Final-redhat-2.jar:6.5.0.Final-redhat-2]

        at org.kie.workbench.common.services.backend.builder.BuildServiceImpl.buildAndDeploy(BuildServiceImpl.java:120) [kie-wb-common-services-backend-6.5.0.Final-redhat-2.jar:6.5.0.Final-redhat-2]

        at org.kie.workbench.common.services.backend.builder.BuildServiceImpl$Proxy$_$$_WeldClientProxy.buildAndDeploy(BuildServiceImpl$Proxy$_$$_WeldClientProxy.java) [kie-wb-common-services-backend-6.5.0.Final-redhat-2.jar:6.5.0.Final-redhat-2]

        at sun.reflect.NativeMethodAccessorImpl.invoke0(Native Method) [rt.jar:1.8.0_71]

        at sun.reflect.NativeMethodAccessorImpl.invoke(NativeMethodAccessorImpl.java:62) [rt.jar:1.8.0_71]

        at sun.reflect.DelegatingMethodAccessorImpl.invoke(DelegatingMethodAccessorImpl.java:43) [rt.jar:1.8.0_71]

        at java.lang.reflect.Method.invoke(Method.java:497) [rt.jar:1.8.0_71]

        at org.jboss.errai.bus.server.io.AbstractRPCMethodCallback.invokeMethodFromMessage(AbstractRPCMethodCallback.java:48) [errai-bus-3.2.4.Final-redhat-1.jar:3.2.4.Final-redhat-1]

        at org.jboss.errai.bus.server.io.ValueReplyRPCEndpointCallback.callback(ValueReplyRPCEndpointCallback.java:24) [errai-bus-3.2.4.Final-redhat-1.jar:3.2.4.Final-redhat-1]

        at org.jboss.errai.bus.server.io.RemoteServiceCallback.callback(RemoteServiceCallback.java:54) [errai-bus-3.2.4.Final-redhat-1.jar:3.2.4.Final-redhat-1]

        at org.jboss.errai.cdi.server.CDIExtensionPoints$2.callback(CDIExtensionPoints.java:396) [errai-weld-integration-3.0.6.Final-redhat-1.jar:3.0.6.Final-redhat-1]

        at org.jboss.errai.bus.server.DeliveryPlan.deliver(DeliveryPlan.java:47) [errai-bus-3.2.4.Final-redhat-1.jar:3.2.4.Final-redhat-1]

        at org.jboss.errai.bus.server.ServerMessageBusImpl.sendGlobal(ServerMessageBusImpl.java:296) [errai-bus-3.2.4.Final-redhat-1.jar:3.2.4.Final-redhat-1]

        at org.jboss.errai.bus.server.SimpleDispatcher.dispatchGlobal(SimpleDispatcher.java:46) [errai-bus-3.2.4.Final-redhat-1.jar:3.2.4.Final-redhat-1]

        at org.jboss.errai.bus.server.service.ErraiServiceImpl.store(ErraiServiceImpl.java:97) [errai-bus-3.2.4.Final-redhat-1.jar:3.2.4.Final-redhat-1]

        at org.jboss.errai.bus.server.service.ErraiServiceImpl.store(ErraiServiceImpl.java:114) [errai-bus-3.2.4.Final-redhat-1.jar:3.2.4.Final-redhat-1]

        at org.jboss.errai.bus.server.servlet.DefaultBlockingServlet.doPost(DefaultBlockingServlet.java:142) [errai-bus-3.2.4.Final-redhat-1.jar:3.2.4.Final-redhat-1]

        at javax.servlet.http.HttpServlet.service(HttpServlet.java:754) [jboss-servlet-api_3.0_spec-1.0.2.Final-redhat-2.jar:1.0.2.Final-redhat-2]

        at javax.servlet.http.HttpServlet.service(HttpServlet.java:847) [jboss-servlet-api_3.0_spec-1.0.2.Final-redhat-2.jar:1.0.2.Final-redhat-2]

        at org.apache.catalina.core.ApplicationFilterChain.internalDoFilter(ApplicationFilterChain.java:295) [jbossweb-7.5.7.Final-redhat-1.jar:7.5.7.Final-redhat-1]

        at org.apache.catalina.core.ApplicationFilterChain.doFilter(ApplicationFilterChain.java:214) [jbossweb-7.5.7.Final-redhat-1.jar:7.5.7.Final-redhat-1]

        at org.uberfire.ext.security.server.SecureHeadersFilter.doFilter(SecureHeadersFilter.java:69) [uberfire-servlet-security-0.9.0.Final-redhat-3.jar:0.9.0.Final-redhat-3]

        at org.apache.catalina.core.ApplicationFilterChain.internalDoFilter(ApplicationFilterChain.java:246) [jbossweb-7.5.7.Final-redhat-1.jar:7.5.7.Final-redhat-1]

        at org.apache.catalina.core.ApplicationFilterChain.doFilter(ApplicationFilterChain.java:214) [jbossweb-7.5.7.Final-redhat-1.jar:7.5.7.Final-redhat-1]

        at org.uberfire.ext.security.server.SecurityIntegrationFilter.doFilter(SecurityIntegrationFilter.java:57) [uberfire-servlet-security-0.9.0.Final-redhat-3.jar:0.9.0.Final-redhat-3]

        at org.apache.catalina.core.ApplicationFilterChain.internalDoFilter(ApplicationFilterChain.java:246) [jbossweb-7.5.7.Final-redhat-1.jar:7.5.7.Final-redhat-1]

        at org.apache.catalina.core.ApplicationFilterChain.doFilter(ApplicationFilterChain.java:214) [jbossweb-7.5.7.Final-redhat-1.jar:7.5.7.Final-redhat-1]

        at org.apache.catalina.core.StandardWrapperValve.invoke(StandardWrapperValve.java:231) [jbossweb-7.5.7.Final-redhat-1.jar:7.5.7.Final-redhat-1]

        at org.apache.catalina.core.StandardContextValve.invoke(StandardContextValve.java:149) [jbossweb-7.5.7.Final-redhat-1.jar:7.5.7.Final-redhat-1]

        at org.apache.catalina.authenticator.AuthenticatorBase.invoke(AuthenticatorBase.java:512) [jbossweb-7.5.7.Final-redhat-1.jar:7.5.7.Final-redhat-1]

        at org.jboss.as.jpa.interceptor.WebNonTxEmCloserValve.invoke(WebNonTxEmCloserValve.java:50) [jboss-as-jpa-7.5.0.Final-redhat-21.jar:7.5.0.Final-redhat-21]

        at org.jboss.as.jpa.interceptor.WebNonTxEmCloserValve.invoke(WebNonTxEmCloserValve.java:50) [jboss-as-jpa-7.5.0.Final-redhat-21.jar:7.5.0.Final-redhat-21]

        at org.jboss.as.web.security.SecurityContextAssociationValve.invoke(SecurityContextAssociationValve.java:169) [jboss-as-web-7.5.0.Final-redhat-21.jar:7.5.0.Final-redhat-21]

        at org.apache.catalina.core.StandardHostValve.invoke(StandardHostValve.java:150) [jbossweb-7.5.7.Final-redhat-1.jar:7.5.7.Final-redhat-1]

        at org.apache.catalina.valves.ErrorReportValve.invoke(ErrorReportValve.java:97) [jbossweb-7.5.7.Final-redhat-1.jar:7.5.7.Final-redhat-1]

        at org.apache.catalina.authenticator.SingleSignOn.invoke(SingleSignOn.java:419) [jbossweb-7.5.7.Final-redhat-1.jar:7.5.7.Final-redhat-1]

        at org.apache.catalina.core.StandardEngineValve.invoke(StandardEngineValve.java:102) [jbossweb-7.5.7.Final-redhat-1.jar:7.5.7.Final-redhat-1]

        at org.apache.catalina.connector.CoyoteAdapter.service(CoyoteAdapter.java:344) [jbossweb-7.5.7.Final-redhat-1.jar:7.5.7.Final-redhat-1]

        at org.apache.coyote.http11.Http11Processor.process(Http11Processor.java:854) [jbossweb-7.5.7.Final-redhat-1.jar:7.5.7.Final-redhat-1]

        at org.apache.coyote.http11.Http11Protocol$Http11ConnectionHandler.process(Http11Protocol.java:653) [jbossweb-7.5.7.Final-redhat-1.jar:7.5.7.Final-redhat-1]

        at org.apache.tomcat.util.net.JIoEndpoint$Worker.run(JIoEndpoint.java:926) [jbossweb-7.5.7.Final-redhat-1.jar:7.5.7.Final-redhat-1]

        at java.lang.Thread.run(Thread.java:745) [rt.jar:1.8.0_71]

      Caused by: java.lang.RuntimeException: java.lang.RuntimeException: java.lang.NullPointerException

        at org.jbpm.kie.services.impl.KModuleDeploymentService.deploy(KModuleDeploymentService.java:201) [jbpm-kie-services-6.5.0.Final-redhat-2.jar:6.5.0.Final-redhat-2]

        at org.jbpm.services.cdi.impl.DeploymentServiceCDIImpl$Proxy$_$$_WeldClientProxy.deploy(DeploymentServiceCDIImpl$Proxy$_$$_WeldClientProxy.java) [jbpm-services-cdi-6.5.0.Final-redhat-2.jar:6.5.0.Final-redhat-2]

        at org.jbpm.console.ng.bd.backend.server.DeploymentManagerEntryPointImpl.deploy(DeploymentManagerEntryPointImpl.java:194) [jbpm-console-ng-business-domain-backend-6.5.0.Final-redhat-2.jar:6.5.0.Final-redhat-2]

        ... 45 more

      Caused by: java.lang.RuntimeException: java.lang.NullPointerException

        at org.jbpm.kie.services.impl.AbstractDeploymentService.commonDeploy(AbstractDeploymentService.java:161) [jbpm-kie-services-6.5.0.Final-redhat-2.jar:6.5.0.Final-redhat-2]

        at org.jbpm.kie.services.impl.KModuleDeploymentService.deploy(KModuleDeploymentService.java:196) [jbpm-kie-services-6.5.0.Final-redhat-2.jar:6.5.0.Final-redhat-2]

        ... 47 more

      Caused by: java.lang.NullPointerException

        at org.jbpm.runtime.manager.impl.DefaultRegisterableItemsFactory.getInstanceFromModel(DefaultRegisterableItemsFactory.java:211) [jbpm-runtime-manager-6.5.0.Final-redhat-2.jar:6.5.0.Final-redhat-2]

        at org.jbpm.runtime.manager.impl.DefaultRegisterableItemsFactory.getGlobalsFromDescriptor(DefaultRegisterableItemsFactory.java:291) [jbpm-runtime-manager-6.5.0.Final-redhat-2.jar:6.5.0.Final-redhat-2]

        at org.jbpm.services.cdi.impl.manager.InjectableRegisterableItemsFactory.getGlobals(InjectableRegisterableItemsFactory.java:278) [jbpm-services-cdi-6.5.0.Final-redhat-2.jar:6.5.0.Final-redhat-2]

        at org.jbpm.runtime.manager.impl.AbstractRuntimeManager.registerItems(AbstractRuntimeManager.java:125) [jbpm-runtime-manager-6.5.0.Final-redhat-2.jar:6.5.0.Final-redhat-2]

        at org.jbpm.runtime.manager.impl.SingletonRuntimeManager.init(SingletonRuntimeManager.java:104) [jbpm-runtime-manager-6.5.0.Final-redhat-2.jar:6.5.0.Final-redhat-2]

        at org.jbpm.runtime.manager.impl.RuntimeManagerFactoryImpl.newSingletonRuntimeManager(RuntimeManagerFactoryImpl.java:64) [jbpm-runtime-manager-6.5.0.Final-redhat-2.jar:6.5.0.Final-redhat-2]

        at org.jbpm.services.cdi.impl.manager.RuntimeManagerFactoryCDIImpl$Proxy$_$$_WeldClientProxy.newSingletonRuntimeManager(RuntimeManagerFactoryCDIImpl$Proxy$_$$_WeldClientProxy.java) [jbpm-services-cdi-6.5.0.Final-redhat-2.jar:6.5.0.Final-redhat-2]

        at org.jbpm.kie.services.impl.AbstractDeploymentService.commonDeploy(AbstractDeploymentService.java:134) [jbpm-kie-services-6.5.0.Final-redhat-2.jar:6.5.0.Final-redhat-2]

        ... 48 more

       

      This is how I created my service task:

      1. Created a jar file which can send Message. (Attached to this discussion. More information about it at the end of the discussion)

      2. I uploaded the jar into the Artifact repository.

      Artifacts.PNG

      3 Created a project with a business process.

      4 Went to Project Editor -Dependencies  and added dependence to uploaded jar.

      Dependecies.PNG

      5 Then open: Project Editor - Deployment description and register given work item handler

      6 The went to Work Item definitions and added the work item handler. (TO is the phone number which you are sending the text. Example +14168050566, TEXT is the message you want to send example "Hello George")

      Work Item Definitons.PNG

       

      7 Added the service task to my business Process fill the two input with constant and tried to build it.

       

      ------------------------------------------------------------ More information about the jar file  ---------------------------------------------------------------------------

      The jar file utilized twilio to send Messages. It is attached to this document.

      Here is the work item handler class which I created

       

      1. package org.jugvale.jbpm.workitemhandler; 
      2. import org.drools.core.process.instance.WorkItemHandler; 
      3. import org.kie.api.runtime.process.WorkItem; 
      4. import org.kie.api.runtime.process.WorkItemManager; 
      5. import com.twilio.Twilio; 
      6. import com.twilio.rest.api.v2010.account.Message; 
      7. import com.twilio.type.PhoneNumber; 
      8. import java.net.URI; 
      9. import java.net.URISyntaxException; 
      10. public class SMSWorkItemHandler implements WorkItemHandler { 
      11.   public static final String ACCOUNT_SID = "AC0dca7f22866e653a4ac8d22e9c2bd102"
      12.   public static final String AUTH_TOKEN = "01c5edb7343c13a19f28628e40847ba1"
      13.   public static final String FROM = "+16475591446"
      14.  
      15.   public void abortWorkItem(WorkItem wi, WorkItemManager wim) { 
      16.   System.out.println("Oh something went wrong"); 
      17.  
      18.   } 
      19.  
      20.  
      21.   public void executeWorkItem(WorkItem wi, WorkItemManager wim) { 
      22.  
      23.   String to = (String)wi.getParameter("TO"); 
      24.   String text = (String)wi.getParameter("TEXT"); 
      25.  
      26.  
      27.   assert to != null: "to can't be null"
      28.   assert text != null: "text cant be null"
      29.  
      30.  
      31.   SendSMS(to,text); 
      32.  
      33.  
      34.   System.out.println("Message has been succesfully sent"); 
      35.   System.out.println("To: "+to); 
      36.   System.out.println("From: "+FROM); 
      37.   System.out.println("Text: "+text); 
      38.  
      39.   wim.completeWorkItem(wi.getId(), null); 
      40.   } 
      41.  
      42.   public void SendSMS(String to, String text) 
      43.   { 
      44.   Twilio.init(ACCOUNT_SID, AUTH_TOKEN); 
      45.  
      46.   Message message = Message 
      47.              .creator(new PhoneNumber(to),  // to 
      48.                       new PhoneNumber(FROM),  // from 
      49.                       text) 
      50.              .create(); 
      51.   } 
      52.  
      53.  
      54.   public void SendSMS(String to, String text, String MediaURL) 
      55.   { 
      56.   Twilio.init(ACCOUNT_SID, AUTH_TOKEN); 
      57.   try
      58.   Message message = Message 
      59.              .creator(new PhoneNumber("to"),  // to 
      60.                       new PhoneNumber(FROM),  // from 
      61.                       text) 
      62.              .setMediaUrl(new URI(MediaURL)) 
      63.              .create(); 
      64.   } catch (URISyntaxException e) { 
      65.   // TODO Auto-generated catch block 
      66.   e.printStackTrace(); 
      67.   } 
      68.   } 
      69. }

      Here are it's POM file :

      <project xmlns="http://maven.apache.org/POM/4.0.0" xmlns:xsi="http://www.w3.org/2001/XMLSchema-instance"
        xsi:schemaLocation="http://maven.apache.org/POM/4.0.0 http://maven.apache.org/xsd/maven-4.0.0.xsd">
        <modelVersion>4.0.0</modelVersion>
      
      
        <groupId>org.jugvale.jbpm.workitemhandler</groupId>
        <artifactId>sms-sender</artifactId>
        <version>1.0.3</version>
        <packaging>jar</packaging>
      
      
        <name>sms-sender</name>
      
      
        <properties>
        <project.build.sourceEncoding>UTF-8</project.build.sourceEncoding>
        </properties>
      
      
        <dependencies>
        <dependency>
        <groupId>org.jbpm</groupId>
        <artifactId>jbpm-flow</artifactId>
        <version>6.0.1.Final</version>
        <scope>provided</scope>
        </dependency>
        <dependency>
        <groupId>com.twilio.sdk</groupId>
        <artifactId>twilio</artifactId>
        <version>(7.0,7.9)</version>
        </dependency>
        </dependencies>
      </project>
      

       

      If you want to use the jar file to replicate the error on your own environment please add your phone number to twilio, as currently this jar file can only send message to my phone number. To do this follow this instructions:

       

      1 Go to Twilio | Login and login using the following credentials: Email: RedhatSupport@Redhat.com, Password: RedHat@123 This is an account I created just for this.

       

      2 Click Phone numbers

      3 Click Verified Callers IDs,  and Click add new number (the page will look slightly different if there is already a number there)

      4. Then click text instead, add you phone number, click text me and you will receive a verification code enter it and click submit.

       

      Message was edited by: Fernando Pena Cantu

        • 1. Re: Continuation of WARN  XXX failed and will not be available for authoring.
          Donato Marrazzo Newbie

          Hello Fernando,

           

          can you share the whole project so I can try to import it?

          Some suggestions on how to use this forum a make it more "pleasurable":

          1. Post just the first two lines of a stack trace, with the meaningful information and attach the whole log file.
          2. Cut the screenshots in order to give just useful info
          • 2. Re: Continuation of WARN  XXX failed and will not be available for authoring.
            Fernando Pena Cantu Newbie

            Hey Donato,

            So I know I can get my project by using "git clone ssh://{username}@localhost:8001/{repository-name}

            However I am getting the following errors:

            -------------------------------------------------------------------------

            $ git clone ssh://bpmsAdmin@localhost:8001/LearningProjects

            Cloning into 'LearningProjects'...

            Unable to negotiate with 127.0.0.1 port 8001: no matching host key type found. Their offer: ssh-dss

            fatal: Could not read from remote repository.

             

             

            Please make sure you have the correct access rights

            ----------------------------------------------------------------------------------------

            and

            ----------------------------------------------------------------------------------------

            $ git clone git://bpmsAdmin@localhost:9418/LearningProjects

            Cloning into 'LearningProjects'...

            fatal: unable to access 'https://bpmsAdmin@localhost:9418/LearningProjects/': error setting certificate verify locations:

              CAfile: C:/Users/nevathann/AppData/Local/Programs/Git/mingw64/ssl/certs/ca-bundle.crt

              CApath: none

            ----------------------------------------------------------------------------------------

             

            Do you know any other way I can give you my project?

            • 3. Re: Continuation of WARN  XXX failed and will not be available for authoring.
              Donato Marrazzo Newbie

              I usually use the ssh protocol.

              The error you get (ssh-dss) is quite common, add the following lines to your ~/.ssh/config :

              Host *

                VerifyHostKeyDNS no

                StrictHostKeyChecking no

                HostKeyAlgorithms +ssh-dss

                PubkeyAcceptedKeyTypes +ssh-dss

                UserKnownHostsFile /dev/null

               

              Another option would be using the git client of JBoss Developer Studio.

              • 4. Re: Continuation of WARN  XXX failed and will not be available for authoring.
                Fernando Pena Cantu Newbie

                Thank you Donato, I have been having this problem for about 3 weeks.

                 

                I attached my project as a Zip file. let me know if you need anything else.

                • 5. Re: Continuation of WARN  XXX failed and will not be available for authoring.
                  Donato Marrazzo Newbie

                  Hi Fernarndo, please share even the WIH project.

                  • 6. Re: Continuation of WARN  XXX failed and will not be available for authoring.
                    Fernando Pena Cantu Newbie

                    If by WIH do you mean the eclipse Maven project which I used to create the Jar file, I just added.

                    Otherwise could you please explain me by what do you mean by WIH? I am assuming it means Work Item Handler.

                    • 7. Re: Continuation of WARN  XXX failed and will not be available for authoring.
                      Donato Marrazzo Newbie

                      Hello Fernando,

                      yes, WIH stands for work item handler.

                      I looked in the WIH project and as I thought there is a problem of dependencies clash.

                      I introduced the BOM (bill of material) as dependency manager and cleaned the pom:

                       

                        <dependencies>

                          <dependency>

                            <groupId>org.jbpm</groupId>

                            <artifactId>jbpm-workitems</artifactId>

                            <scope>provided</scope>

                          </dependency>

                          <dependency>

                            <groupId>com.twilio.sdk</groupId>

                            <artifactId>twilio</artifactId>

                            <version>(7.0,7.9)</version>

                            <scope>provided</scope>

                          </dependency>

                        </dependencies>

                        <dependencyManagement>

                          <dependencies>

                            <dependency>

                              <groupId>org.jboss.bom.brms</groupId>

                              <artifactId>jboss-brms-bpmsuite-platform-bom</artifactId>

                              <version>6.4.0.GA-redhat-2</version>

                              <type>pom</type>

                              <scope>import</scope>

                            </dependency>

                          </dependencies>

                        </dependencyManagement>

                        <build>

                          <plugins>

                            <plugin>

                              <groupId>org.apache.maven.plugins</groupId>

                              <artifactId>maven-compiler-plugin</artifactId>

                              <version>3.5.1</version>

                              <configuration>

                                <source>1.8</source>

                                <target>1.8</target>

                              </configuration>

                            </plugin>

                          </plugins>

                        </build>

                       

                      Unfortunately, twilio leverages some libraries more recent than the BPM ones and this create a problem at runtime.

                      You can see clearly with the eclipse hierarchy view:

                      img_006.png

                       

                      E.g. twilio look for httpcore 4.4.4 but the BPM has the 4.3.3.

                      Said that there are two possible solutions:

                      1. encapsulate the twilio library in an external service (even running in same app server), then call it as REST service or thru other protocols
                      2. use an older twilio SDK that hopefully would fit better in the BPM environment.