2 Replies Latest reply on Dec 19, 2017 6:29 AM by prvs

    WildFly Test Suite: Integration - Web .............. FAILURE

    prvs Newbie

      Hi.

       

       

      I'm trying to install WildFly git@github.com:wildfly/wildfly.git, with: mvn install

       

       

      However, I got

       

       

      ```

        FormAuthUnitTestCase.testFlushOnSessionInvalidation:305->doSecureGetWithLogin:331->doSecureGetWithLogin:377 Should see HTTP_MOVED_TEMP. Got 200

        FormAuthUnitTestCase.testFormAuth:118->doSecureGetWithLogin:331->doSecureGetWithLogin:377 Should see HTTP_MOVED_TEMP. Got 200

        FormAuthUnitTestCase.testFormAuthSubject:189->doSecureGetWithLogin:331->doSecureGetWithLogin:377 Should see HTTP_MOVED_TEMP. Got 200

        FormAuthUnitTestCase.testPostDataFormAuth:257 Should see HTTP_MOVED_TEMP. Got 200

        HandlesTypesEarTestCase.testAnnotatedClass:60 expected:<[class org.jboss.as.test.integration.web.handlestypes.AnnotatedChild, class org.jboss.as.test.integration.web.handlestypes.AnnotatedParent]> but was:<[]>

        HandlesTypesEarTestCase.testChildClass:54 expected:<[class org.jboss.as.test.integration.web.handlestypes.HandlesTypesGandchild, class org.jboss.as.test.integration.web.handlestypes.HandlesTypesImplementorChild]> but was:<[]>

        HandlesTypesEarTestCase.testParentClass:48 expected:<[class org.jboss.as.test.integration.web.handlestypes.HandlesTypesImplementor, class org.jboss.as.test.integration.web.handlestypes.HandlesTypesGandchild, class org.jboss.as.test.integration.web.handlestypes.HandlesTypesChild, class org.jboss.as.test.integration.web.handlestypes.HandlesTypesImplementorChild]> but was:<[]>

        HandlesTypesWarTestCase.testAnnotatedClass:48 expected:<[class org.jboss.as.test.integration.web.handlestypes.AnnotatedChild, class org.jboss.as.test.integration.web.handlestypes.AnnotatedParent]> but was:<[]>

        HandlesTypesWarTestCase.testChildClass:43 expected:<[class org.jboss.as.test.integration.web.handlestypes.HandlesTypesGandchild, class org.jboss.as.test.integration.web.handlestypes.HandlesTypesImplementorChild]> but was:<[]>

        HandlesTypesWarTestCase.testParentClass:37 expected:<[class org.jboss.as.test.integration.web.handlestypes.HandlesTypesGandchild, class org.jboss.as.test.integration.web.handlestypes.HandlesTypesImplementor, class org.jboss.as.test.integration.web.handlestypes.HandlesTypesChild, class org.jboss.as.test.integration.web.handlestypes.HandlesTypesImplementorChild]> but was:<[]>

      Tests in error:

        DefaultContextServiceServletTestCase.testServlet:67 » IO java.util.concurrent....

        WebModuleDeploymentTestCase.org.jboss.as.test.integration.web.annotationsmodule.WebModuleDeploymentTestCase » Deployment

        RequestDumpingHandlerTestCase.testReqDumpHandlerOnHttps:265 » Connect Connecti...

        ExternalTagLibTestCase.org.jboss.as.test.integration.web.jsp.taglib.external.ExternalTagLibTestCase » Deployment

       

       

      Tests run: 98, Failures: 10, Errors: 4, Skipped: 3

       

       

      [INFO] ------------------------------------------------------------------------

      [INFO] Reactor Summary:

      [INFO]

      [INFO] WildFly: Parent Aggregator ......................... SUCCESS [  0.828 s]

      [INFO] WildFly: Clustering Subsystems ..................... SUCCESS [  0.113 s]

      [INFO] WildFly: Clustering marshalling modules ............ SUCCESS [  0.039 s]

      [INFO] WildFly: Clustering marshalling API ................ SUCCESS [  1.223 s]

      [INFO] WildFly: Clustering marshalling SPI ................ SUCCESS [  1.084 s]

      [INFO] WildFly: Clustering integration with JBoss Marshalling SUCCESS [  0.638 s]

      [INFO] WildFly: Clustering public API ..................... SUCCESS [  0.476 s]

      [INFO] WildFly: Clustering services ....................... SUCCESS [  0.682 s]

      [INFO] WildFly: Naming Subsystem .......................... SUCCESS [  2.821 s]

      [INFO] WildFly: Common code for clustering subsystems ..... SUCCESS [  0.680 s]

      [INFO] WildFly: Singleton modules ......................... SUCCESS [  0.020 s]

      [INFO] WildFly: Singleton API ............................. SUCCESS [  0.647 s]

      [INFO] WildFly: Clustering SPI ............................ SUCCESS [  0.241 s]

      [INFO] WildFly: EE ........................................ SUCCESS [  3.411 s]

      [INFO] WildFly: IIOP Openjdk Subsystem .................... SUCCESS [  2.622 s]

      [INFO] WildFly: Transaction Subsystem ..................... SUCCESS [  3.761 s]

      [INFO] WildFly: Infinispan modules ........................ SUCCESS [  0.015 s]

      [INFO] WildFly: Infinispan SPI ............................ SUCCESS [  0.685 s]

      [INFO] WildFly: Security Subsystem parent ................. SUCCESS [  0.009 s]

      [INFO] WildFly: Security Subsystem ........................ SUCCESS [  5.591 s]

      [INFO] WildFly: Connector Subsystem ....................... SUCCESS [ 10.550 s]

      [INFO] WildFly: EE clustering ............................. SUCCESS [  0.014 s]

      [INFO] WildFly: EE clustering SPI ......................... SUCCESS [  0.340 s]

      [INFO] WildFly: SFSB clustering ........................... SUCCESS [  0.013 s]

      [INFO] WildFly: SFSB clustering - SPI ..................... SUCCESS [  0.329 s]

      [INFO] WildFly: EJB Subsystem ............................. SUCCESS [ 11.006 s]

      [INFO] WildFly: Web Common Classes ........................ SUCCESS [  0.543 s]

      [INFO] WildFly: Undertow .................................. SUCCESS [  6.649 s]

      [INFO] WildFly: Web Services Subsystem .................... SUCCESS [  0.010 s]

      [INFO] WildFly: Web Services Server Integration Subsystem . SUCCESS [  4.244 s]

      [INFO] WildFly: Application Client Bootstrap .............. SUCCESS [  0.233 s]

      [INFO] WildFly: Weld ...................................... SUCCESS [  0.009 s]

      [INFO] WildFly: Weld Subsystem SPI ........................ SUCCESS [  0.126 s]

      [INFO] WildFly: Batch Integration ......................... SUCCESS [  0.037 s]

      [INFO] WildFly: Batch Integration Subsystem (JBeret implementation) SUCCESS [  2.382 s]

      [INFO] WildFly: Batch Integration Subsystem ............... SUCCESS [  1.437 s]

      [INFO] WildFly: Bean Validation ........................... SUCCESS [  1.133 s]

      [INFO] WildFly: Servlet Feature Pack ...................... SUCCESS [  2.820 s]

      [INFO] WildFly: JPA ....................................... SUCCESS [  0.009 s]

      [INFO] jipijapa SPI ....................................... SUCCESS [  0.118 s]

      [INFO] WildFly: Weld Common Tools ......................... SUCCESS [  0.145 s]

      [INFO] WildFly: JPA Subsystem ............................. SUCCESS [  1.450 s]

      [INFO] WildFly: Weld Subsystem ............................ SUCCESS [  2.875 s]

      [INFO] WildFly: PicketLink Subsystem ...................... SUCCESS [  3.951 s]

      [INFO] WildFly: Security Subsystem API .................... SUCCESS [  0.126 s]

      [INFO] WildFly: System JMX Module ......................... SUCCESS [  0.078 s]

      [INFO] WildFly: JAX-RS Integration ........................ SUCCESS [  1.288 s]

      [INFO] WildFly: RTS Subsystem ............................. SUCCESS [  1.341 s]

      [INFO] jipijapa Hibernate 5.x (JPA 2.1) integration ....... SUCCESS [  0.184 s]

      [INFO] jipijapa Hibernate 4.3.x (JPA 2.1) integration ..... SUCCESS [  0.976 s]

      [INFO] jipijapa Hibernate 4.1.x + 4.2.x (JPA 2.0) integration SUCCESS [  0.145 s]

      [INFO] jipijapa EclipseLink integration ................... SUCCESS [  0.090 s]

      [INFO] jipijapa OpenJPA integration ....................... SUCCESS [  0.158 s]

      [INFO] WildFly: EJB Client BOM ............................ SUCCESS [  0.050 s]

      [INFO] WildFly: JMS Client BOM ............................ SUCCESS [  0.128 s]

      [INFO] WildFly: EJB and JMS client combined jar ........... SUCCESS [  2.727 s]

      [INFO] WildFly: EE clustering - Infinispan service provider SUCCESS [  0.788 s]

      [INFO] WildFly: SFSB clustering - Infinispan integration .. SUCCESS [  4.188 s]

      [INFO] WildFly: JGroups modules ........................... SUCCESS [  0.011 s]

      [INFO] WildFly: JGroups API ............................... SUCCESS [  0.083 s]

      [INFO] WildFly: JGroups SPI ............................... SUCCESS [  0.158 s]

      [INFO] WildFly: JGroups Subsystem ......................... SUCCESS [  7.240 s]

      [INFO] WildFly: Clustering marshalling Infinispan adapters  SUCCESS [  0.109 s]

      [INFO] WildFly: Infinispan subsystem ...................... SUCCESS [ 17.763 s]

      [INFO] WildFly: Clustering API implementation ............. SUCCESS [  0.472 s]

      [INFO] WildFly: Singleton extension ....................... SUCCESS [  1.918 s]

      [INFO] WildFly: Web session clustering .................... SUCCESS [  0.012 s]

      [INFO] WildFly: Web session clustering API ................ SUCCESS [  0.143 s]

      [INFO] WildFly: Web session clustering SPI ................ SUCCESS [  0.963 s]

      [INFO] WildFly: Web session clustering - Infinispan service provider SUCCESS [  2.322 s]

      [INFO] WildFly: Web session clustering - Undertow integration SUCCESS [  1.142 s]

      [INFO] WildFly: EJB Container Managed Persistence Subsystem SUCCESS [  1.037 s]

      [INFO] Wildfly: Config Admin .............................. SUCCESS [  0.934 s]

      [INFO] WildFly: JAXR Client ............................... SUCCESS [  0.936 s]

      [INFO] WildFly: JBoss Diagnostic Reporter ................. SUCCESS [  0.008 s]

      [INFO] WildFly: JDR ....................................... SUCCESS [  1.024 s]

      [INFO] WildFly: JSF ....................................... SUCCESS [  0.009 s]

      [INFO] WildFly: JSF Subsystem ............................. SUCCESS [  1.643 s]

      [INFO] WildFly: JSF Injection Handlers .................... SUCCESS [  0.199 s]

      [INFO] WildFly: JSR-77 Subsystem .......................... SUCCESS [  1.212 s]

      [INFO] WildFly: JacORB Subsystem .......................... SUCCESS [  4.157 s]

      [INFO] WildFly: Mail subsystem ............................ SUCCESS [  3.192 s]

      [INFO] WildFly: Messaging Subsystem With ActiveMQ Artemis . SUCCESS [  5.741 s]

      [INFO] WildFly: (Legacy) Messaging Subsystem .............. SUCCESS [  9.499 s]

      [INFO] WildFly: mod_cluster Subsystem ..................... SUCCESS [  0.008 s]

      [INFO] WildFly: mod_cluster Extension ..................... SUCCESS [  3.140 s]

      [INFO] WildFly: mod_cluster Undertow Integration .......... SUCCESS [  1.043 s]

      [INFO] WildFly: POJO Subsystem ............................ SUCCESS [  0.848 s]

      [INFO] WildFly: Service Archive Subsystem ................. SUCCESS [  0.934 s]

      [INFO] WildFly: Web Subsystem ............................. SUCCESS [  3.330 s]

      [INFO] WildFly: Weld EJB .................................. SUCCESS [  0.168 s]

      [INFO] WildFly: Weld JPA .................................. SUCCESS [  0.118 s]

      [INFO] WildFly: Weld Bean Validation ...................... SUCCESS [  0.109 s]

      [INFO] WildFly: Weld Webservices .......................... SUCCESS [  0.894 s]

      [INFO] WildFly: Weld Transactions ......................... SUCCESS [  0.101 s]

      [INFO] WildFly: XTS Subsystem ............................. SUCCESS [  2.034 s]

      [INFO] WildFly: Full Feature Pack ......................... SUCCESS [ 14.659 s]

      [INFO] WildFly: Build ..................................... SUCCESS [ 11.530 s]

      [INFO] WildFly: EJB Legacy Client BOM ..................... SUCCESS [  0.016 s]

      [INFO] WildFly: Distribution .............................. SUCCESS [ 12.332 s]

      [INFO] WildFly: JSF Multi-JSF installer ................... SUCCESS [  1.084 s]

      [INFO] WildFly: Exported Java EE Specification APIs ....... SUCCESS [  0.022 s]

      [INFO] WildFly: Validation Tests for Exported Java EE Specification APIs SUCCESS [  0.024 s]

      [INFO] WildFly: Servlet Build ............................. SUCCESS [  0.314 s]

      [INFO] WildFly: Servlet Distribution ...................... SUCCESS [  0.803 s]

      [INFO] WildFly: Web Services Tests Integration Subsystem .. SUCCESS [  0.911 s]

      [INFO] WildFly Test Suite: Shared ......................... SUCCESS [  1.990 s]

      [INFO] WildFly Test Suite: Aggregator ..................... SUCCESS [  0.009 s]

      [INFO] WildFly Test Suite: Integration (parent) ........... SUCCESS [  0.095 s]

      [INFO] WildFly Test Suite: Integration - Web .............. FAILURE [ 36.717 s]

      [INFO] WildFly Test Suite: Integration - Smoke ............ SKIPPED

      [INFO] ------------------------------------------------------------------------

      [INFO] BUILD FAILURE

      [INFO] ------------------------------------------------------------------------

      [INFO] Total time: 04:07 min

      [INFO] Finished at: 2017-12-15T09:18:43+00:00

      [INFO] Final Memory: 352M/947M

      [INFO] ------------------------------------------------------------------------

      [ERROR] Failed to execute goal org.apache.maven.plugins:maven-surefire-plugin:2.18.1:test (default-test) on project wildfly-ts-integ-web: There are test failures.

      [ERROR]

      [ERROR] Please refer to /home/patriciarvsousa/wildfly/testsuite/integration/web/target/surefire-reports for the individual test results.

      [ERROR] -> [Help 1]

      [ERROR]

      [ERROR] To see the full stack trace of the errors, re-run Maven with the -e switch.

      [ERROR] Re-run Maven using the -X switch to enable full debug logging.

      [ERROR]

      [ERROR] For more information about the errors and possible solutions, please read the following articles:

      [ERROR] [Help 1] http://cwiki.apache.org/confluence/display/MAVEN/MojoFailureException

      [ERROR]

      [ERROR] After correcting the problems, you can resume the build with the command

      [ERROR]   mvn <goals> -rf :wildfly-ts-integ-web

       

       

      ```

       

       

      Any help regarding these issues?