1 Reply Latest reply on Oct 28, 2009 3:12 AM by jaikiran pai

    Install Failed - Help Please

    Aravindh Sampath Newbie

      Hello,

      I am trying to install JBoss AS from Source on Suse Enterprise Linux Ver 11 on Z series.

      I am a newbie to JBoss.

      Pl help me with some solutios to this problem I got,

      linux-13t7:~/Desktop/jboss-5.1.0.GA-src # cd build/
      linux-13t7:~/Desktop/jboss-5.1.0.GA-src/build # ls
      .classpath build-distr.xml build.log docs pom.xml
      .project build-release.xml build.sh eclipse.psf
      VersionRelease.java build.bat build.xml etc
      linux-13t7:~/Desktop/jboss-5.1.0.GA-src/build # ant
      Buildfile: build.xml

      maven-init:
      [echo] Maven Home set to /root/Desktop/jboss-5.1.0.GA-src/tools/maven

      maven-install:
      [java] [INFO] Scanning for projects...
      [java] Downloading: http://repository.jboss.org/maven2/org/jboss/jboss-parent/4/jboss-parent-4.pom
      [java] Downloading: http://repo1.maven.org/maven2/org/jboss/jboss-parent/4/jboss-parent-4.pom
      [java] [INFO] ------------------------------------------------------------------------
      [java] [ERROR] FATAL ERROR
      [java] [INFO] ------------------------------------------------------------------------
      [java] [INFO] Failed to resolve artifact.
      [java]
      [java] GroupId: org.jboss
      [java] ArtifactId: jboss-parent
      [java] Version: 4
      [java]
      [java] Reason: Unable to download the artifact from any repository
      [java]
      [java] org.jboss:jboss-parent:pom:4
      [java]
      [java] from the specified remote repositories:
      [java] repository.jboss.org (http://repository.jboss.org/maven2),
      [java] central (http://repo1.maven.org/maven2),
      [java] snapshots.jboss.org (http://snapshots.jboss.org/maven2)
      [java]
      [java]
      [java] [INFO] ------------------------------------------------------------------------
      [java] [INFO] Trace
      [java] org.apache.maven.reactor.MavenExecutionException: Cannot find parent: org.jboss:jboss-parent for project: org.jboss.jbossas:jboss-as-component-matrix:pom:5.1.0.GA for project org.jboss.jbossas:jboss-as-component-matrix:pom:5.1.0.GA
      [java] at org.apache.maven.DefaultMaven.getProjects(DefaultMaven.java:378)
      [java] at org.apache.maven.DefaultMaven.doExecute(DefaultMaven.java:292)
      [java] at org.apache.maven.DefaultMaven.execute(DefaultMaven.java:129)
      [java] at org.apache.maven.cli.MavenCli.main(MavenCli.java:287)
      [java] at sun.reflect.NativeMethodAccessorImpl.invoke0(Native Method)
      [java] at sun.reflect.NativeMethodAccessorImpl.invoke(NativeMethodAccessorImpl.java:79)
      [java] at sun.reflect.DelegatingMethodAccessorImpl.invoke(DelegatingMethodAccessorImpl.java:43)
      [java] at java.lang.reflect.Method.invoke(Method.java:618)
      [java] at org.codehaus.classworlds.Launcher.launchEnhanced(Launcher.java:315)
      [java] at org.codehaus.classworlds.Launcher.launch(Launcher.java:255)
      [java] at org.codehaus.classworlds.Launcher.mainWithExitCode(Launcher.java:430)
      [java] at org.codehaus.classworlds.Launcher.main(Launcher.java:375)
      [java] Caused by: org.apache.maven.project.ProjectBuildingException: Cannot find parent: org.jboss:jboss-parent for project: org.jboss.jbossas:jboss-as-component-matrix:pom:5.1.0.GA for project org.jboss.jbossas:jboss-as-component-matrix:pom:5.1.0.GA
      [java] at org.apache.maven.project.DefaultMavenProjectBuilder.assembleLineage(DefaultMavenProjectBuilder.java:1370)
      [java] at org.apache.maven.project.DefaultMavenProjectBuilder.assembleLineage(DefaultMavenProjectBuilder.java:1387)
      [java] at org.apache.maven.project.DefaultMavenProjectBuilder.buildInternal(DefaultMavenProjectBuilder.java:821)
      [java] at org.apache.maven.project.DefaultMavenProjectBuilder.buildFromSourceFileInternal(DefaultMavenProjectBuilder.java:506)
      [java] at org.apache.maven.project.DefaultMavenProjectBuilder.build(DefaultMavenProjectBuilder.java:198)
      [java] at org.apache.maven.DefaultMaven.getProject(DefaultMaven.java:583)
      [java] at org.apache.maven.DefaultMaven.collectProjects(DefaultMaven.java:461)
      [java] at org.apache.maven.DefaultMaven.getProjects(DefaultMaven.java:365)
      [java] ... 11 more
      [java] Caused by: org.apache.maven.project.ProjectBuildingException: POM 'org.jboss:jboss-parent' not found in repository: Unable to download the artifact from any repository
      [java]
      [java] org.jboss:jboss-parent:pom:4
      [java]
      [java] from the specified remote repositories:
      [java] repository.jboss.org (http://repository.jboss.org/maven2),
      [java] central (http://repo1.maven.org/maven2),
      [java] snapshots.jboss.org (http://snapshots.jboss.org/maven2)
      [java] for project org.jboss:jboss-parent
      [java] at org.apache.maven.project.DefaultMavenProjectBuilder.findModelFromRepository(DefaultMavenProjectBuilder.java:603)
      [java] at org.apache.maven.project.DefaultMavenProjectBuilder.assembleLineage(DefaultMavenProjectBuilder.java:1366)
      [java] ... 18 more
      [java] Caused by: org.apache.maven.artifact.resolver.ArtifactNotFoundException: Unable to download the artifact from any repository
      [java]
      [java] org.jboss:jboss-parent:pom:4
      [java]
      [java] from the specified remote repositories:
      [java] repository.jboss.org (http://repository.jboss.org/maven2),
      [java] central (http://repo1.maven.org/maven2),
      [java] snapshots.jboss.org (http://snapshots.jboss.org/maven2)
      [java]
      [java] at org.apache.maven.artifact.resolver.DefaultArtifactResolver.resolve(DefaultArtifactResolver.java:212)
      [java] at org.apache.maven.artifact.resolver.DefaultArtifactResolver.resolve(DefaultArtifactResolver.java:74)
      [java] at org.apache.maven.project.DefaultMavenProjectBuilder.findModelFromRepository(DefaultMavenProjectBuilder.java:556)
      [java] ... 19 more
      [java] Caused by: org.apache.maven.wagon.ResourceDoesNotExistException: Unable to download the artifact from any repository
      [java] at org.apache.maven.artifact.manager.DefaultWagonManager.getArtifact(DefaultWagonManager.java:331)
      [java] at org.apache.maven.artifact.resolver.DefaultArtifactResolver.resolve(DefaultArtifactResolver.java:200)
      [java] ... 21 more
      [java] [INFO] ------------------------------------------------------------------------
      [java] [INFO] Total time: < 1 second
      [java] [INFO] Finished at: Wed Oct 28 12:15:02 GMT+05:30 2009
      [java] [INFO] Final Memory: 4M/7M
      [java] [INFO] ------------------------------------------------------------------------
      [java] Java Result: 1

      BUILD FAILED
      /root/Desktop/jboss-5.1.0.GA-src/build/build.xml:1084: Unable to build maven modules. See maven output for details.

      Total time: 3 seconds
      linux-13t7:~/Desktop/jboss-5.1.0.GA-src/build #


      thanks in advance
      Aravindh