1 Reply Latest reply on Jun 4, 2009 7:00 AM by Benjamin Fayle

    Seam Web Project test does not work in Java 6

    Benjamin Fayle Newbie

      When I create a simple project using the New->Seam Web Project wizard in Eclipse the code that is generated provides a test suite. If I create a simple test suite it will run under Java 1.5 but not 1.6.

      It appears to be a problem with the embedded JBoss. Does anyone know a workaround?

      Under Java 6 I get the following error:

      [Parser] Running:
       /Applications/eclipse/workspace/test-test/temp-testng-customsuite.xml
      
      ERROR [org.jboss.kernel.plugins.dependency.AbstractKernelController] Error installing to Described: name=BeanDeployer state=PreInstall
      java.lang.RuntimeException: java.lang.reflect.UndeclaredThrowableException
       at org.jboss.aop.util.ClassInfoMethodHashing.methodHash(ClassInfoMethodHashing.java:70)
       at org.jboss.aop.util.ClassInfoMethodHashing.addDeclaredMethods(ClassInfoMethodHashing.java:169)
       at org.jboss.aop.util.ClassInfoMethodHashing.populateMethodTables(ClassInfoMethodHashing.java:182)
       at org.jboss.aop.util.ClassInfoMethodHashing.populateMethodTables(ClassInfoMethodHashing.java:181)
       at org.jboss.aop.util.ClassInfoMethodHashing.populateMethodTables(ClassInfoMethodHashing.java:181)
       at org.jboss.aop.util.ClassInfoMethodHashing.populateMethodTables(ClassInfoMethodHashing.java:181)
       at org.jboss.aop.util.ClassInfoMethodHashing.populateMethodTables(ClassInfoMethodHashing.java:181)
       at org.jboss.aop.util.ClassInfoMethodHashing.populateMethodTables(ClassInfoMethodHashing.java:181)
       at org.jboss.aop.util.ClassInfoMethodHashing.getMethodMap(ClassInfoMethodHashing.java:188)
       at org.jboss.aop.microcontainer.integration.AOPDependencyBuilder.getMethodAnnotationDependencies(AOPDependencyBuilder.java:197)
       at org.jboss.aop.microcontainer.integration.AOPDependencyBuilder.getAnnotationDependencies(AOPDependencyBuilder.java:152)
       at org.jboss.aop.microcontainer.integration.AOPDependencyBuilder.getDependencies(AOPDependencyBuilder.java:130)
       at org.jboss.classadapter.plugins.BasicClassAdapter.getDependencies(BasicClassAdapter.java:80)
       at org.jboss.beans.info.plugins.AbstractBeanInfo.getDependencies(AbstractBeanInfo.java:211)
       at org.jboss.kernel.plugins.dependency.DescribeAction.installActionInternal(DescribeAction.java:53)
       at org.jboss.kernel.plugins.dependency.KernelControllerContextAction.installAction(KernelControllerContextAction.java:135)
       at org.jboss.kernel.plugins.dependency.KernelControllerContextAction.installAction(KernelControllerContextAction.java:46)
       at org.jboss.dependency.plugins.action.SimpleControllerContextAction.simpleInstallAction(SimpleControllerContextAction.java:62)
       at org.jboss.dependency.plugins.action.AccessControllerContextAction.install(AccessControllerContextAction.java:71)
       at org.jboss.dependency.plugins.AbstractControllerContextActions.install(AbstractControllerContextActions.java:51)
       at org.jboss.dependency.plugins.AbstractControllerContext.install(AbstractControllerContext.java:327)
       at org.jboss.dependency.plugins.AbstractController.install(AbstractController.java:1309)
       at org.jboss.dependency.plugins.AbstractController.incrementState(AbstractController.java:734)
       at org.jboss.dependency.plugins.AbstractController.resolveContexts(AbstractController.java:862)
       at org.jboss.dependency.plugins.AbstractController.resolveContexts(AbstractController.java:784)
       at org.jboss.dependency.plugins.AbstractController.install(AbstractController.java:574)
       at org.jboss.dependency.plugins.AbstractController.install(AbstractController.java:398)
       at org.jboss.kernel.plugins.deployment.AbstractKernelDeployer.deployBean(AbstractKernelDeployer.java:309)
       at org.jboss.kernel.plugins.deployment.AbstractKernelDeployer.deployBeans(AbstractKernelDeployer.java:279)
       at org.jboss.kernel.plugins.deployment.AbstractKernelDeployer.deploy(AbstractKernelDeployer.java:130)
       at org.jboss.kernel.plugins.deployment.xml.BeanXMLDeployer.deploy(BeanXMLDeployer.java:96)
       at org.jboss.embedded.Bootstrap.deployBaseBootstrapUrl(Bootstrap.java:130)
       at org.jboss.embedded.Bootstrap.bootstrapURL(Bootstrap.java:142)
       at org.jboss.embedded.Bootstrap.bootstrap(Bootstrap.java:183)
       at org.jboss.embedded.Bootstrap.bootstrap(Bootstrap.java:195)
       at org.jboss.seam.mock.EmbeddedBootstrap.startAndDeployResources(EmbeddedBootstrap.java:11)
       at org.jboss.seam.mock.AbstractSeamTest.startJbossEmbeddedIfNecessary(AbstractSeamTest.java:1024)
       at org.jboss.seam.mock.AbstractSeamTest.startSeam(AbstractSeamTest.java:915)
       at org.jboss.seam.mock.SeamTest.startSeam(SeamTest.java:58)
       at sun.reflect.NativeMethodAccessorImpl.invoke0(Native Method)
       at sun.reflect.NativeMethodAccessorImpl.invoke(NativeMethodAccessorImpl.java:39)
       at sun.reflect.DelegatingMethodAccessorImpl.invoke(DelegatingMethodAccessorImpl.java:25)
       at java.lang.reflect.Method.invoke(Method.java:597)
       at org.testng.internal.MethodHelper.invokeMethod(MethodHelper.java:580)
       at org.testng.internal.Invoker.invokeConfigurationMethod(Invoker.java:398)
       at org.testng.internal.Invoker.invokeConfigurations(Invoker.java:145)
       at org.testng.internal.Invoker.invokeConfigurations(Invoker.java:82)
       at org.testng.SuiteRunner.privateRun(SuiteRunner.java:278)
       at org.testng.SuiteRunner.run(SuiteRunner.java:198)
       at org.testng.TestNG.createAndRunSuiteRunners(TestNG.java:823)
       at org.testng.TestNG.runSuitesLocally(TestNG.java:790)
       at org.testng.TestNG.run(TestNG.java:708)
       at org.testng.remote.RemoteTestNG.run(RemoteTestNG.java:73)
       at org.testng.remote.RemoteTestNG.main(RemoteTestNG.java:124)
      Caused by: java.lang.reflect.UndeclaredThrowableException
       at org.jboss.reflect.plugins.ArrayInfoImpl.getType(ArrayInfoImpl.java:103)
       at org.jboss.reflect.plugins.ClassInfoImpl.isArray(ClassInfoImpl.java:495)
       at org.jboss.aop.util.ClassInfoMethodHashing.getTypeString(ClassInfoMethodHashing.java:149)
       at org.jboss.aop.util.ClassInfoMethodHashing.methodHash(ClassInfoMethodHashing.java:53)
       ... 53 more
      Caused by: java.lang.ClassNotFoundException: [Ljava.lang.Class;
       at java.net.URLClassLoader$1.run(URLClassLoader.java:200)
       at java.security.AccessController.doPrivileged(Native Method)
       at java.net.URLClassLoader.findClass(URLClassLoader.java:188)
       at java.lang.ClassLoader.loadClass(ClassLoader.java:316)
       at sun.misc.Launcher$AppClassLoader.loadClass(Launcher.java:288)
       at java.lang.ClassLoader.loadClass(ClassLoader.java:251)
       at org.jboss.reflect.plugins.introspection.IntrospectionTypeInfoFactoryImpl.resolveComplexTypeInfo(IntrospectionTypeInfoFactoryImpl.java:367)
       at org.jboss.reflect.plugins.introspection.IntrospectionTypeInfoFactoryImpl.getTypeInfo(IntrospectionTypeInfoFactoryImpl.java:344)
       at org.jboss.reflect.plugins.introspection.IntrospectionTypeInfoFactory.getTypeInfo(IntrospectionTypeInfoFactory.java:54)
       at org.jboss.reflect.plugins.ArrayInfoImpl.getType(ArrayInfoImpl.java:99)
       ... 56 more
      ERROR [org.jboss.kernel.plugins.dependency.AbstractKernelController] Error installing to Described: name=KernelDeploymentDeployer state=PreInstall
      java.lang.RuntimeException: java.lang.reflect.UndeclaredThrowableException
       at org.jboss.aop.util.ClassInfoMethodHashing.methodHash(ClassInfoMethodHashing.java:70)
       at org.jboss.aop.util.ClassInfoMethodHashing.addDeclaredMethods(ClassInfoMethodHashing.java:169)
       at org.jboss.aop.util.ClassInfoMethodHashing.populateMethodTables(ClassInfoMethodHashing.java:182)
       at org.jboss.aop.util.ClassInfoMethodHashing.populateMethodTables(ClassInfoMethodHashing.java:181)
       at org.jboss.aop.util.ClassInfoMethodHashing.populateMethodTables(ClassInfoMethodHashing.java:181)
       at org.jboss.aop.util.ClassInfoMethodHashing.populateMethodTables(ClassInfoMethodHashing.java:181)
       at org.jboss.aop.util.ClassInfoMethodHashing.populateMethodTables(ClassInfoMethodHashing.java:181)
       at org.jboss.aop.util.ClassInfoMethodHashing.getMethodMap(ClassInfoMethodHashing.java:188)
       at org.jboss.aop.microcontainer.integration.AOPDependencyBuilder.getMethodAnnotationDependencies(AOPDependencyBuilder.java:197)
       at org.jboss.aop.microcontainer.integration.AOPDependencyBuilder.getAnnotationDependencies(AOPDependencyBuilder.java:152)
       at org.jboss.aop.microcontainer.integration.AOPDependencyBuilder.getDependencies(AOPDependencyBuilder.java:130)
       at org.jboss.classadapter.plugins.BasicClassAdapter.getDependencies(BasicClassAdapter.java:80)
       at org.jboss.beans.info.plugins.AbstractBeanInfo.getDependencies(AbstractBeanInfo.java:211)
       at org.jboss.kernel.plugins.dependency.DescribeAction.installActionInternal(DescribeAction.java:53)
       at org.jboss.kernel.plugins.dependency.KernelControllerContextAction.installAction(KernelControllerContextAction.java:135)
       at org.jboss.kernel.plugins.dependency.KernelControllerContextAction.installAction(KernelControllerContextAction.java:46)
       at org.jboss.dependency.plugins.action.SimpleControllerContextAction.simpleInstallAction(SimpleControllerContextAction.java:62)
       at org.jboss.dependency.plugins.action.AccessControllerContextAction.install(AccessControllerContextAction.java:71)
       at org.jboss.dependency.plugins.AbstractControllerContextActions.install(AbstractControllerContextActions.java:51)
       at org.jboss.dependency.plugins.AbstractControllerContext.install(AbstractControllerContext.java:327)
       at org.jboss.dependency.plugins.AbstractController.install(AbstractController.java:1309)
       at org.jboss.dependency.plugins.AbstractController.incrementState(AbstractController.java:734)
       at org.jboss.dependency.plugins.AbstractController.resolveContexts(AbstractController.java:862)
       at org.jboss.dependency.plugins.AbstractController.resolveContexts(AbstractController.java:784)
       at org.jboss.dependency.plugins.AbstractController.install(AbstractController.java:574)
       at org.jboss.dependency.plugins.AbstractController.install(AbstractController.java:398)
       at org.jboss.kernel.plugins.deployment.AbstractKernelDeployer.deployBean(AbstractKernelDeployer.java:309)
       at org.jboss.kernel.plugins.deployment.AbstractKernelDeployer.deployBeans(AbstractKernelDeployer.java:279)
       at org.jboss.kernel.plugins.deployment.AbstractKernelDeployer.deploy(AbstractKernelDeployer.java:130)
       at org.jboss.kernel.plugins.deployment.xml.BeanXMLDeployer.deploy(BeanXMLDeployer.java:96)
       at org.jboss.embedded.Bootstrap.deployBaseBootstrapUrl(Bootstrap.java:130)
       at org.jboss.embedded.Bootstrap.bootstrapURL(Bootstrap.java:142)
       at org.jboss.embedded.Bootstrap.bootstrap(Bootstrap.java:183)
       at org.jboss.embedded.Bootstrap.bootstrap(Bootstrap.java:195)
       at org.jboss.seam.mock.EmbeddedBootstrap.startAndDeployResources(EmbeddedBootstrap.java:11)
       at org.jboss.seam.mock.AbstractSeamTest.startJbossEmbeddedIfNecessary(AbstractSeamTest.java:1024)
       at org.jboss.seam.mock.AbstractSeamTest.startSeam(AbstractSeamTest.java:915)
       at org.jboss.seam.mock.SeamTest.startSeam(SeamTest.java:58)
       at sun.reflect.NativeMethodAccessorImpl.invoke0(Native Method)
       at sun.reflect.NativeMethodAccessorImpl.invoke(NativeMethodAccessorImpl.java:39)
       at sun.reflect.DelegatingMethodAccessorImpl.invoke(DelegatingMethodAccessorImpl.java:25)
       at java.lang.reflect.Method.invoke(Method.java:597)
       at org.testng.internal.MethodHelper.invokeMethod(MethodHelper.java:580)
       at org.testng.internal.Invoker.invokeConfigurationMethod(Invoker.java:398)
       at org.testng.internal.Invoker.invokeConfigurations(Invoker.java:145)
       at org.testng.internal.Invoker.invokeConfigurations(Invoker.java:82)
       at org.testng.SuiteRunner.privateRun(SuiteRunner.java:278)
       at org.testng.SuiteRunner.run(SuiteRunner.java:198)
       at org.testng.TestNG.createAndRunSuiteRunners(TestNG.java:823)
       at org.testng.TestNG.runSuitesLocally(TestNG.java:790)
       at org.testng.TestNG.run(TestNG.java:708)
       at org.testng.remote.RemoteTestNG.run(RemoteTestNG.java:73)
       at org.testng.remote.RemoteTestNG.main(RemoteTestNG.java:124)
      Caused by: java.lang.reflect.UndeclaredThrowableException
       at org.jboss.reflect.plugins.ArrayInfoImpl.getType(ArrayInfoImpl.java:103)
       at org.jboss.reflect.plugins.ClassInfoImpl.isArray(ClassInfoImpl.java:495)
       at org.jboss.aop.util.ClassInfoMethodHashing.getTypeString(ClassInfoMethodHashing.java:149)
       at org.jboss.aop.util.ClassInfoMethodHashing.methodHash(ClassInfoMethodHashing.java:53)
       ... 52 more
      Caused by: java.lang.ClassNotFoundException: [Ljava.lang.Class;
       at java.net.URLClassLoader$1.run(URLClassLoader.java:200)
       at java.security.AccessController.doPrivileged(Native Method)
       at java.net.URLClassLoader.findClass(URLClassLoader.java:188)
       at java.lang.ClassLoader.loadClass(ClassLoader.java:316)
       at sun.misc.Launcher$AppClassLoader.loadClass(Launcher.java:288)
       at java.lang.ClassLoader.loadClass(ClassLoader.java:251)
       at org.jboss.reflect.plugins.introspection.IntrospectionTypeInfoFactoryImpl.resolveComplexTypeInfo(IntrospectionTypeInfoFactoryImpl.java:367)
       at org.jboss.reflect.plugins.introspection.IntrospectionTypeInfoFactoryImpl.getTypeInfo(IntrospectionTypeInfoFactoryImpl.java:344)
       at org.jboss.reflect.plugins.introspection.IntrospectionTypeInfoFactory.getTypeInfo(IntrospectionTypeInfoFactory.java:54)
       at org.jboss.reflect.plugins.ArrayInfoImpl.getType(ArrayInfoImpl.java:99)
       ... 55 more
      ERROR [org.jboss.kernel.plugins.dependency.AbstractKernelController] Error installing to Described: name=BeanMetaDataDeployer state=PreInstall
      java.lang.RuntimeException: java.lang.reflect.UndeclaredThrowableException
       at org.jboss.aop.util.ClassInfoMethodHashing.methodHash(ClassInfoMethodHashing.java:70)
       at org.jboss.aop.util.ClassInfoMethodHashing.addDeclaredMethods(ClassInfoMethodHashing.java:169)
       at org.jboss.aop.util.ClassInfoMethodHashing.populateMethodTables(ClassInfoMethodHashing.java:182)
       at org.jboss.aop.util.ClassInfoMethodHashing.populateMethodTables(ClassInfoMethodHashing.java:181)
       at org.jboss.aop.util.ClassInfoMethodHashing.populateMethodTables(ClassInfoMethodHashing.java:181)
       at org.jboss.aop.util.ClassInfoMethodHashing.populateMethodTables(ClassInfoMethodHashing.java:181)
       at org.jboss.aop.util.ClassInfoMethodHashing.getMethodMap(ClassInfoMethodHashing.java:188)
       at org.jboss.aop.microcontainer.integration.AOPDependencyBuilder.getMethodAnnotationDependencies(AOPDependencyBuilder.java:197)
       at org.jboss.aop.microcontainer.integration.AOPDependencyBuilder.getAnnotationDependencies(AOPDependencyBuilder.java:152)
       at org.jboss.aop.microcontainer.integration.AOPDependencyBuilder.getDependencies(AOPDependencyBuilder.java:130)
       at org.jboss.classadapter.plugins.BasicClassAdapter.getDependencies(BasicClassAdapter.java:80)
       at org.jboss.beans.info.plugins.AbstractBeanInfo.getDependencies(AbstractBeanInfo.java:211)
       at org.jboss.kernel.plugins.dependency.DescribeAction.installActionInternal(DescribeAction.java:53)
       at org.jboss.kernel.plugins.dependency.KernelControllerContextAction.installAction(KernelControllerContextAction.java:135)
       at org.jboss.kernel.plugins.dependency.KernelControllerContextAction.installAction(KernelControllerContextAction.java:46)
       at org.jboss.dependency.plugins.action.SimpleControllerContextAction.simpleInstallAction(SimpleControllerContextAction.java:62)
       at org.jboss.dependency.plugins.action.AccessControllerContextAction.install(AccessControllerContextAction.java:71)
       at org.jboss.dependency.plugins.AbstractControllerContextActions.install(AbstractControllerContextActions.java:51)
       at org.jboss.dependency.plugins.AbstractControllerContext.install(AbstractControllerContext.java:327)
       at org.jboss.dependency.plugins.AbstractController.install(AbstractController.java:1309)
       at org.jboss.dependency.plugins.AbstractController.incrementState(AbstractController.java:734)
       at org.jboss.dependency.plugins.AbstractController.resolveContexts(AbstractController.java:862)
       at org.jboss.dependency.plugins.AbstractController.resolveContexts(AbstractController.java:784)
       at org.jboss.dependency.plugins.AbstractController.install(AbstractController.java:574)
       at org.jboss.dependency.plugins.AbstractController.install(AbstractController.java:398)
       at org.jboss.kernel.plugins.deployment.AbstractKernelDeployer.deployBean(AbstractKernelDeployer.java:309)
       at org.jboss.kernel.plugins.deployment.AbstractKernelDeployer.deployBeans(AbstractKernelDeployer.java:279)
       at org.jboss.kernel.plugins.deployment.AbstractKernelDeployer.deploy(AbstractKernelDeployer.java:130)
       at org.jboss.kernel.plugins.deployment.xml.BeanXMLDeployer.deploy(BeanXMLDeployer.java:96)
       at org.jboss.embedded.Bootstrap.deployBaseBootstrapUrl(Bootstrap.java:130)
       at org.jboss.embedded.Bootstrap.bootstrapURL(Bootstrap.java:142)
       at org.jboss.embedded.Bootstrap.bootstrap(Bootstrap.java:183)
       at org.jboss.embedded.Bootstrap.bootstrap(Bootstrap.java:195)
       at org.jboss.seam.mock.EmbeddedBootstrap.startAndDeployResources(EmbeddedBootstrap.java:11)
       at org.jboss.seam.mock.AbstractSeamTest.startJbossEmbeddedIfNecessary(AbstractSeamTest.java:1024)
       at org.jboss.seam.mock.AbstractSeamTest.startSeam(AbstractSeamTest.java:915)
       at org.jboss.seam.mock.SeamTest.startSeam(SeamTest.java:58)
       at sun.reflect.NativeMethodAccessorImpl.invoke0(Native Method)
       at sun.reflect.NativeMethodAccessorImpl.invoke(NativeMethodAccessorImpl.java:39)
       at sun.reflect.DelegatingMethodAccessorImpl.invoke(DelegatingMethodAccessorImpl.java:25)
       at java.lang.reflect.Method.invoke(Method.java:597)
       at org.testng.internal.MethodHelper.invokeMethod(MethodHelper.java:580)
       at org.testng.internal.Invoker.invokeConfigurationMethod(Invoker.java:398)
       at org.testng.internal.Invoker.invokeConfigurations(Invoker.java:145)
       at org.testng.internal.Invoker.invokeConfigurations(Invoker.java:82)
       at org.testng.SuiteRunner.privateRun(SuiteRunner.java:278)
       at org.testng.SuiteRunner.run(SuiteRunner.java:198)
       at org.testng.TestNG.createAndRunSuiteRunners(TestNG.java:823)
       at org.testng.TestNG.runSuitesLocally(TestNG.java:790)
       at org.testng.TestNG.run(TestNG.java:708)
       at org.testng.remote.RemoteTestNG.run(RemoteTestNG.java:73)
       at org.testng.remote.RemoteTestNG.main(RemoteTestNG.java:124)
      Caused by: java.lang.reflect.UndeclaredThrowableException
       at org.jboss.reflect.plugins.ArrayInfoImpl.getType(ArrayInfoImpl.java:103)
       at org.jboss.reflect.plugins.ClassInfoImpl.isArray(ClassInfoImpl.java:495)
       at org.jboss.aop.util.ClassInfoMethodHashing.getTypeString(ClassInfoMethodHashing.java:149)
       at org.jboss.aop.util.ClassInfoMethodHashing.methodHash(ClassInfoMethodHashing.java:53)
       ... 51 more
      Caused by: java.lang.ClassNotFoundException: [Ljava.lang.Class;
       at java.net.URLClassLoader$1.run(URLClassLoader.java:200)
       at java.security.AccessController.doPrivileged(Native Method)
       at java.net.URLClassLoader.findClass(URLClassLoader.java:188)
       at java.lang.ClassLoader.loadClass(ClassLoader.java:316)
       at sun.misc.Launcher$AppClassLoader.loadClass(Launcher.java:288)
       at java.lang.ClassLoader.loadClass(ClassLoader.java:251)
       at org.jboss.reflect.plugins.introspection.IntrospectionTypeInfoFactoryImpl.resolveComplexTypeInfo(IntrospectionTypeInfoFactoryImpl.java:367)
       at org.jboss.reflect.plugins.introspection.IntrospectionTypeInfoFactoryImpl.getTypeInfo(IntrospectionTypeInfoFactoryImpl.java:344)
       at org.jboss.reflect.plugins.introspection.IntrospectionTypeInfoFactory.getTypeInfo(IntrospectionTypeInfoFactory.java:54)
       at org.jboss.reflect.plugins.ArrayInfoImpl.getType(ArrayInfoImpl.java:99)
       ... 54 more
      ERROR [org.jboss.kernel.plugins.dependency.AbstractKernelController] Error installing to Described: name=SARDeployer state=PreInstall
      java.lang.RuntimeException: java.lang.reflect.UndeclaredThrowableException
       at org.jboss.aop.util.ClassInfoMethodHashing.methodHash(ClassInfoMethodHashing.java:70)
       at org.jboss.aop.util.ClassInfoMethodHashing.addDeclaredMethods(ClassInfoMethodHashing.java:169)
       at org.jboss.aop.util.ClassInfoMethodHashing.populateMethodTables(ClassInfoMethodHashing.java:182)
       at org.jboss.aop.util.ClassInfoMethodHashing.populateMethodTables(ClassInfoMethodHashing.java:181)
       at org.jboss.aop.util.ClassInfoMethodHashing.populateMethodTables(ClassInfoMethodHashing.java:181)
       at org.jboss.aop.util.ClassInfoMethodHashing.populateMethodTables(ClassInfoMethodHashing.java:181)
       at org.jboss.aop.util.ClassInfoMethodHashing.populateMethodTables(ClassInfoMethodHashing.java:181)
       at org.jboss.aop.util.ClassInfoMethodHashing.populateMethodTables(ClassInfoMethodHashing.java:181)
       at org.jboss.aop.util.ClassInfoMethodHashing.getMethodMap(ClassInfoMethodHashing.java:188)
       at org.jboss.aop.microcontainer.integration.AOPDependencyBuilder.getMethodAnnotationDependencies(AOPDependencyBuilder.java:197)
       at org.jboss.aop.microcontainer.integration.AOPDependencyBuilder.getAnnotationDependencies(AOPDependencyBuilder.java:152)
       at org.jboss.aop.microcontainer.integration.AOPDependencyBuilder.getDependencies(AOPDependencyBuilder.java:130)
       at org.jboss.classadapter.plugins.BasicClassAdapter.getDependencies(BasicClassAdapter.java:80)
       at org.jboss.beans.info.plugins.AbstractBeanInfo.getDependencies(AbstractBeanInfo.java:211)
       at org.jboss.kernel.plugins.dependency.DescribeAction.installActionInternal(DescribeAction.java:53)
       at org.jboss.kernel.plugins.dependency.KernelControllerContextAction.installAction(KernelControllerContextAction.java:135)
       at org.jboss.kernel.plugins.dependency.KernelControllerContextAction.installAction(KernelControllerContextAction.java:46)
       at org.jboss.dependency.plugins.action.SimpleControllerContextAction.simpleInstallAction(SimpleControllerContextAction.java:62)
       at org.jboss.dependency.plugins.action.AccessControllerContextAction.install(AccessControllerContextAction.java:71)
       at org.jboss.dependency.plugins.AbstractControllerContextActions.install(AbstractControllerContextActions.java:51)
       at org.jboss.dependency.plugins.AbstractControllerContext.install(AbstractControllerContext.java:327)
       at org.jboss.dependency.plugins.AbstractController.install(AbstractController.java:1309)
       at org.jboss.dependency.plugins.AbstractController.incrementState(AbstractController.java:734)
       at org.jboss.dependency.plugins.AbstractController.resolveContexts(AbstractController.java:862)
       at org.jboss.dependency.plugins.AbstractController.resolveContexts(AbstractController.java:784)
       at org.jboss.dependency.plugins.AbstractController.install(AbstractController.java:574)
       at org.jboss.dependency.plugins.AbstractController.install(AbstractController.java:398)
       at org.jboss.kernel.plugins.deployment.AbstractKernelDeployer.deployBean(AbstractKernelDeployer.java:309)
       at org.jboss.kernel.plugins.deployment.AbstractKernelDeployer.deployBeans(AbstractKernelDeployer.java:279)
       at org.jboss.kernel.plugins.deployment.AbstractKernelDeployer.deploy(AbstractKernelDeployer.java:130)
       at org.jboss.kernel.plugins.deployment.xml.BeanXMLDeployer.deploy(BeanXMLDeployer.java:96)
       at org.jboss.embedded.Bootstrap.deployBaseBootstrapUrl(Bootstrap.java:130)
       at org.jboss.embedded.Bootstrap.bootstrapURL(Bootstrap.java:142)
       at org.jboss.embedded.Bootstrap.bootstrap(Bootstrap.java:183)
       at org.jboss.embedded.Bootstrap.bootstrap(Bootstrap.java:195)
       at org.jboss.seam.mock.EmbeddedBootstrap.startAndDeployResources(EmbeddedBootstrap.java:11)
       at org.jboss.seam.mock.AbstractSeamTest.startJbossEmbeddedIfNecessary(AbstractSeamTest.java:1024)
       at org.jboss.seam.mock.AbstractSeamTest.startSeam(AbstractSeamTest.java:915)
       at org.jboss.seam.mock.SeamTest.startSeam(SeamTest.java:58)
       at sun.reflect.NativeMethodAccessorImpl.invoke0(Native Method)
       at sun.reflect.NativeMethodAccessorImpl.invoke(NativeMethodAccessorImpl.java:39)
       at sun.reflect.DelegatingMethodAccessorImpl.invoke(DelegatingMethodAccessorImpl.java:25)
       at java.lang.reflect.Method.invoke(Method.java:597)
       at org.testng.internal.MethodHelper.invokeMethod(MethodHelper.java:580)
       at org.testng.internal.Invoker.invokeConfigurationMethod(Invoker.java:398)
       at org.testng.internal.Invoker.invokeConfigurations(Invoker.java:145)
       at org.testng.internal.Invoker.invokeConfigurations(Invoker.java:82)
       at org.testng.SuiteRunner.privateRun(SuiteRunner.java:278)
       at org.testng.SuiteRunner.run(SuiteRunner.java:198)
       at org.testng.TestNG.createAndRunSuiteRunners(TestNG.java:823)
       at org.testng.TestNG.runSuitesLocally(TestNG.java:790)
       at org.testng.TestNG.run(TestNG.java:708)
       at org.testng.remote.RemoteTestNG.run(RemoteTestNG.java:73)
       at org.testng.remote.RemoteTestNG.main(RemoteTestNG.java:124)
      Caused by: java.lang.reflect.UndeclaredThrowableException
       at org.jboss.reflect.plugins.ArrayInfoImpl.getType(ArrayInfoImpl.java:103)
       at org.jboss.reflect.plugins.ClassInfoImpl.isArray(ClassInfoImpl.java:495)
       at org.jboss.aop.util.ClassInfoMethodHashing.getTypeString(ClassInfoMethodHashing.java:149)
       at org.jboss.aop.util.ClassInfoMethodHashing.methodHash(ClassInfoMethodHashing.java:53)
       ... 53 more
      Caused by: java.lang.ClassNotFoundException: [Ljava.lang.Class;
       at java.net.URLClassLoader$1.run(URLClassLoader.java:200)
       at java.security.AccessController.doPrivileged(Native Method)
       at java.net.URLClassLoader.findClass(URLClassLoader.java:188)
       at java.lang.ClassLoader.loadClass(ClassLoader.java:316)
       at sun.misc.Launcher$AppClassLoader.loadClass(Launcher.java:288)
       at java.lang.ClassLoader.loadClass(ClassLoader.java:251)
       at org.jboss.reflect.plugins.introspection.IntrospectionTypeInfoFactoryImpl.resolveComplexTypeInfo(IntrospectionTypeInfoFactoryImpl.java:367)
       at org.jboss.reflect.plugins.introspection.IntrospectionTypeInfoFactoryImpl.getTypeInfo(IntrospectionTypeInfoFactoryImpl.java:344)
       at org.jboss.reflect.plugins.introspection.IntrospectionTypeInfoFactory.getTypeInfo(IntrospectionTypeInfoFactory.java:54)
       at org.jboss.reflect.plugins.ArrayInfoImpl.getType(ArrayInfoImpl.java:99)
       ... 56 more
      ERROR [org.jboss.kernel.plugins.dependency.AbstractKernelController] Error installing to Described: name=ServiceClassLoaderDeployer state=PreInstall
      java.lang.RuntimeException: java.lang.reflect.UndeclaredThrowableException
       at org.jboss.aop.util.ClassInfoMethodHashing.methodHash(ClassInfoMethodHashing.java:70)
       at org.jboss.aop.util.ClassInfoMethodHashing.addDeclaredMethods(ClassInfoMethodHashing.java:169)
       at org.jboss.aop.util.ClassInfoMethodHashing.populateMethodTables(ClassInfoMethodHashing.java:182)
       at org.jboss.aop.util.ClassInfoMethodHashing.populateMethodTables(ClassInfoMethodHashing.java:181)
       at org.jboss.aop.util.ClassInfoMethodHashing.populateMethodTables(ClassInfoMethodHashing.java:181)
       at org.jboss.aop.util.ClassInfoMethodHashing.populateMethodTables(ClassInfoMethodHashing.java:181)
       at org.jboss.aop.util.ClassInfoMethodHashing.getMethodMap(ClassInfoMethodHashing.java:188)
       at org.jboss.aop.microcontainer.integration.AOPDependencyBuilder.getMethodAnnotationDependencies(AOPDependencyBuilder.java:197)
       at org.jboss.aop.microcontainer.integration.AOPDependencyBuilder.getAnnotationDependencies(AOPDependencyBuilder.java:152)
       at org.jboss.aop.microcontainer.integration.AOPDependencyBuilder.getDependencies(AOPDependencyBuilder.java:130)
       at org.jboss.classadapter.plugins.BasicClassAdapter.getDependencies(BasicClassAdapter.java:80)
       at org.jboss.beans.info.plugins.AbstractBeanInfo.getDependencies(AbstractBeanInfo.java:211)
       at org.jboss.kernel.plugins.dependency.DescribeAction.installActionInternal(DescribeAction.java:53)
       at org.jboss.kernel.plugins.dependency.KernelControllerContextAction.installAction(KernelControllerContextAction.java:135)
       at org.jboss.kernel.plugins.dependency.KernelControllerContextAction.installAction(KernelControllerContextAction.java:46)
       at org.jboss.dependency.plugins.action.SimpleControllerContextAction.simpleInstallAction(SimpleControllerContextAction.java:62)
       at org.jboss.dependency.plugins.action.AccessControllerContextAction.install(AccessControllerContextAction.java:71)
       at org.jboss.dependency.plugins.AbstractControllerContextActions.install(AbstractControllerContextActions.java:51)
       at org.jboss.dependency.plugins.AbstractControllerContext.install(AbstractControllerContext.java:327)
       at org.jboss.dependency.plugins.AbstractController.install(AbstractController.java:1309)
       at org.jboss.dependency.plugins.AbstractController.incrementState(AbstractController.java:734)
       at org.jboss.dependency.plugins.AbstractController.resolveContexts(AbstractController.java:862)
       at org.jboss.dependency.plugins.AbstractController.resolveContexts(AbstractController.java:784)
       at org.jboss.dependency.plugins.AbstractController.install(AbstractController.java:574)
       at org.jboss.dependency.plugins.AbstractController.install(AbstractController.java:398)
       at org.jboss.kernel.plugins.deployment.AbstractKernelDeployer.deployBean(AbstractKernelDeployer.java:309)
       at org.jboss.kernel.plugins.deployment.AbstractKernelDeployer.deployBeans(AbstractKernelDeployer.java:279)
       at org.jboss.kernel.plugins.deployment.AbstractKernelDeployer.deploy(AbstractKernelDeployer.java:130)
       at org.jboss.kernel.plugins.deployment.xml.BeanXMLDeployer.deploy(BeanXMLDeployer.java:96)
       at org.jboss.embedded.Bootstrap.deployBaseBootstrapUrl(Bootstrap.java:130)
       at org.jboss.embedded.Bootstrap.bootstrapURL(Bootstrap.java:142)
       at org.jboss.embedded.Bootstrap.bootstrap(Bootstrap.java:183)
       at org.jboss.embedded.Bootstrap.bootstrap(Bootstrap.java:195)
       at org.jboss.seam.mock.EmbeddedBootstrap.startAndDeployResources(EmbeddedBootstrap.java:11)
       at org.jboss.seam.mock.AbstractSeamTest.startJbossEmbeddedIfNecessary(AbstractSeamTest.java:1024)
       at org.jboss.seam.mock.AbstractSeamTest.startSeam(AbstractSeamTest.java:915)
       at org.jboss.seam.mock.SeamTest.startSeam(SeamTest.java:58)
       at sun.reflect.NativeMethodAccessorImpl.invoke0(Native Method)
       at sun.reflect.NativeMethodAccessorImpl.invoke(NativeMethodAccessorImpl.java:39)
       at sun.reflect.DelegatingMethodAccessorImpl.invoke(DelegatingMethodAccessorImpl.java:25)
       at java.lang.reflect.Method.invoke(Method.java:597)
       at org.testng.internal.MethodHelper.invokeMethod(MethodHelper.java:580)
       at org.testng.internal.Invoker.invokeConfigurationMethod(Invoker.java:398)
       at org.testng.internal.Invoker.invokeConfigurations(Invoker.java:145)
       at org.testng.internal.Invoker.invokeConfigurations(Invoker.java:82)
       at org.testng.SuiteRunner.privateRun(SuiteRunner.java:278)
       at org.testng.SuiteRunner.run(SuiteRunner.java:198)
       at org.testng.TestNG.createAndRunSuiteRunners(TestNG.java:823)
       at org.testng.TestNG.runSuitesLocally(TestNG.java:790)
       at org.testng.TestNG.run(TestNG.java:708)
       at org.testng.remote.RemoteTestNG.run(RemoteTestNG.java:73)
       at org.testng.remote.RemoteTestNG.main(RemoteTestNG.java:124)
      Caused by: java.lang.reflect.UndeclaredThrowableException
       at org.jboss.reflect.plugins.ArrayInfoImpl.getType(ArrayInfoImpl.java:103)
       at org.jboss.reflect.plugins.ClassInfoImpl.isArray(ClassInfoImpl.java:495)
       at org.jboss.aop.util.ClassInfoMethodHashing.getTypeString(ClassInfoMethodHashing.java:149)
       at org.jboss.aop.util.ClassInfoMethodHashing.methodHash(ClassInfoMethodHashing.java:53)
       ... 51 more
      Caused by: java.lang.ClassNotFoundException: [Ljava.lang.Class;
       at java.net.URLClassLoader$1.run(URLClassLoader.java:200)
       at java.security.AccessController.doPrivileged(Native Method)
       at java.net.URLClassLoader.findClass(URLClassLoader.java:188)
       at java.lang.ClassLoader.loadClass(ClassLoader.java:316)
       at sun.misc.Launcher$AppClassLoader.loadClass(Launcher.java:288)
       at java.lang.ClassLoader.loadClass(ClassLoader.java:251)
       at org.jboss.reflect.plugins.introspection.IntrospectionTypeInfoFactoryImpl.resolveComplexTypeInfo(IntrospectionTypeInfoFactoryImpl.java:367)
       at org.jboss.reflect.plugins.introspection.IntrospectionTypeInfoFactoryImpl.getTypeInfo(IntrospectionTypeInfoFactoryImpl.java:344)
       at org.jboss.reflect.plugins.introspection.IntrospectionTypeInfoFactory.getTypeInfo(IntrospectionTypeInfoFactory.java:54)
       at org.jboss.reflect.plugins.ArrayInfoImpl.getType(ArrayInfoImpl.java:99)
       ... 54 more
      ERROR [org.jboss.kernel.plugins.dependency.AbstractKernelController] Error installing to Described: name=ServiceDeploymentDeployer state=PreInstall
      java.lang.RuntimeException: java.lang.reflect.UndeclaredThrowableException
       at org.jboss.aop.util.ClassInfoMethodHashing.methodHash(ClassInfoMethodHashing.java:70)
       at org.jboss.aop.util.ClassInfoMethodHashing.addDeclaredMethods(ClassInfoMethodHashing.java:169)
       at org.jboss.aop.util.ClassInfoMethodHashing.populateMethodTables(ClassInfoMethodHashing.java:182)
       at org.jboss.aop.util.ClassInfoMethodHashing.populateMethodTables(ClassInfoMethodHashing.java:181)
       at org.jboss.aop.util.ClassInfoMethodHashing.populateMethodTables(ClassInfoMethodHashing.java:181)
       at org.jboss.aop.util.ClassInfoMethodHashing.populateMethodTables(ClassInfoMethodHashing.java:181)
       at org.jboss.aop.util.ClassInfoMethodHashing.populateMethodTables(ClassInfoMethodHashing.java:181)
       at org.jboss.aop.util.ClassInfoMethodHashing.getMethodMap(ClassInfoMethodHashing.java:188)
       at org.jboss.aop.microcontainer.integration.AOPDependencyBuilder.getMethodAnnotationDependencies(AOPDependencyBuilder.java:197)
       at org.jboss.aop.microcontainer.integration.AOPDependencyBuilder.getAnnotationDependencies(AOPDependencyBuilder.java:152)
       at org.jboss.aop.microcontainer.integration.AOPDependencyBuilder.getDependencies(AOPDependencyBuilder.java:130)
       at org.jboss.classadapter.plugins.BasicClassAdapter.getDependencies(BasicClassAdapter.java:80)
       at org.jboss.beans.info.plugins.AbstractBeanInfo.getDependencies(AbstractBeanInfo.java:211)
       at org.jboss.kernel.plugins.dependency.DescribeAction.installActionInternal(DescribeAction.java:53)
       at org.jboss.kernel.plugins.dependency.KernelControllerContextAction.installAction(KernelControllerContextAction.java:135)
       at org.jboss.kernel.plugins.dependency.KernelControllerContextAction.installAction(KernelControllerContextAction.java:46)
       at org.jboss.dependency.plugins.action.SimpleControllerContextAction.simpleInstallAction(SimpleControllerContextAction.java:62)
       at org.jboss.dependency.plugins.action.AccessControllerContextAction.install(AccessControllerContextAction.java:71)
       at org.jboss.dependency.plugins.AbstractControllerContextActions.install(AbstractControllerContextActions.java:51)
       at org.jboss.dependency.plugins.AbstractControllerContext.install(AbstractControllerContext.java:327)
       at org.jboss.dependency.plugins.AbstractController.install(AbstractController.java:1309)
       at org.jboss.dependency.plugins.AbstractController.incrementState(AbstractController.java:734)
       at org.jboss.dependency.plugins.AbstractController.resolveContexts(AbstractController.java:862)
       at org.jboss.dependency.plugins.AbstractController.resolveContexts(AbstractController.java:784)
       at org.jboss.dependency.plugins.AbstractController.install(AbstractController.java:574)
       at org.jboss.dependency.plugins.AbstractController.install(AbstractController.java:398)
       at org.jboss.kernel.plugins.deployment.AbstractKernelDeployer.deployBean(AbstractKernelDeployer.java:309)
       at org.jboss.kernel.plugins.deployment.AbstractKernelDeployer.deployBeans(AbstractKernelDeployer.java:279)
       at org.jboss.kernel.plugins.deployment.AbstractKernelDeployer.deploy(AbstractKernelDeployer.java:130)
       at org.jboss.kernel.plugins.deployment.xml.BeanXMLDeployer.deploy(BeanXMLDeployer.java:96)
       at org.jboss.embedded.Bootstrap.deployBaseBootstrapUrl(Bootstrap.java:130)
       at org.jboss.embedded.Bootstrap.bootstrapURL(Bootstrap.java:142)
       at org.jboss.embedded.Bootstrap.bootstrap(Bootstrap.java:183)
       at org.jboss.embedded.Bootstrap.bootstrap(Bootstrap.java:195)
       at org.jboss.seam.mock.EmbeddedBootstrap.startAndDeployResources(EmbeddedBootstrap.java:11)
       at org.jboss.seam.mock.AbstractSeamTest.startJbossEmbeddedIfNecessary(AbstractSeamTest.java:1024)
       at org.jboss.seam.mock.AbstractSeamTest.startSeam(AbstractSeamTest.java:915)
       at org.jboss.seam.mock.SeamTest.startSeam(SeamTest.java:58)
       at sun.reflect.NativeMethodAccessorImpl.invoke0(Native Method)
       at sun.reflect.NativeMethodAccessorImpl.invoke(NativeMethodAccessorImpl.java:39)
       at sun.reflect.DelegatingMethodAccessorImpl.invoke(DelegatingMethodAccessorImpl.java:25)
       at java.lang.reflect.Method.invoke(Method.java:597)
       at org.testng.internal.MethodHelper.invokeMethod(MethodHelper.java:580)
       at org.testng.internal.Invoker.invokeConfigurationMethod(Invoker.java:398)
       at org.testng.internal.Invoker.invokeConfigurations(Invoker.java:145)
       at org.testng.internal.Invoker.invokeConfigurations(Invoker.java:82)
       at org.testng.SuiteRunner.privateRun(SuiteRunner.java:278)
       at org.testng.SuiteRunner.run(SuiteRunner.java:198)
       at org.testng.TestNG.createAndRunSuiteRunners(TestNG.java:823)
       at org.testng.TestNG.runSuitesLocally(TestNG.java:790)
       at org.testng.TestNG.run(TestNG.java:708)
       at org.testng.remote.RemoteTestNG.run(RemoteTestNG.java:73)
       at org.testng.remote.RemoteTestNG.main(RemoteTestNG.java:124)
      Caused by: java.lang.reflect.UndeclaredThrowableException
       at org.jboss.reflect.plugins.ArrayInfoImpl.getType(ArrayInfoImpl.java:103)
       at org.jboss.reflect.plugins.ClassInfoImpl.isArray(ClassInfoImpl.java:495)
       at org.jboss.aop.util.ClassInfoMethodHashing.getTypeString(ClassInfoMethodHashing.java:149)
       at org.jboss.aop.util.ClassInfoMethodHashing.methodHash(ClassInfoMethodHashing.java:53)
       ... 52 more
      Caused by: java.lang.ClassNotFoundException: [Ljava.lang.Class;
       at java.net.URLClassLoader$1.run(URLClassLoader.java:200)
       at java.security.AccessController.doPrivileged(Native Method)
       at java.net.URLClassLoader.findClass(URLClassLoader.java:188)
       at java.lang.ClassLoader.loadClass(ClassLoader.java:316)
       at sun.misc.Launcher$AppClassLoader.loadClass(Launcher.java:288)
       at java.lang.ClassLoader.loadClass(ClassLoader.java:251)
       at org.jboss.reflect.plugins.introspection.IntrospectionTypeInfoFactoryImpl.resolveComplexTypeInfo(IntrospectionTypeInfoFactoryImpl.java:367)
       at org.jboss.reflect.plugins.introspection.IntrospectionTypeInfoFactoryImpl.getTypeInfo(IntrospectionTypeInfoFactoryImpl.java:344)
       at org.jboss.reflect.plugins.introspection.IntrospectionTypeInfoFactory.getTypeInfo(IntrospectionTypeInfoFactory.java:54)
       at org.jboss.reflect.plugins.ArrayInfoImpl.getType(ArrayInfoImpl.java:99)
       ... 55 more
      ERROR [org.jboss.kernel.plugins.dependency.AbstractKernelController] Error installing to Described: name=ServiceDeployer state=PreInstall
      java.lang.RuntimeException: java.lang.reflect.UndeclaredThrowableException
       at org.jboss.aop.util.ClassInfoMethodHashing.methodHash(ClassInfoMethodHashing.java:70)
       at org.jboss.aop.util.ClassInfoMethodHashing.addDeclaredMethods(ClassInfoMethodHashing.java:169)
       at org.jboss.aop.util.ClassInfoMethodHashing.populateMethodTables(ClassInfoMethodHashing.java:182)
       at org.jboss.aop.util.ClassInfoMethodHashing.populateMethodTables(ClassInfoMethodHashing.java:181)
       at org.jboss.aop.util.ClassInfoMethodHashing.populateMethodTables(ClassInfoMethodHashing.java:181)
       at org.jboss.aop.util.ClassInfoMethodHashing.populateMethodTables(ClassInfoMethodHashing.java:181)
       at org.jboss.aop.util.ClassInfoMethodHashing.getMethodMap(ClassInfoMethodHashing.java:188)
       at org.jboss.aop.microcontainer.integration.AOPDependencyBuilder.getMethodAnnotationDependencies(AOPDependencyBuilder.java:197)
       at org.jboss.aop.microcontainer.integration.AOPDependencyBuilder.getAnnotationDependencies(AOPDependencyBuilder.java:152)
       at org.jboss.aop.microcontainer.integration.AOPDependencyBuilder.getDependencies(AOPDependencyBuilder.java:130)
       at org.jboss.classadapter.plugins.BasicClassAdapter.getDependencies(BasicClassAdapter.java:80)
       at org.jboss.beans.info.plugins.AbstractBeanInfo.getDependencies(AbstractBeanInfo.java:211)
       at org.jboss.kernel.plugins.dependency.DescribeAction.installActionInternal(DescribeAction.java:53)
       at org.jboss.kernel.plugins.dependency.KernelControllerContextAction.installAction(KernelControllerContextAction.java:135)
       at org.jboss.kernel.plugins.dependency.KernelControllerContextAction.installAction(KernelControllerContextAction.java:46)
       at org.jboss.dependency.plugins.action.SimpleControllerContextAction.simpleInstallAction(SimpleControllerContextAction.java:62)
       at org.jboss.dependency.plugins.action.AccessControllerContextAction.install(AccessControllerContextAction.java:71)
       at org.jboss.dependency.plugins.AbstractControllerContextActions.install(AbstractControllerContextActions.java:51)
       at org.jboss.dependency.plugins.AbstractControllerContext.install(AbstractControllerContext.java:327)
       at org.jboss.dependency.plugins.AbstractController.install(AbstractController.java:1309)
       at org.jboss.dependency.plugins.AbstractController.incrementState(AbstractController.java:734)
       at org.jboss.dependency.plugins.AbstractController.resolveContexts(AbstractController.java:862)
       at org.jboss.dependency.plugins.AbstractController.resolveContexts(AbstractController.java:784)
       at org.jboss.dependency.plugins.AbstractController.install(AbstractController.java:574)
       at org.jboss.dependency.plugins.AbstractController.install(AbstractController.java:398)
       at org.jboss.kernel.plugins.deployment.AbstractKernelDeployer.deployBean(AbstractKernelDeployer.java:309)
       at org.jboss.kernel.plugins.deployment.AbstractKernelDeployer.deployBeans(AbstractKernelDeployer.java:279)
       at org.jboss.kernel.plugins.deployment.AbstractKernelDeployer.deploy(AbstractKernelDeployer.java:130)
       at org.jboss.kernel.plugins.deployment.xml.BeanXMLDeployer.deploy(BeanXMLDeployer.java:96)
       at org.jboss.embedded.Bootstrap.deployBaseBootstrapUrl(Bootstrap.java:130)
       at org.jboss.embedded.Bootstrap.bootstrapURL(Bootstrap.java:142)
       at org.jboss.embedded.Bootstrap.bootstrap(Bootstrap.java:183)
       at org.jboss.embedded.Bootstrap.bootstrap(Bootstrap.java:195)
       at org.jboss.seam.mock.EmbeddedBootstrap.startAndDeployResources(EmbeddedBootstrap.java:11)
       at org.jboss.seam.mock.AbstractSeamTest.startJbossEmbeddedIfNecessary(AbstractSeamTest.java:1024)
       at org.jboss.seam.mock.AbstractSeamTest.startSeam(AbstractSeamTest.java:915)
       at org.jboss.seam.mock.SeamTest.startSeam(SeamTest.java:58)
       at sun.reflect.NativeMethodAccessorImpl.invoke0(Native Method)
       at sun.reflect.NativeMethodAccessorImpl.invoke(NativeMethodAccessorImpl.java:39)
       at sun.reflect.DelegatingMethodAccessorImpl.invoke(DelegatingMethodAccessorImpl.java:25)
       at java.lang.reflect.Method.invoke(Method.java:597)
       at org.testng.internal.MethodHelper.invokeMethod(MethodHelper.java:580)
       at org.testng.internal.Invoker.invokeConfigurationMethod(Invoker.java:398)
       at org.testng.internal.Invoker.invokeConfigurations(Invoker.java:145)
       at org.testng.internal.Invoker.invokeConfigurations(Invoker.java:82)
       at org.testng.SuiteRunner.privateRun(SuiteRunner.java:278)
       at org.testng.SuiteRunner.run(SuiteRunner.java:198)
       at org.testng.TestNG.createAndRunSuiteRunners(TestNG.java:823)
       at org.testng.TestNG.runSuitesLocally(TestNG.java:790)
       at org.testng.TestNG.run(TestNG.java:708)
       at org.testng.remote.RemoteTestNG.run(RemoteTestNG.java:73)
       at org.testng.remote.RemoteTestNG.main(RemoteTestNG.java:124)
      Caused by: java.lang.reflect.UndeclaredThrowableException
       at org.jboss.reflect.plugins.ArrayInfoImpl.getType(ArrayInfoImpl.java:103)
       at org.jboss.reflect.plugins.ClassInfoImpl.isArray(ClassInfoImpl.java:495)
       at org.jboss.aop.util.ClassInfoMethodHashing.getTypeString(ClassInfoMethodHashing.java:149)
       at org.jboss.aop.util.ClassInfoMethodHashing.methodHash(ClassInfoMethodHashing.java:53)
       ... 51 more
      Caused by: java.lang.ClassNotFoundException: [Ljava.lang.Class;
       at java.net.URLClassLoader$1.run(URLClassLoader.java:200)
       at java.security.AccessController.doPrivileged(Native Method)
       at java.net.URLClassLoader.findClass(URLClassLoader.java:188)
       at java.lang.ClassLoader.loadClass(ClassLoader.java:316)
       at sun.misc.Launcher$AppClassLoader.loadClass(Launcher.java:288)
       at java.lang.ClassLoader.loadClass(ClassLoader.java:251)
       at org.jboss.reflect.plugins.introspection.IntrospectionTypeInfoFactoryImpl.resolveComplexTypeInfo(IntrospectionTypeInfoFactoryImpl.java:367)
       at org.jboss.reflect.plugins.introspection.IntrospectionTypeInfoFactoryImpl.getTypeInfo(IntrospectionTypeInfoFactoryImpl.java:344)
       at org.jboss.reflect.plugins.introspection.IntrospectionTypeInfoFactory.getTypeInfo(IntrospectionTypeInfoFactory.java:54)
       at org.jboss.reflect.plugins.ArrayInfoImpl.getType(ArrayInfoImpl.java:99)
       ... 54 more
      FAILED CONFIGURATION: @BeforeSuite startSeam
      org.jboss.deployers.client.spi.IncompleteDeploymentException: Summary of incomplete deployments (SEE PREVIOUS ERRORS FOR DETAILS):
      
      *** CONTEXTS IN ERROR: Name -> Error
      
      SARDeployer -> java.lang.ClassNotFoundException: [Ljava.lang.Class;
      
      ServiceDeploymentDeployer -> java.lang.ClassNotFoundException: [Ljava.lang.Class;
      
      ServiceClassLoaderDeployer -> java.lang.ClassNotFoundException: [Ljava.lang.Class;
      
      BeanDeployer -> java.lang.ClassNotFoundException: [Ljava.lang.Class;
      
      ServiceDeployer -> java.lang.ClassNotFoundException: [Ljava.lang.Class;
      
      BeanMetaDataDeployer -> java.lang.ClassNotFoundException: [Ljava.lang.Class;
      
      KernelDeploymentDeployer -> java.lang.ClassNotFoundException: [Ljava.lang.Class;
      
      
       at org.jboss.deployers.plugins.deployers.DeployersImpl.checkComplete(DeployersImpl.java:576)
       at org.jboss.deployers.plugins.main.MainDeployerImpl.checkComplete(MainDeployerImpl.java:559)
       at org.jboss.embedded.Bootstrap.bootstrapURL(Bootstrap.java:149)
       at org.jboss.embedded.Bootstrap.bootstrap(Bootstrap.java:183)
       at org.jboss.embedded.Bootstrap.bootstrap(Bootstrap.java:195)
       at org.jboss.seam.mock.EmbeddedBootstrap.startAndDeployResources(EmbeddedBootstrap.java:11)
       at org.jboss.seam.mock.AbstractSeamTest.startJbossEmbeddedIfNecessary(AbstractSeamTest.java:1024)
       at org.jboss.seam.mock.AbstractSeamTest.startSeam(AbstractSeamTest.java:915)
       at org.jboss.seam.mock.SeamTest.startSeam(SeamTest.java:58)
      ... Removed 15 stack frames
      SKIPPED CONFIGURATION: @BeforeClass setupClass
      SKIPPED CONFIGURATION: @BeforeMethod begin
      SKIPPED CONFIGURATION: @AfterMethod end
      SKIPPED CONFIGURATION: @AfterClass cleanupClass
      SKIPPED: testUserRegistration
      
      ===============================================
       test
       Tests run: 1, Failures: 0, Skips: 1
       Configuration Failures: 1, Skips: 4
      ===============================================
      
      
      ===============================================
      test-test by packages
      Total tests run: 1, Failures: 0, Skips: 1
      Configuration Failures: 1, Skips: 5
      ===============================================