7 Replies Latest reply: Feb 24, 2012 12:12 AM by Jeff Yu RSS

    Switchyard release project build.

    Jeff Yu Master

      Hi all,

       

      Did you saw the same error as I did? Or it could be something wrong in my environment. (BTW, where can I check the latest build result of project, like release project)

       

      I am building against the latest code on release project.

       

      Thanks

      Jeff

       

      [INFO] ------------------------------------------------------------------------

      [INFO] Reactor Summary:

      [INFO]

      [INFO] SwitchYard: Distribution .......................... SUCCESS [1.769s]

      [INFO] SwitchYard: Release Distribution Tests Utilities .. SUCCESS [6.905s]

      [INFO] SwitchYard: Distribution Artifacts ................ SUCCESS [0.978s]

      [INFO] SwitchYard: Merge Assembly Plugin ................. SUCCESS [4.168s]

      [INFO] SwitchYard: AS7 Parent ............................ SUCCESS [5.901s]

      [INFO] SwitchYard: AS7 jBPM Parent ....................... SUCCESS [0.911s]

      [INFO] SwitchYard: AS7 Extension ......................... SUCCESS [8.286s]

      [INFO] SwitchYard: AS7 Modules ........................... SUCCESS [19.656s]

      [INFO] SwitchYard: AS7 Release Distribution Tests ........ SUCCESS [1.905s]

      [INFO] SwitchYard: AS7 Standalone Parent ................. SUCCESS [0.454s]

      [INFO] SwitchYard: AS7 Bundle ............................ SUCCESS [8.155s]

      [INFO] SwitchYard: AS7 Distribution ...................... FAILURE [6:21.997s]

      [INFO] SwitchYard: AS7 OpenShift Parent .................. SKIPPED

      [INFO] SwitchYard: AS7 OpenShift Express Parent .......... SKIPPED

      [INFO] SwitchYard: AS7 OpenShift Express Cartridge Modules  SKIPPED

      [INFO] SwitchYard: AS7 OpenShift Express Distribution .... SKIPPED

      [INFO] SwitchYard: Forge Plugin Distribution ............. SKIPPED

      [INFO] SwitchYard: Tools Distribution .................... SKIPPED

      [INFO] SwitchYard: Forge Installer ....................... SKIPPED

      [INFO] SwitchYard: Installer ............................. SKIPPED

      [INFO] ------------------------------------------------------------------------

      [INFO] BUILD FAILURE

      [INFO] ------------------------------------------------------------------------

       

       

      Below is one of the failed test case log.

       

      Tests run: 1, Failures: 0, Errors: 1, Skipped: 0, Time elapsed: 20.126 sec <<< FAILURE!

      org.switchyard.test.quickstarts.demo.HelpDeskDemoQuickstartTest  Time elapsed: 0 sec  <<< ERROR!

      org.jboss.arquillian.container.spi.client.container.DeploymentException: Could not deploy to container

                at org.jboss.as.arquillian.container.ArchiveDeployer.deploy(ArchiveDeployer.java:68)

                at org.jboss.as.arquillian.container.CommonDeployableContainer.deploy(CommonDeployableContainer.java:142)

                at org.jboss.arquillian.container.impl.client.container.ContainerDeployController$3.call(ContainerDeployController.java:156)

                at org.jboss.arquillian.container.impl.client.container.ContainerDeployController$3.call(ContainerDeployController.java:123)

                at org.jboss.arquillian.container.impl.client.container.ContainerDeployController.executeOperation(ContainerDeployController.java:266)

                at org.jboss.arquillian.container.impl.client.container.ContainerDeployController.deploy(ContainerDeployController.java:122)

                at sun.reflect.NativeMethodAccessorImpl.invoke0(Native Method)

                at sun.reflect.NativeMethodAccessorImpl.invoke(NativeMethodAccessorImpl.java:39)

                at sun.reflect.DelegatingMethodAccessorImpl.invoke(DelegatingMethodAccessorImpl.java:25)

                at java.lang.reflect.Method.invoke(Method.java:597)

                at org.jboss.arquillian.core.impl.ObserverImpl.invoke(ObserverImpl.java:90)

                at org.jboss.arquillian.core.impl.EventContextImpl.invokeObservers(EventContextImpl.java:99)

                at org.jboss.arquillian.core.impl.EventContextImpl.proceed(EventContextImpl.java:81)

                at org.jboss.arquillian.container.impl.client.container.DeploymentExceptionHandler.verifyExpectedExceptionDuringDeploy(DeploymentExceptionHandler.java:50)

                at sun.reflect.NativeMethodAccessorImpl.invoke0(Native Method)

                at sun.reflect.NativeMethodAccessorImpl.invoke(NativeMethodAccessorImpl.java:39)

                at sun.reflect.DelegatingMethodAccessorImpl.invoke(DelegatingMethodAccessorImpl.java:25)

                at java.lang.reflect.Method.invoke(Method.java:597)

                at org.jboss.arquillian.core.impl.ObserverImpl.invoke(ObserverImpl.java:90)

                at org.jboss.arquillian.core.impl.EventContextImpl.proceed(EventContextImpl.java:88)

                at org.jboss.arquillian.container.impl.client.ContainerDeploymentContextHandler.createDeploymentContext(ContainerDeploymentContextHandler.java:78)

                at sun.reflect.NativeMethodAccessorImpl.invoke0(Native Method)

                at sun.reflect.NativeMethodAccessorImpl.invoke(NativeMethodAccessorImpl.java:39)

                at sun.reflect.DelegatingMethodAccessorImpl.invoke(DelegatingMethodAccessorImpl.java:25)

                at java.lang.reflect.Method.invoke(Method.java:597)

                at org.jboss.arquillian.core.impl.ObserverImpl.invoke(ObserverImpl.java:90)

                at org.jboss.arquillian.core.impl.EventContextImpl.proceed(EventContextImpl.java:88)

                at org.jboss.arquillian.container.impl.client.ContainerDeploymentContextHandler.createContainerContext(ContainerDeploymentContextHandler.java:57)

                at sun.reflect.NativeMethodAccessorImpl.invoke0(Native Method)

                at sun.reflect.NativeMethodAccessorImpl.invoke(NativeMethodAccessorImpl.java:39)

                at sun.reflect.DelegatingMethodAccessorImpl.invoke(DelegatingMethodAccessorImpl.java:25)

                at java.lang.reflect.Method.invoke(Method.java:597)

                at org.jboss.arquillian.core.impl.ObserverImpl.invoke(ObserverImpl.java:90)

                at org.jboss.arquillian.core.impl.EventContextImpl.proceed(EventContextImpl.java:88)

                at org.jboss.arquillian.core.impl.ManagerImpl.fire(ManagerImpl.java:134)

                at org.jboss.arquillian.core.impl.ManagerImpl.fire(ManagerImpl.java:114)

                at org.jboss.arquillian.core.impl.EventImpl.fire(EventImpl.java:67)

                at org.jboss.arquillian.container.impl.client.container.ContainerDeployController$1.perform(ContainerDeployController.java:90)

                at org.jboss.arquillian.container.impl.client.container.ContainerDeployController$1.perform(ContainerDeployController.java:79)

                at org.jboss.arquillian.container.impl.client.container.ContainerDeployController.forEachDeployment(ContainerDeployController.java:258)

                at org.jboss.arquillian.container.impl.client.container.ContainerDeployController.forEachManagedDeployment(ContainerDeployController.java:234)

                at org.jboss.arquillian.container.impl.client.container.ContainerDeployController.deployManaged(ContainerDeployController.java:78)

                at sun.reflect.NativeMethodAccessorImpl.invoke0(Native Method)

                at sun.reflect.NativeMethodAccessorImpl.invoke(NativeMethodAccessorImpl.java:39)

                at sun.reflect.DelegatingMethodAccessorImpl.invoke(DelegatingMethodAccessorImpl.java:25)

                at java.lang.reflect.Method.invoke(Method.java:597)

                at org.jboss.arquillian.core.impl.ObserverImpl.invoke(ObserverImpl.java:90)

                at org.jboss.arquillian.core.impl.EventContextImpl.invokeObservers(EventContextImpl.java:99)

                at org.jboss.arquillian.core.impl.EventContextImpl.proceed(EventContextImpl.java:81)

                at org.jboss.arquillian.core.impl.ManagerImpl.fire(ManagerImpl.java:134)

                at org.jboss.arquillian.core.impl.ManagerImpl.fire(ManagerImpl.java:114)

                at org.jboss.arquillian.core.impl.EventImpl.fire(EventImpl.java:67)

                at org.jboss.arquillian.container.test.impl.client.ContainerEventController.execute(ContainerEventController.java:101)

                at sun.reflect.NativeMethodAccessorImpl.invoke0(Native Method)

                at sun.reflect.NativeMethodAccessorImpl.invoke(NativeMethodAccessorImpl.java:39)

                at sun.reflect.DelegatingMethodAccessorImpl.invoke(DelegatingMethodAccessorImpl.java:25)

                at java.lang.reflect.Method.invoke(Method.java:597)

                at org.jboss.arquillian.core.impl.ObserverImpl.invoke(ObserverImpl.java:90)

                at org.jboss.arquillian.core.impl.EventContextImpl.invokeObservers(EventContextImpl.java:99)

                at org.jboss.arquillian.core.impl.EventContextImpl.proceed(EventContextImpl.java:81)

                at org.jboss.arquillian.test.impl.TestContextHandler.createClassContext(TestContextHandler.java:75)

                at sun.reflect.NativeMethodAccessorImpl.invoke0(Native Method)

                at sun.reflect.NativeMethodAccessorImpl.invoke(NativeMethodAccessorImpl.java:39)

                at sun.reflect.DelegatingMethodAccessorImpl.invoke(DelegatingMethodAccessorImpl.java:25)

                at java.lang.reflect.Method.invoke(Method.java:597)

                at org.jboss.arquillian.core.impl.ObserverImpl.invoke(ObserverImpl.java:90)

                at org.jboss.arquillian.core.impl.EventContextImpl.proceed(EventContextImpl.java:88)

                at org.jboss.arquillian.test.impl.TestContextHandler.createSuiteContext(TestContextHandler.java:60)

                at sun.reflect.NativeMethodAccessorImpl.invoke0(Native Method)

                at sun.reflect.NativeMethodAccessorImpl.invoke(NativeMethodAccessorImpl.java:39)

                at sun.reflect.DelegatingMethodAccessorImpl.invoke(DelegatingMethodAccessorImpl.java:25)

                at java.lang.reflect.Method.invoke(Method.java:597)

                at org.jboss.arquillian.core.impl.ObserverImpl.invoke(ObserverImpl.java:90)

                at org.jboss.arquillian.core.impl.EventContextImpl.proceed(EventContextImpl.java:88)

                at org.jboss.arquillian.core.impl.ManagerImpl.fire(ManagerImpl.java:134)

                at org.jboss.arquillian.core.impl.ManagerImpl.fire(ManagerImpl.java:114)

                at org.jboss.arquillian.test.impl.EventTestRunnerAdaptor.beforeClass(EventTestRunnerAdaptor.java:80)

                at org.jboss.arquillian.junit.Arquillian$2.evaluate(Arquillian.java:182)

                at org.jboss.arquillian.junit.Arquillian.multiExecute(Arquillian.java:314)

                at org.jboss.arquillian.junit.Arquillian.access$100(Arquillian.java:46)

                at org.jboss.arquillian.junit.Arquillian$3.evaluate(Arquillian.java:199)

                at org.junit.runners.ParentRunner.run(ParentRunner.java:300)

                at org.jboss.arquillian.junit.Arquillian.run(Arquillian.java:147)

                at org.apache.maven.surefire.junit4.JUnit4TestSet.execute(JUnit4TestSet.java:59)

                at org.apache.maven.surefire.suite.AbstractDirectoryTestSuite.executeTestSet(AbstractDirectoryTestSuite.java:120)

                at org.apache.maven.surefire.suite.AbstractDirectoryTestSuite.execute(AbstractDirectoryTestSuite.java:145)

                at org.apache.maven.surefire.Surefire.run(Surefire.java:104)

                at sun.reflect.NativeMethodAccessorImpl.invoke0(Native Method)

                at sun.reflect.NativeMethodAccessorImpl.invoke(NativeMethodAccessorImpl.java:39)

                at sun.reflect.DelegatingMethodAccessorImpl.invoke(DelegatingMethodAccessorImpl.java:25)

                at java.lang.reflect.Method.invoke(Method.java:597)

                at org.apache.maven.surefire.booter.SurefireBooter.runSuitesInProcess(SurefireBooter.java:290)

                at org.apache.maven.surefire.booter.SurefireBooter.main(SurefireBooter.java:1017)

      Caused by: java.lang.Exception: {"JBAS014671: Failed services" => {"jboss.deployment.unit.\"switchyard-quickstart-demo-helpdesk-0.4.0-SNAPSHOT.jar\".WeldService" => "org.jboss.msc.service.StartException in service jboss.deployment.unit.\"switchyard-quickstart-demo-helpdesk-0.4.0-SNAPSHOT.jar\".WeldService: com.google.common.collect.ComputationException: java.lang.ArrayStoreException: sun.reflect.annotation.TypeNotPresentExceptionProxy"}}

                at org.jboss.as.controller.client.helpers.standalone.impl.ServerDeploymentPlanResultFuture.getActionResult(ServerDeploymentPlanResultFuture.java:134)

                at org.jboss.as.controller.client.helpers.standalone.impl.ServerDeploymentPlanResultFuture.getResultFromNode(ServerDeploymentPlanResultFuture.java:123)

                at org.jboss.as.controller.client.helpers.standalone.impl.ServerDeploymentPlanResultFuture.get(ServerDeploymentPlanResultFuture.java:85)

                at org.jboss.as.controller.client.helpers.standalone.impl.ServerDeploymentPlanResultFuture.get(ServerDeploymentPlanResultFuture.java:42)

                at org.jboss.as.arquillian.container.ArchiveDeployer.executeDeploymentPlan(ArchiveDeployer.java:85)

                at org.jboss.as.arquillian.container.ArchiveDeployer.deploy(ArchiveDeployer.java:58)

                ... 92 more