0 Replies Latest reply: Apr 12, 2012 10:42 AM by malek zguir RSS

    problems with Arqillan and JBoss 5.1.0 GA.

    malek zguir Newbie

      hi

      I am having problems with Arqillan (1.0.0.Alpha5),  and JBoss 5.1.0 GA.

      I use EJB3 ,jboss-5.1.0.GA ,Jdk1.6.0_25 ,JEE 5


       

       

      package ARQUI.ARQUILLIAN.util;

      import javax.ejb.Local;

       

      @Local

      public interface Somme {

            public long addition(int a, int b);

       

      }

       

        

      package ARQUI.ARQUILLIAN.util;

      import javax.ejb.Stateless;

       

      @Stateless

      public class SommeImpl implements Somme {

         public long addition(int a, int b) {

                  return a + b;

      }

      }

       

       

       

      package ARQUI.ARQUILLIAN.test;

       

      import javax.ejb.EJB;

      import org.jboss.arquillian.container.test.api.Deployment;

      import org.jboss.arquillian.junit.Arquillian;

      import org.jboss.shrinkwrap.api.Archive;

      import org.jboss.shrinkwrap.api.ShrinkWrap;

      import org.jboss.shrinkwrap.api.asset.EmptyAsset;

      import org.jboss.shrinkwrap.api.spec.EnterpriseArchive;

      import org.jboss.shrinkwrap.api.spec.JavaArchive;

      import org.jboss.shrinkwrap.api.spec.WebArchive;

      import org.junit.Test;

      import org.junit.runner.RunWith;

      import ARQUI.ARQUILLIAN.util.Somme;

      import ARQUI.ARQUILLIAN.util.SommeImpl;

       

      @RunWith(Arquillian.class)

      public class MemberRegistrationTest {

        

      @Deployment

      public static Archive<?> createTestArchive() {

                  final WebArchive war = ShrinkWrap.create(WebArchive.class, "test.war")

                  .addClasses(Somme.class,SommeImpl.class,MemberRegistrationTest.class)

                  .addAsWebInfResource(EmptyAsset.INSTANCE, "beans.xml")

                  .addAsWebInfResource("test-ds.xml", "test-ds.xml");

                  return ShrinkWrap.create(EnterpriseArchive.class, "test.ear")

           .addAsModule(war);

      }

         @EJB

         Somme som;

        

         @Test

         public void testRegister() throws Exception {

       

      System.out.println(" 4+ 5 "+ som.addition(4, 5) );

       

         }

        

      }

       

      arquillian.xml

       

      <?xml version="1.0" encoding="UTF-8"?>

      <arquillian xmlns="http://jboss.org/schema/arquillian"

         xmlns:xsi="http://www.w3.org/2001/XMLSchema-instance"

         xsi:schemaLocation="http://jboss.org/schema/arquillian

      http://jboss.org/schema/arquillian/arquillian_1_0.xsd">

       

         <!-- Uncomment to have test archives exported to the file system for inspection -->

      <!--    <engine>  -->

      <!--       <property name="deploymentExportPath">target/</property>  -->

      <!--    </engine> -->

       

         <!-- Force the use of the Servlet 3.0 protocol with all containers, as it is the most mature -->

         <defaultProtocol type="Servlet 3.0" />

       

         <!-- Example configuration for a remote JBoss AS 7 instance -->

         <container qualifier="jboss" default="true">

            <!-- If you want to use the JBOSS_HOME environment variable, just delete the jbossHome property -->

            <configuration>

               <property name="bindHttpPort">8080</property>

               <property name="jbossHome">D:/outil/jboss-5.1.0.GA</property>

            </configuration>  

         </container>       

                               

      </arquillian>

       

       

       

      1. Pom.xml

       

      <?xml version="1.0" encoding="UTF-8"?>

      <project xmlns="http://maven.apache.org/POM/4.0.0" xmlns:xsi="http://www.w3.org/2001/XMLSchema-instance"

          xsi:schemaLocation="http://maven.apache.org/POM/4.0.0 http://maven.apache.org/maven-v4_0_0.xsd">

          <modelVersion>4.0.0</modelVersion>

          <parent>

              <artifactId>ARQUILLIAN</artifactId>

              <groupId>ARQUI</groupId>

              <version>0.0.1-SNAPSHOT</version>

          </parent>

          <artifactId>ARQUILLIAN-ejb</artifactId>

          <packaging>ejb</packaging>

          <name>ARQUILLIAN EJB module</name>

          <dependencies>

              <dependency>

                  <groupId>javax.ejb</groupId>

                  <artifactId>ejb-api</artifactId>

                  <version>3.0</version>

                  <scope>provided</scope>

              </dependency>

              <dependency>

                  <groupId>junit</groupId>

                  <artifactId>junit</artifactId>

                  <version>4.7</version>

              </dependency>

              <dependency>

                  <groupId>org.jboss.arquillian.junit</groupId>

                  <artifactId>arquillian-junit-container</artifactId>

                  <version>1.0.0.CR7</version>

              </dependency>

              <dependency>

                  <groupId>org.jboss.arquillian.protocol</groupId>

                  <artifactId>arquillian-protocol-servlet</artifactId>

                  <version>1.0.0.CR7</version>

              </dependency>

              <dependency>

                  <groupId>org.jboss.arquillian.container</groupId>

                  <artifactId>arquillian-jbossas-managed-5.1</artifactId>

                  <version>1.0.0.CR3</version>

              </dependency>

              <dependency>

                  <groupId>org.jboss.arquillian.container</groupId>

                  <artifactId>arquillian-container-test-spi</artifactId>

                  <version>1.0.0.CR8</version>

              </dependency>

              <dependency>

                  <groupId>org.jboss.as</groupId>

                  <artifactId>jboss-as-server</artifactId>

                  <version>7.1.1.Final</version>

              </dependency>

       

          </dependencies>

          <build>

              <plugins>

                  <plugin>

                      <groupId>org.apache.maven.plugins</groupId>

                      <artifactId>maven-ejb-plugin</artifactId>

                      <configuration>

                          <ejbVersion>3.0</ejbVersion>

                      </configuration>

                  </plugin>

              </plugins>

          </build>

          <profiles>

              <profile>

                  <id>default</id>

                  <activation>

                      <activeByDefault>true</activeByDefault>

                  </activation>

                  <build>

                      <plugins>

                          <plugin>

                              <artifactId>maven-surefire-plugin</artifactId>

                              <version>2.4.3</version>

                              <configuration>

                                  <skip>false</skip>

                              </configuration>

                          </plugin>

                      </plugins>

                  </build>

              </profile>

          </profiles>

      </project>

       

       

      -------------------------------------------------------

      T E S T S

      -------------------------------------------------------

      Running ARQUI.ARQUILLIAN.test.MemberRegistrationTest

      org.apache.maven.surefire.booter.SurefireExecutionException: Could not create a new instance of class org.jboss.arquillian.test.impl.EventTestRunnerAdaptor see cause.; nested exception is java.lang.RuntimeException: Could not create a new instance of class org.jboss.arquillian.test.impl.EventTestRunnerAdaptor see cause.

      java.lang.RuntimeException: Could not create a new instance of class org.jboss.arquillian.test.impl.EventTestRunnerAdaptor see cause.

          at org.jboss.arquillian.test.spi.SecurityActions.newInstance(SecurityActions.java:170)

          at org.jboss.arquillian.test.spi.TestRunnerAdaptorBuilder.build(TestRunnerAdaptorBuilder.java:52)

          at org.jboss.arquillian.junit.Arquillian.run(Arquillian.java:93)

          at org.apache.maven.surefire.junit4.JUnit4TestSet.execute(JUnit4TestSet.java:62)

          at org.apache.maven.surefire.suite.AbstractDirectoryTestSuite.executeTestSet(AbstractDirectoryTestSuite.java:140)

          at org.apache.maven.surefire.suite.AbstractDirectoryTestSuite.execute(AbstractDirectoryTestSuite.java:127)

          at org.apache.maven.surefire.Surefire.run(Surefire.java:177)

          at sun.reflect.NativeMethodAccessorImpl.invoke0(Native Method)

          at sun.reflect.NativeMethodAccessorImpl.invoke(NativeMethodAccessorImpl.java:39)

          at sun.reflect.DelegatingMethodAccessorImpl.invoke(DelegatingMethodAccessorImpl.java:25)

          at java.lang.reflect.Method.invoke(Method.java:597)

          at org.apache.maven.surefire.booter.SurefireBooter.runSuitesInProcess(SurefireBooter.java:345)

          at org.apache.maven.surefire.booter.SurefireBooter.main(SurefireBooter.java:1009)

      Caused by: java.lang.reflect.InvocationTargetException

          at sun.reflect.NativeConstructorAccessorImpl.newInstance0(Native Method)

          at sun.reflect.NativeConstructorAccessorImpl.newInstance(NativeConstructorAccessorImpl.java:39)

          at sun.reflect.DelegatingConstructorAccessorImpl.newInstance(DelegatingConstructorAccessorImpl.java:27)

          at java.lang.reflect.Constructor.newInstance(Constructor.java:513)

          at org.jboss.arquillian.test.spi.SecurityActions.newInstance(SecurityActions.java:166)

          ... 12 more

      Caused by: java.lang.NoClassDefFoundError: org/jboss/jbossas/servermanager/ServerManager

          at java.lang.Class.getDeclaredConstructors0(Native Method)

          at java.lang.Class.privateGetDeclaredConstructors(Class.java:2389)

          at java.lang.Class.getConstructor0(Class.java:2699)

          at java.lang.Class.getConstructor(Class.java:1657)

          at org.jboss.arquillian.core.impl.loadable.SecurityActions$1.run(SecurityActions.java:77)

          at org.jboss.arquillian.core.impl.loadable.SecurityActions$1.run(SecurityActions.java:74)

          at java.security.AccessController.doPrivileged(Native Method)

          at org.jboss.arquillian.core.impl.loadable.SecurityActions.getConstructor(SecurityActions.java:73)

          at org.jboss.arquillian.core.impl.loadable.SecurityActions.newInstance(SecurityActions.java:163)

          at org.jboss.arquillian.core.impl.loadable.ServiceRegistryLoader.createServiceInstance(ServiceRegistryLoader.java:103)

          at org.jboss.arquillian.core.impl.loadable.ServiceRegistryLoader.all(ServiceRegistryLoader.java:55)

          at org.jboss.arquillian.core.impl.loadable.ServiceRegistryLoader.onlyOne(ServiceRegistryLoader.java:67)

          at org.jboss.arquillian.container.impl.LocalContainerRegistry.create(LocalContainerRegistry.java:76)

          at org.jboss.arquillian.container.impl.client.container.ContainerRegistryCreator.createRegistry(ContainerRegistryCreator.java:75)

          at sun.reflect.NativeMethodAccessorImpl.invoke0(Native Method)

          at sun.reflect.NativeMethodAccessorImpl.invoke(NativeMethodAccessorImpl.java:39)

          at sun.reflect.DelegatingMethodAccessorImpl.invoke(DelegatingMethodAccessorImpl.java:25)

          at java.lang.reflect.Method.invoke(Method.java:597)

          at org.jboss.arquillian.core.impl.ObserverImpl.invoke(ObserverImpl.java:90)

          at org.jboss.arquillian.core.impl.EventContextImpl.invokeObservers(EventContextImpl.java:99)

          at org.jboss.arquillian.core.impl.EventContextImpl.proceed(EventContextImpl.java:81)

          at org.jboss.arquillian.core.impl.ManagerImpl.fire(ManagerImpl.java:134)

          at org.jboss.arquillian.core.impl.ManagerImpl.fire(ManagerImpl.java:114)

          at org.jboss.arquillian.core.impl.ManagerImpl.bindAndFire(ManagerImpl.java:235)

          at org.jboss.arquillian.core.impl.InstanceImpl.set(InstanceImpl.java:74)

          at org.jboss.arquillian.config.impl.extension.ConfigurationRegistrar.loadConfiguration(ConfigurationRegistrar.java:68)

          at sun.reflect.NativeMethodAccessorImpl.invoke0(Native Method)

          at sun.reflect.NativeMethodAccessorImpl.invoke(NativeMethodAccessorImpl.java:39)

          at sun.reflect.DelegatingMethodAccessorImpl.invoke(DelegatingMethodAccessorImpl.java:25)

          at java.lang.reflect.Method.invoke(Method.java:597)

          at org.jboss.arquillian.core.impl.ObserverImpl.invoke(ObserverImpl.java:90)

          at org.jboss.arquillian.core.impl.EventContextImpl.invokeObservers(EventContextImpl.java:99)

          at org.jboss.arquillian.core.impl.EventContextImpl.proceed(EventContextImpl.java:81)

          at org.jboss.arquillian.core.impl.ManagerImpl.fire(ManagerImpl.java:134)

          at org.jboss.arquillian.core.impl.ManagerImpl.fire(ManagerImpl.java:114)

          at org.jboss.arquillian.core.impl.ManagerImpl.start(ManagerImpl.java:260)

          at org.jboss.arquillian.test.impl.EventTestRunnerAdaptor.<init>(EventTestRunnerAdaptor.java:56)

          ... 17 more

      Caused by: java.lang.ClassNotFoundException: org.jboss.jbossas.servermanager.ServerManager

          at java.net.URLClassLoader$1.run(URLClassLoader.java:202)

          at java.security.AccessController.doPrivileged(Native Method)

          at java.net.URLClassLoader.findClass(URLClassLoader.java:190)

          at java.lang.ClassLoader.loadClass(ClassLoader.java:306)

          at sun.misc.Launcher$AppClassLoader.loadClass(Launcher.java:301)

          at java.lang.ClassLoader.loadClass(ClassLoader.java:247)

          ... 54 more

      [INFO] ------------------------------------------------------------------------

      [ERROR] BUILD FAILURE

      [INFO] ------------------------------------------------------------------------

      [INFO] There are test failures.

       

      Please refer to D:\Tools\tsm-mno\workspace_TSM\ARQUILLIAN\ARQUILLIAN-ejb\target\surefire-reports for the individual test results.

      [INFO] ------------------------------------------------------------------------

      [INFO] For more information, run Maven with the -e switch

      [INFO] ------------------------------------------------------------------------

      [INFO] Total time: 2 seconds

      [INFO] Finished at: Thu Apr 12 16:19:48 CEST 2012

      [INFO] Final Memory: 22M/53M

      [INFO] ------------------------------------------------------------------------