3 Replies Latest reply on Jun 1, 2011 7:45 AM by bmcd

    JBoss SOA Platform 30 Evaluation - can't deploy quickstart

    bmcd Newbie

      I have installed soa-5.1.0.GA 30 day evaluation onto a linux server, following the Getting Started Guide.  As this is an evaluation I haven't attempted to change the database from Hypersonic. 

       

      The default server has been started bound to localhost.  When I try to deploy the helloworld quickstart the build fails and I get the following

       

      ant deploy

       

      Buildfile: build.xml

       

      check-jbossesb-dist:

       

      qslib-dependencies:

       

      non-qslib-dependencies:

       

      jbossesb-quickstart-override:

       

      jbossesb-source-dependencies:

       

      jbossesb-server-dependencies:

           [echo] Using profile: default

       

      check-as-version:

           [echo] /jboss/jboss-soa-p-5/jboss-as/server/default

       

      jbossesb-dependencies-as4:

       

      jbossesb-dependencies-as5:

       

      messaging-config:

       

      messaging-dependencies:

       

      jbossmq-dependencies:

       

      hornetq-dependencies:

       

      quickstart-specific-dependencies:

       

      classpath-dependencies-as4:

       

      classpath-dependencies-as5:

       

      quickstart-specific-checks:

       

      dependencies:

       

      compile:

       

      config:

       

      copy-metainf:

       

      transformDeploymentXml:

           [xslt] DEPRECATED - xalan processor is deprecated. Use trax instead.

           [xslt] DEPRECATED - xslp processor is deprecated. Use trax instead.

           [xslt] java.lang.ClassNotFoundException: org.apache.tools.ant.taskdefs.optional.XslpLiaison

           [xslt]     at java.net.URLClassLoader$1.run(URLClassLoader.java:217)

           [xslt]     at java.security.AccessController.doPrivileged(Native Method)

           [xslt]     at java.net.URLClassLoader.findClass(URLClassLoader.java:205)

           [xslt]     at java.lang.ClassLoader.loadClass(ClassLoader.java:319)

           [xslt]     at sun.misc.Launcher$AppClassLoader.loadClass(Launcher.java:294)

           [xslt]     at java.lang.ClassLoader.loadClass(ClassLoader.java:264)

           [xslt]     at java.lang.ClassLoader.loadClassInternal(ClassLoader.java:332)

           [xslt]     at java.lang.Class.forName0(Native Method)

           [xslt]     at java.lang.Class.forName(Class.java:186)

           [xslt]     at org.apache.tools.ant.taskdefs.XSLTProcess.loadClass(XSLTProcess.java:419)

           [xslt]     at org.apache.tools.ant.taskdefs.XSLTProcess.resolveProcessor(XSLTProcess.java:397)

           [xslt]     at org.apache.tools.ant.taskdefs.XSLTProcess.getLiaison(XSLTProcess.java:619)

           [xslt]     at org.apache.tools.ant.taskdefs.XSLTProcess.execute(XSLTProcess.java:212)

           [xslt]     at org.apache.tools.ant.UnknownElement.execute(UnknownElement.java:275)

           [xslt]     at org.apache.tools.ant.Task.perform(Task.java:364)

           [xslt]     at org.apache.tools.ant.Target.execute(Target.java:341)

           [xslt]     at org.apache.tools.ant.Target.performTasks(Target.java:369)

           [xslt]     at org.apache.tools.ant.Project.executeSortedTargets(Project.java:1216)

           [xslt]     at org.apache.tools.ant.helper.SingleCheckExecutor.executeTargets(SingleCheckExecutor.java:37)

           [xslt]     at org.apache.tools.ant.Project.executeTargets(Project.java:1068)

           [xslt]     at org.apache.tools.ant.taskdefs.Ant.execute(Ant.java:382)

           [xslt]     at org.apache.tools.ant.taskdefs.CallTarget.execute(CallTarget.java:107)

           [xslt]     at org.apache.tools.ant.UnknownElement.execute(UnknownElement.java:275)

           [xslt]     at org.apache.tools.ant.Task.perform(Task.java:364)

           [xslt]     at org.apache.tools.ant.Target.execute(Target.java:341)

           [xslt]     at org.apache.tools.ant.Target.performTasks(Target.java:369)

           [xslt]     at org.apache.tools.ant.Project.executeSortedTargets(Project.java:1216)

           [xslt]     at org.apache.tools.ant.Project.executeTarget(Project.java:1185)

           [xslt]     at org.apache.tools.ant.helper.DefaultExecutor.executeTargets(DefaultExecutor.java:40)

           [xslt]     at org.apache.tools.ant.Project.executeTargets(Project.java:1068)

           [xslt]     at org.apache.tools.ant.Main.runBuild(Main.java:668)

           [xslt]     at org.apache.tools.ant.Main.startAnt(Main.java:187)

           [xslt]     at org.apache.tools.ant.launch.Launcher.run(Launcher.java:246)

           [xslt]     at org.apache.tools.ant.launch.Launcher.main(Launcher.java:67)

           [xslt] java.lang.ClassNotFoundException: org.apache.tools.ant.taskdefs.optional.XalanLiaison

           [xslt]     at java.net.URLClassLoader$1.run(URLClassLoader.java:217)

           [xslt]     at java.security.AccessController.doPrivileged(Native Method)

           [xslt]     at java.net.URLClassLoader.findClass(URLClassLoader.java:205)

           [xslt]     at java.lang.ClassLoader.loadClass(ClassLoader.java:319)

           [xslt]     at sun.misc.Launcher$AppClassLoader.loadClass(Launcher.java:294)

           [xslt]     at java.lang.ClassLoader.loadClass(ClassLoader.java:264)

           [xslt]     at java.lang.ClassLoader.loadClassInternal(ClassLoader.java:332)

           [xslt]     at java.lang.Class.forName0(Native Method)

           [xslt]     at java.lang.Class.forName(Class.java:186)

           [xslt]     at org.apache.tools.ant.taskdefs.XSLTProcess.loadClass(XSLTProcess.java:419)

           [xslt]     at org.apache.tools.ant.taskdefs.XSLTProcess.resolveProcessor(XSLTProcess.java:402)

           [xslt]     at org.apache.tools.ant.taskdefs.XSLTProcess.getLiaison(XSLTProcess.java:616)

           [xslt]     at org.apache.tools.ant.taskdefs.XSLTProcess.execute(XSLTProcess.java:212)

           [xslt]     at org.apache.tools.ant.UnknownElement.execute(UnknownElement.java:275)

           [xslt]     at org.apache.tools.ant.Task.perform(Task.java:364)

           [xslt]     at org.apache.tools.ant.Target.execute(Target.java:341)

           [xslt]     at org.apache.tools.ant.Target.performTasks(Target.java:369)

           [xslt]     at org.apache.tools.ant.Project.executeSortedTargets(Project.java:1216)

           [xslt]     at org.apache.tools.ant.helper.SingleCheckExecutor.executeTargets(SingleCheckExecutor.java:37)

           [xslt]     at org.apache.tools.ant.Project.executeTargets(Project.java:1068)

           [xslt]     at org.apache.tools.ant.taskdefs.Ant.execute(Ant.java:382)

           [xslt]     at org.apache.tools.ant.taskdefs.CallTarget.execute(CallTarget.java:107)

           [xslt]     at org.apache.tools.ant.UnknownElement.execute(UnknownElement.java:275)

           [xslt]     at org.apache.tools.ant.Task.perform(Task.java:364)

           [xslt]     at org.apache.tools.ant.Target.execute(Target.java:341)

           [xslt]     at org.apache.tools.ant.Target.performTasks(Target.java:369)

           [xslt]     at org.apache.tools.ant.Project.executeSortedTargets(Project.java:1216)

           [xslt]     at org.apache.tools.ant.Project.executeTarget(Project.java:1185)

           [xslt]     at org.apache.tools.ant.helper.DefaultExecutor.executeTargets(DefaultExecutor.java:40)

           [xslt]     at org.apache.tools.ant.Project.executeTargets(Project.java:1068)

           [xslt]     at org.apache.tools.ant.Main.runBuild(Main.java:668)

           [xslt]     at org.apache.tools.ant.Main.startAnt(Main.java:187)

           [xslt]     at org.apache.tools.ant.launch.Launcher.run(Launcher.java:246)

           [xslt]     at org.apache.tools.ant.launch.Launcher.main(Launcher.java:67)

       

      BUILD FAILED

      /jboss/jboss-soa-p-5/jboss-as/samples/quickstarts/conf/base-build.xml:484: The following error occurred while executing this line:

      /jboss/jboss-soa-p-5/jboss-as/samples/quickstarts/conf/base-build.xml:489: java.lang.ClassNotFoundException: org.apache.tools.ant.taskdefs.optional.TraXLiaison

       

      Total time: 1 second

       

      Does anybody have any ideas why this is failing, am I missing something obvious?  Any help would be much appreciated as the clock is ticking on the 30 day eval.

       

      Thanks