3 Replies Latest reply on Apr 21, 2014 1:05 AM by Rakesh Balguri

    TestCase failure in TestTeiidLanguageToSolr in teiid 8.7

    Rakesh Balguri Expert

      Hi,

       

      While building the source for teiid 8.7, I have encountered a test casee failure in TestTeiidLanguageToSolr. The method is testDateField().

       

      The following is the sure fire report:

       

      -------------------------------------------------------------------------------

      Test set: org.teiid.translator.solr.TestTeiidLanguageToSolr

      -------------------------------------------------------------------------------

      Tests run: 31, Failures: 1, Errors: 0, Skipped: 0, Time elapsed: 0.768 sec <<< FAILURE!

      testDateField(org.teiid.translator.solr.TestTeiidLanguageToSolr)  Time elapsed: 7 sec  <<< FAILURE!

      java.lang.AssertionError

        at org.junit.Assert.fail(Assert.java:86)

        at org.junit.Assert.assertTrue(Assert.java:41)

        at org.junit.Assert.assertTrue(Assert.java:52)

        at org.teiid.translator.solr.TestTeiidLanguageToSolr.testDateField(TestTeiidLanguageToSolr.java:247)

        at sun.reflect.NativeMethodAccessorImpl.invoke0(Native Method)

        at sun.reflect.NativeMethodAccessorImpl.invoke(NativeMethodAccessorImpl.java:57)

        at sun.reflect.DelegatingMethodAccessorImpl.invoke(DelegatingMethodAccessorImpl.java:43)

        at java.lang.reflect.Method.invoke(Method.java:601)

        at org.junit.runners.model.FrameworkMethod$1.runReflectiveCall(FrameworkMethod.java:47)

        at org.junit.internal.runners.model.ReflectiveCallable.run(ReflectiveCallable.java:12)

        at org.junit.runners.model.FrameworkMethod.invokeExplosively(FrameworkMethod.java:44)

        at org.junit.internal.runners.statements.InvokeMethod.evaluate(InvokeMethod.java:17)

        at org.junit.runners.ParentRunner.runLeaf(ParentRunner.java:271)

        at org.junit.runners.BlockJUnit4ClassRunner.runChild(BlockJUnit4ClassRunner.java:70)

        at org.junit.runners.BlockJUnit4ClassRunner.runChild(BlockJUnit4ClassRunner.java:50)

        at org.junit.runners.ParentRunner$3.run(ParentRunner.java:238)

        at org.junit.runners.ParentRunner$1.schedule(ParentRunner.java:63)

        at org.junit.runners.ParentRunner.runChildren(ParentRunner.java:236)

        at org.junit.runners.ParentRunner.access$000(ParentRunner.java:53)

        at org.junit.runners.ParentRunner$2.evaluate(ParentRunner.java:229)

        at org.junit.runners.ParentRunner.run(ParentRunner.java:309)

        at org.apache.maven.surefire.junit4.JUnit4Provider.execute(JUnit4Provider.java:252)

        at org.apache.maven.surefire.junit4.JUnit4Provider.executeTestSet(JUnit4Provider.java:141)

        at org.apache.maven.surefire.junit4.JUnit4Provider.invoke(JUnit4Provider.java:112)

        at sun.reflect.NativeMethodAccessorImpl.invoke0(Native Method)

        at sun.reflect.NativeMethodAccessorImpl.invoke(NativeMethodAccessorImpl.java:57)

        at sun.reflect.DelegatingMethodAccessorImpl.invoke(DelegatingMethodAccessorImpl.java:43)

        at java.lang.reflect.Method.invoke(Method.java:601)

        at org.apache.maven.surefire.util.ReflectionUtils.invokeMethodWithArray(ReflectionUtils.java:189)

        at org.apache.maven.surefire.booter.ProviderFactory$ProviderProxy.invoke(ProviderFactory.java:165)

        at org.apache.maven.surefire.booter.ProviderFactory.invokeProvider(ProviderFactory.java:85)

        at org.apache.maven.surefire.booter.ForkedBooter.runSuitesInProcess(ForkedBooter.java:115)

        at org.apache.maven.surefire.booter.ForkedBooter.main(ForkedBooter.java:75)