3 Replies Latest reply on Jul 3, 2014 1:51 AM by Meenakshi KK

    Problem deploying Gatein in EAP-6

    Meenakshi KK Newbie

      Hi everyone,

       

      I need to deploy Gatein in EAP 6.

       

      For this i have followed the instructions given in

      https://github.com/gatein/gatein-portal

       

      As per the instructions given in the above website,the EAP version supported is EAP-6.3.0.Alpha1

       

      Now the downloads page of Jboss EAP does not show EAP 6.3.0.Alpha1 but shows EAP 6.3.0.Alpha.

       

      I downloaded EAP 6.3.0.Beta and tried deploying gatein in EAP 6.3.0.Beta.

      I also unzipped the repository folder to .m2/repository.

       

      Now when I try to run with the following command,

      mvn install -DskipTests -Dservers.dir=D:/Softwares/SERVERS_DIR -Dgatein.dev=eap630

       

      I get the following error,

       

      ......

      [INFO] GateIn JBoss AS-based packaging (Wildfly / EAP) ... SUCCESS [0.070s]

      [INFO] GateIn - Portlet Container (JBoss AS-based Extension)  FAILURE [17.446s]

      [INFO] GateIn - Portlet Container (JBoss AS-based Extension Modules)  SKIPPED

      [INFO] GateIn package for JBoss AS-based (Wildfly / EAP) . SKIPPED

      [INFO] TestSuite for GateIn .............................. SKIPPED

      [INFO] Selenium Sniff Test for GateIn .................... SKIPPED

      [INFO] GateIn Portal Examples - WebUI based samples ...... SKIPPED

      [INFO] HTMLUnit Tests for GateIn ......................... SKIPPED

      [INFO] Selenium UI Tests for GateIn ...................... SKIPPED

      [INFO] ------------------------------------------------------------------------

      [INFO] BUILD FAILURE

      [INFO] ------------------------------------------------------------------------

      [INFO] Total time: 4:27.144s

      [INFO] Finished at: Thu Jun 26 14:32:55 IST 2014

      [INFO] Final Memory: 121M/247M

      [INFO] ------------------------------------------------------------------------

      [ERROR] Failed to execute goal on project jboss-integration-extension: Could not resolve dependencies for project org.gatein.portal:jboss-integration-

      extension:jar:3.9.0.Alpha01-SNAPSHOT: Failed to collect dependencies for [org.jboss.as:jboss-as-controller:jar:7.4.0.Final-redhat-4 (compile), org.jbo

      ss.as:jboss-as-server:jar:7.4.0.Final-redhat-4 (compile), org.jboss.as:jboss-as-ee:jar:7.4.0.Final-redhat-4 (compile), org.jboss.as:jboss-as-web:jar:7

      .4.0.Final-redhat-4 (compile), org.jboss.as:jboss-as-weld:jar:7.4.0.Final-redhat-4 (compile), org.jboss:jboss-vfs:jar:3.1.0.Final (compile), org.exopl

      atform.kernel:exo.kernel.container:jar:2.5.0-GA (compile), org.gatein.portal:exo.portal.webui.portal:jar:3.9.0.Alpha01-SNAPSHOT (compile), org.gatein.

      wci:wci-jboss7:jar:2.4.2.Final (compile), org.gatein.integration:extension-component:jar:3.9.0.Alpha01-SNAPSHOT (compile), org.gatein.wsrp:wsrp-integr

      ation-api:jar:2.3.2.Final (provided), org.gatein.cdi:gatein-cdi-contexts:jar:3.9.0.Alpha01-SNAPSHOT (compile), org.jboss.portletbridge:portletbridge-i

      mpl:jar:3.3.2.Final (compile), junit:junit:jar:4.10 (test), org.jboss.as:jboss-as-subsystem-test-framework:jar:7.4.0.Final-redhat-4 (compile), org.slf

      4j:slf4j-log4j12:jar:1.7.5 (test), org.slf4j:jul-to-slf4j:jar:1.7.5 (test), commons-logging:commons-logging:jar:1.1.1 (test), org.hsqldb:hsqldb:jar:2.

      3.0 (test), org.javassist:javassist:jar:3.18.0-GA (test)]: Failed to read artifact descriptor for org.jboss.sasl:jboss-sasl:jar:1.0.3.Final-redhat-1:

      Could not transfer artifact org.jboss:jboss-parent:pom:9-redhat-1 from/to jboss-product-repository (http://download.lab.bos.redhat.com/brewroot/repos/

      jb-eap-6-rhel-6-build/latest/maven/): download.lab.bos.redhat.com: Unknown host download.lab.bos.redhat.com -> [Help 1]

      [ERROR]

      [ERROR] To see the full stack trace of the errors, re-run Maven with the -e switch.

      [ERROR] Re-run Maven using the -X switch to enable full debug logging.

      [ERROR]

      [ERROR] For more information about the errors and possible solutions, please read the following articles:

      [ERROR] [Help 1] http://cwiki.apache.org/confluence/display/MAVEN/DependencyResolutionException

      [ERROR]

      [ERROR] After correcting the problems, you can resume the build with the command

      [ERROR]   mvn <goals> -rf :jboss-integration-extension

       

       

      Let me know how to resolve the same.

      Also, I would like to make this work in a GA version of EAP (EAP-6.2.0.GA) Let me know ho to make this work.

       

      Thanks,

        • 1. Re: Problem deploying Gatein in EAP-6
          Meenakshi KK Newbie

          Hi,

          I tried with jboss-eap-6.3.0.Alpha. Even here it's giving the following exception,,, refer below .....

           

          [INFO] GateIn JBoss AS-based packaging (Wildfly / EAP) .... SUCCESS [  0.094 s]
          [INFO] GateIn - Portlet Container (JBoss AS-based Extension) FAILURE [  8.299 s]

          [INFO] GateIn - Portlet Container (JBoss AS-based Extension Modules) SKIPPED
          [INFO] GateIn package for JBoss AS-based (Wildfly / EAP) .. SKIPPED
          [INFO] TestSuite for GateIn ............................... SKIPPED
          [INFO] Selenium Sniff Test for GateIn ..................... SKIPPED
          [INFO] GateIn Portal Examples - WebUI based samples ....... SKIPPED
          [INFO] HTMLUnit Tests for GateIn .......................... SKIPPED
          [INFO] Selenium UI Tests for GateIn ....................... SKIPPED
          [INFO] ------------------------------------------------------------------------
          [INFO] BUILD FAILURE
          [INFO] ------------------------------------------------------------------------
          [INFO] Total time: 07:18 min
          [INFO] Finished at: 2014-06-30T11:25:23+05:30
          [INFO] Final Memory: 142M/247M
          [INFO] ------------------------------------------------------------------------
          [ERROR] Failed to execute goal on project jboss-integration-extension: Could not
          resolve dependencies for project org.gatein.portal:jboss-integration-extension:
          jar:3.9.0.Alpha01-SNAPSHOT: Failed to collect dependencies at org.jboss.as:jboss
          -as-web:jar:7.4.0.Final-redhat-4 -> org.jboss.spec.javax.servlet.jsp:jboss-jsp-a
          pi_2.2_spec:jar:1.0.1.Final-redhat-2 -> org.jboss.spec.javax.servlet:jboss-servl
          et-api_3.0_spec:jar:1.0.1.Final-redhat-2: Failed to read artifact descriptor for
          org.jboss.spec.javax.servlet:jboss-servlet-api_3.0_spec:jar:1.0.1.Final-redhat-
          2: Could not transfer artifact org.jboss.spec.javax.servlet:jboss-servlet-api_3.
          0_spec:pom:1.0.1.Final-redhat-2 from/to jboss-product-repository (http://downloa
          d.lab.bos.redhat.com/brewroot/repos/jb-eap-6-rhel-6-build/latest/maven/): Failed
          to transfer file: http://download.lab.bos.redhat.com/brewroot/repos/jb-eap-6-rh
          el-6-build/latest/maven/org/jboss/spec/javax/servlet/jboss-servlet-api_3.0_spec/
          1.0.1.Final-redhat-2/jboss-servlet-api_3.0_spec-1.0.1.Final-redhat-2.pom. Return
          code is: 503 , ReasonPhrase:Service Unavailable. -> [Help 1]
          [ERROR]
          [ERROR] To see the full stack trace of the errors, re-run Maven with the -e swit
          ch.
          [ERROR] Re-run Maven using the -X switch to enable full debug logging.
          [ERROR]
          [ERROR] For more information about the errors and possible solutions, please rea
          d the following articles:
          [ERROR] [Help 1] http://cwiki.apache.org/confluence/display/MAVEN/DependencyReso
          lutionException
          [ERROR]
          [ERROR] After correcting the problems, you can resume the build with the command

           

           

          Request someone to help me out please.

           

          I need to deploy gatein in EAP 6 stable (GA) version, say EAP 6.2.0 GA.

           

          Thanks in advance

          • 2. Re: Problem deploying Gatein in EAP-6
            Lucas Ponce Novice

            Hello,

             

            It seems that the Alpha repository for JBoss EAP has a bug.

             

            We could build it with the following steps:

             

            - Edit

            ~/.m2/repository/org/jboss/as/jboss-as-parent/7.4.0.Final-redhat-4/jboss-as-parent-7.4.0.Final-redhat-4.pom

            - Remove repository that points to JBoss Internal Product Repository (

            download.lab.bos.redhat.com)

            -

            Remove ~/.m2/repository/org/jboss/as/jboss-as-parent/7.4.0.Final-redhat-4/jboss-as-parent-7.4.0.Final-redhat-4.pom.sha1

             

            You can build your gatein master as example:

             

            mvn clean install -DskipTests -Dgatein.dev=eap630

            -Dservers.dir=/opt/Software/servers/gatein/jboss-eap-6.3.0.Alpha -s

            /opt/Software/extra-repositories/jboss-eap-6.3.0.Alpha1-maven-repository/example-settings.xml

             

            Previously, edit your example-setting.xml to point to your alpha1 repo, or

            just copy your alpha1 repo into your local .m2

             

            Hope this helps,

            Lucas

             

             

             

            On Mon, Jun 30, 2014 at 8:00 AM, Meenakshi KK <do-not-reply@jboss.com>

            • 3. Re: Problem deploying Gatein in EAP-6
              Meenakshi KK Newbie


              Hi Lucas,

              Thanks a lot for your reply.

              As suggested, I followed your approach. The above mentioned exception has gone. I am facing another exception. Refer the stack trace below.

               

              Also please do let me know how to go about deploying Gatein in EAP 6.2.0.GA. I would like to deploy Gatein in a stable, general availability verison of EAP. Thanks again!

               

              Regards,

              Meenakshi

               

              PS the stack trace below.

               

              [ERROR] Failed to execute goal on project jboss-integration-extension: Could not resolve dependencies for project org.gatein.portal:jboss-integration

              extension:jar:3.9.0.Alpha01-SNAPSHOT: Failed to collect dependencies for [org.jboss.as:jboss-as-controller:jar:7.4.0.Final-redhat-4 (compile), org.jb

              ss.as:jboss-as-server:jar:7.4.0.Final-redhat-4 (compile), org.jboss.as:jboss-as-ee:jar:7.4.0.Final-redhat-4 (compile), org.jboss.as:jboss-as-web:jar:

              .4.0.Final-redhat-4 (compile), org.jboss.as:jboss-as-weld:jar:7.4.0.Final-redhat-4 (compile), org.jboss:jboss-vfs:jar:3.1.0.Final (compile), org.exop

              atform.kernel:exo.kernel.container:jar:2.5.0-GA (compile), org.gatein.portal:exo.portal.webui.portal:jar:3.9.0.Alpha01-SNAPSHOT (compile), org.gatein

              wci:wci-jboss7:jar:2.4.1.Final (compile), org.gatein.integration:extension-component:jar:3.9.0.Alpha01-SNAPSHOT (compile), org.gatein.wsrp:wsrp-integ

              ation-api:jar:2.3.1.Final (provided), org.gatein.cdi:gatein-cdi-contexts:jar:3.9.0.Alpha01-SNAPSHOT (compile), org.jboss.portletbridge:portletbridge-

              mpl:jar:3.3.1.Final (compile), junit:junit:jar:4.10 (test), org.jboss.as:jboss-as-subsystem-test-framework:jar:7.4.0.Final-redhat-4 (compile), org.sl

              4j:slf4j-log4j12:jar:1.7.5 (test), org.slf4j:jul-to-slf4j:jar:1.7.5 (test), commons-logging:commons-logging:jar:1.1.1 (test), org.hsqldb:hsqldb:jar:2

              3.0 (test), org.javassist:javassist:jar:3.18.0-GA (test)]: Failed to read artifact descriptor for org.jboss.sasl:jboss-sasl:jar:1.0.3.Final-redhat-1:

              Could not transfer artifact org.jboss:jboss-parent:pom:9-redhat-1 from/to caja (http://google-caja.googlecode.com/svn/maven): Connection to http://go

              gle-caja.googlecode.com refused: Connection timed out: connect -> [Help 1]

              org.apache.maven.lifecycle.LifecycleExecutionException: Failed to execute goal on project jboss-integration-extension: Could not resolve dependencies

              for project org.gatein.portal:jboss-integration-extension:jar:3.9.0.Alpha01-SNAPSHOT: Failed to collect dependencies for [org.jboss.as:jboss-as-contr

              ller:jar:7.4.0.Final-redhat-4 (compile), org.jboss.as:jboss-as-server:jar:7.4.0.Final-redhat-4 (compile), org.jboss.as:jboss-as-ee:jar:7.4.0.Final-re

              hat-4 (compile), org.jboss.as:jboss-as-web:jar:7.4.0.Final-redhat-4 (compile), org.jboss.as:jboss-as-weld:jar:7.4.0.Final-redhat-4 (compile), org.jbo

              s:jboss-vfs:jar:3.1.0.Final (compile), org.exoplatform.kernel:exo.kernel.container:jar:2.5.0-GA (compile), org.gatein.portal:exo.portal.webui.portal:

              ar:3.9.0.Alpha01-SNAPSHOT (compile), org.gatein.wci:wci-jboss7:jar:2.4.1.Final (compile), org.gatein.integration:extension-component:jar:3.9.0.Alpha0

              -SNAPSHOT (compile), org.gatein.wsrp:wsrp-integration-api:jar:2.3.1.Final (provided), org.gatein.cdi:gatein-cdi-contexts:jar:3.9.0.Alpha01-SNAPSHOT (

              ompile), org.jboss.portletbridge:portletbridge-impl:jar:3.3.1.Final (compile), junit:junit:jar:4.10 (test), org.jboss.as:jboss-as-subsystem-test-fram

              work:jar:7.4.0.Final-redhat-4 (compile), org.slf4j:slf4j-log4j12:jar:1.7.5 (test), org.slf4j:jul-to-slf4j:jar:1.7.5 (test), commons-logging:commons-l

              gging:jar:1.1.1 (test), org.hsqldb:hsqldb:jar:2.3.0 (test), org.javassist:javassist:jar:3.18.0-GA (test)]

                      at org.apache.maven.lifecycle.internal.LifecycleDependencyResolver.getDependencies(LifecycleDependencyResolver.java:210)

                      at org.apache.maven.lifecycle.internal.LifecycleDependencyResolver.resolveProjectDependencies(LifecycleDependencyResolver.java:117)

                      at org.apache.maven.lifecycle.internal.MojoExecutor.ensureDependenciesAreResolved(MojoExecutor.java:258)

                      at org.apache.maven.lifecycle.internal.MojoExecutor.execute(MojoExecutor.java:201)

                      at org.apache.maven.lifecycle.internal.MojoExecutor.execute(MojoExecutor.java:153)

                      at org.apache.maven.lifecycle.internal.MojoExecutor.execute(MojoExecutor.java:145)

                      at org.apache.maven.lifecycle.internal.LifecycleModuleBuilder.buildProject(LifecycleModuleBuilder.java:84)

                      at org.apache.maven.lifecycle.internal.LifecycleModuleBuilder.buildProject(LifecycleModuleBuilder.java:59)

                      at org.apache.maven.lifecycle.internal.LifecycleStarter.singleThreadedBuild(LifecycleStarter.java:183)

                      at org.apache.maven.lifecycle.internal.LifecycleStarter.execute(LifecycleStarter.java:161)

                      at org.apache.maven.DefaultMaven.doExecute(DefaultMaven.java:320)

                      at org.apache.maven.DefaultMaven.execute(DefaultMaven.java:156)

                      at org.apache.maven.cli.MavenCli.execute(MavenCli.java:537)

                      at org.apache.maven.cli.MavenCli.doMain(MavenCli.java:196)

                      at org.apache.maven.cli.MavenCli.main(MavenCli.java:141)

                      at sun.reflect.NativeMethodAccessorImpl.invoke0(Native Method)

                      at sun.reflect.NativeMethodAccessorImpl.invoke(NativeMethodAccessorImpl.java:57)

                      at sun.reflect.DelegatingMethodAccessorImpl.invoke(DelegatingMethodAccessorImpl.java:43)

                      at java.lang.reflect.Method.invoke(Method.java:601)

                      at org.codehaus.plexus.classworlds.launcher.Launcher.launchEnhanced(Launcher.java:290)

                      at org.codehaus.plexus.classworlds.launcher.Launcher.launch(Launcher.java:230)

                      at org.codehaus.plexus.classworlds.launcher.Launcher.mainWithExitCode(Launcher.java:409)

                      at org.codehaus.plexus.classworlds.launcher.Launcher.main(Launcher.java:352)

              Caused by: org.apache.maven.project.DependencyResolutionException: Could not resolve dependencies for project org.gatein.portal:jboss-integration-ext

              nsion:jar:3.9.0.Alpha01-SNAPSHOT: Failed to collect dependencies for [org.jboss.as:jboss-as-controller:jar:7.4.0.Final-redhat-4 (compile), org.jboss.

              s:jboss-as-server:jar:7.4.0.Final-redhat-4 (compile), org.jboss.as:jboss-as-ee:jar:7.4.0.Final-redhat-4 (compile), org.jboss.as:jboss-as-web:jar:7.4.

              .Final-redhat-4 (compile), org.jboss.as:jboss-as-weld:jar:7.4.0.Final-redhat-4 (compile), org.jboss:jboss-vfs:jar:3.1.0.Final (compile), org.exoplatf

              rm.kernel:exo.kernel.container:jar:2.5.0-GA (compile), org.gatein.portal:exo.portal.webui.portal:jar:3.9.0.Alpha01-SNAPSHOT (compile), org.gatein.wci

              wci-jboss7:jar:2.4.1.Final (compile), org.gatein.integration:extension-component:jar:3.9.0.Alpha01-SNAPSHOT (compile), org.gatein.wsrp:wsrp-integrati

              n-api:jar:2.3.1.Final (provided), org.gatein.cdi:gatein-cdi-contexts:jar:3.9.0.Alpha01-SNAPSHOT (compile), org.jboss.portletbridge:portletbridge-impl

              jar:3.3.1.Final (compile), junit:junit:jar:4.10 (test), org.jboss.as:jboss-as-subsystem-test-framework:jar:7.4.0.Final-redhat-4 (compile), org.slf4j:

              lf4j-log4j12:jar:1.7.5 (test), org.slf4j:jul-to-slf4j:jar:1.7.5 (test), commons-logging:commons-logging:jar:1.1.1 (test), org.hsqldb:hsqldb:jar:2.3.0

              (test), org.javassist:javassist:jar:3.18.0-GA (test)]

                      at org.apache.maven.project.DefaultProjectDependenciesResolver.resolve(DefaultProjectDependenciesResolver.java:158)

                      at org.apache.maven.lifecycle.internal.LifecycleDependencyResolver.getDependencies(LifecycleDependencyResolver.java:185)

                      ... 22 more

              Caused by: org.sonatype.aether.collection.DependencyCollectionException: Failed to collect dependencies for [org.jboss.as:jboss-as-controller:jar:7.4

              0.Final-redhat-4 (compile), org.jboss.as:jboss-as-server:jar:7.4.0.Final-redhat-4 (compile), org.jboss.as:jboss-as-ee:jar:7.4.0.Final-redhat-4 (compi

              e), org.jboss.as:jboss-as-web:jar:7.4.0.Final-redhat-4 (compile), org.jboss.as:jboss-as-weld:jar:7.4.0.Final-redhat-4 (compile), org.jboss:jboss-vfs:

              ar:3.1.0.Final (compile), org.exoplatform.kernel:exo.kernel.container:jar:2.5.0-GA (compile), org.gatein.portal:exo.portal.webui.portal:jar:3.9.0.Alp

              a01-SNAPSHOT (compile), org.gatein.wci:wci-jboss7:jar:2.4.1.Final (compile), org.gatein.integration:extension-component:jar:3.9.0.Alpha01-SNAPSHOT (c

              mpile), org.gatein.wsrp:wsrp-integration-api:jar:2.3.1.Final (provided), org.gatein.cdi:gatein-cdi-contexts:jar:3.9.0.Alpha01-SNAPSHOT (compile), org

              jboss.portletbridge:portletbridge-impl:jar:3.3.1.Final (compile), junit:junit:jar:4.10 (test), org.jboss.as:jboss-as-subsystem-test-framework:jar:7.4

              0.Final-redhat-4 (compile), org.slf4j:slf4j-log4j12:jar:1.7.5 (test), org.slf4j:jul-to-slf4j:jar:1.7.5 (test), commons-logging:commons-logging:jar:1.

              .1 (test), org.hsqldb:hsqldb:jar:2.3.0 (test), org.javassist:javassist:jar:3.18.0-GA (test)]

                      at org.sonatype.aether.impl.internal.DefaultDependencyCollector.collectDependencies(DefaultDependencyCollector.java:258)

                      at org.sonatype.aether.impl.internal.DefaultRepositorySystem.collectDependencies(DefaultRepositorySystem.java:308)

                      at org.apache.maven.project.DefaultProjectDependenciesResolver.resolve(DefaultProjectDependenciesResolver.java:150)

                      ... 23 more

              Caused by: org.sonatype.aether.resolution.ArtifactDescriptorException: Failed to read artifact descriptor for org.jboss.sasl:jboss-sasl:jar:1.0.3.Fin

              l-redhat-1

                      at org.apache.maven.repository.internal.DefaultArtifactDescriptorReader.loadPom(DefaultArtifactDescriptorReader.java:331)

                      at org.apache.maven.repository.internal.DefaultArtifactDescriptorReader.readArtifactDescriptor(DefaultArtifactDescriptorReader.java:186)

                      at org.sonatype.aether.impl.internal.DefaultDependencyCollector.process(DefaultDependencyCollector.java:412)

                      at org.sonatype.aether.impl.internal.DefaultDependencyCollector.process(DefaultDependencyCollector.java:544)

                      at org.sonatype.aether.impl.internal.DefaultDependencyCollector.process(DefaultDependencyCollector.java:544)

                      at org.sonatype.aether.impl.internal.DefaultDependencyCollector.process(DefaultDependencyCollector.java:544)

                      at org.sonatype.aether.impl.internal.DefaultDependencyCollector.collectDependencies(DefaultDependencyCollector.java:240)

                      ... 25 more

              Caused by: org.apache.maven.model.resolution.UnresolvableModelException: Could not transfer artifact org.jboss:jboss-parent:pom:9-redhat-1 from/to ca

              a (http://google-caja.googlecode.com/svn/maven): Connection to http://google-caja.googlecode.com refused

                      at org.apache.maven.repository.internal.DefaultModelResolver.resolveModel(DefaultModelResolver.java:126)

                      at org.apache.maven.model.building.DefaultModelBuilder.readParentExternally(DefaultModelBuilder.java:813)

                      at org.apache.maven.model.building.DefaultModelBuilder.readParent(DefaultModelBuilder.java:664)

                      at org.apache.maven.model.building.DefaultModelBuilder.build(DefaultModelBuilder.java:310)

                      at org.apache.maven.model.building.DefaultModelBuilder.build(DefaultModelBuilder.java:232)

                      at org.apache.maven.repository.internal.DefaultArtifactDescriptorReader.loadPom(DefaultArtifactDescriptorReader.java:322)

                      ... 31 more

              Caused by: org.sonatype.aether.resolution.ArtifactResolutionException: Could not transfer artifact org.jboss:jboss-parent:pom:9-redhat-1 from/to caja

              (http://google-caja.googlecode.com/svn/maven): Connection to http://google-caja.googlecode.com refused

                      at org.sonatype.aether.impl.internal.DefaultArtifactResolver.resolve(DefaultArtifactResolver.java:538)

                      at org.sonatype.aether.impl.internal.DefaultArtifactResolver.resolveArtifacts(DefaultArtifactResolver.java:216)

                      at org.sonatype.aether.impl.internal.DefaultArtifactResolver.resolveArtifact(DefaultArtifactResolver.java:193)

                      at org.apache.maven.repository.internal.DefaultModelResolver.resolveModel(DefaultModelResolver.java:122)

                      ... 36 more

              Caused by: org.sonatype.aether.transfer.ArtifactTransferException: Could not transfer artifact org.jboss:jboss-parent:pom:9-redhat-1 from/to caja (ht

              p://google-caja.googlecode.com/svn/maven): Connection to http://google-caja.googlecode.com refused

                      at org.sonatype.aether.connector.wagon.WagonRepositoryConnector$4.wrap(WagonRepositoryConnector.java:951)

                      at org.sonatype.aether.connector.wagon.WagonRepositoryConnector$4.wrap(WagonRepositoryConnector.java:941)

                      at org.sonatype.aether.connector.wagon.WagonRepositoryConnector$GetTask.run(WagonRepositoryConnector.java:669)

                      at org.sonatype.aether.util.concurrency.RunnableErrorForwarder$1.run(RunnableErrorForwarder.java:60)

                      at java.util.concurrent.ThreadPoolExecutor.runWorker(ThreadPoolExecutor.java:1110)

                      at java.util.concurrent.ThreadPoolExecutor$Worker.run(ThreadPoolExecutor.java:603)

                      at java.lang.Thread.run(Thread.java:722)

              Caused by: org.apache.maven.wagon.TransferFailedException: Connection to http://google-caja.googlecode.com refused

                      at org.apache.maven.wagon.shared.http4.AbstractHttpClientWagon.resourceExists(AbstractHttpClientWagon.java:597)

                      at org.sonatype.aether.connector.wagon.WagonRepositoryConnector$GetTask.run(WagonRepositoryConnector.java:577)

                      ... 4 more

              Caused by: org.apache.maven.wagon.providers.http.httpclient.conn.HttpHostConnectException: Connection to http://google-caja.googlecode.com refused

                      at org.apache.maven.wagon.providers.http.httpclient.impl.conn.DefaultClientConnectionOperator.openConnection(DefaultClientConnectionOperator.

              ava:158)

                      at org.apache.maven.wagon.providers.http.httpclient.impl.conn.AbstractPoolEntry.open(AbstractPoolEntry.java:149)

                      at org.apache.maven.wagon.providers.http.httpclient.impl.conn.AbstractPooledConnAdapter.open(AbstractPooledConnAdapter.java:121)

                      at org.apache.maven.wagon.providers.http.httpclient.impl.client.DefaultRequestDirector.tryConnect(DefaultRequestDirector.java:573)

                      at org.apache.maven.wagon.providers.http.httpclient.impl.client.DefaultRequestDirector.execute(DefaultRequestDirector.java:425)

                      at org.apache.maven.wagon.providers.http.httpclient.impl.client.AbstractHttpClient.execute(AbstractHttpClient.java:820)

                      at org.apache.maven.wagon.providers.http.httpclient.impl.client.AbstractHttpClient.execute(AbstractHttpClient.java:754)

                      at org.apache.maven.wagon.shared.http4.AbstractHttpClientWagon.execute(AbstractHttpClientWagon.java:674)

                      at org.apache.maven.wagon.shared.http4.AbstractHttpClientWagon.resourceExists(AbstractHttpClientWagon.java:593)

                      ... 5 more

              Caused by: java.net.ConnectException: Connection timed out: connect

                      at java.net.DualStackPlainSocketImpl.connect0(Native Method)

                      at java.net.DualStackPlainSocketImpl.socketConnect(DualStackPlainSocketImpl.java:69)

                      at java.net.AbstractPlainSocketImpl.doConnect(AbstractPlainSocketImpl.java:339)

                      at java.net.AbstractPlainSocketImpl.connectToAddress(AbstractPlainSocketImpl.java:200)

                      at java.net.AbstractPlainSocketImpl.connect(AbstractPlainSocketImpl.java:182)

                      at java.net.PlainSocketImpl.connect(PlainSocketImpl.java:157)

                      at java.net.SocksSocketImpl.connect(SocksSocketImpl.java:391)

                      at java.net.Socket.connect(Socket.java:579)

                      at org.apache.maven.wagon.providers.http.httpclient.conn.scheme.PlainSocketFactory.connectSocket(PlainSocketFactory.java:123)

                      at org.apache.maven.wagon.providers.http.httpclient.impl.conn.DefaultClientConnectionOperator.openConnection(DefaultClientConnectionOperator.

              ava:148)

                      ... 13 more

              [ERROR]

              [ERROR]

              [ERROR] For more information about the errors and possible solutions, please read the following articles:

              [ERROR] [Help 1] http://cwiki.apache.org/confluence/display/MAVEN/DependencyResolutionException

              [ERROR]

              [ERROR] After correcting the problems, you can resume the build with the command

              [ERROR]   mvn <goals> -rf :jboss-integration-extension

              E:\iSoVA\Softwares\GateinPortalAlpha\gatein-portal>