5 Replies Latest reply on Nov 18, 2014 8:37 AM by Sriram N

    Please help asap! error while trying to build the infinispan quick start example...

    Sriram N Newbie

      Hi All,

       

      I am trying to build and deploy the quick start example of infinispan 7.0.0.Final.

      I got the relevant codebase from the github

      When I build using maven in my FuseIDE / JBossDevStudio, I get the following error...

       

      [INFO] Scanning for projects...

      [INFO]                                                                        

      [INFO] ------------------------------------------------------------------------

      [INFO] Building Infinispan Embedded Cache Quickstart 7.0.0-SNAPSHOT

      [INFO] ------------------------------------------------------------------------

      [INFO] Downloading: http://repository.jboss.org/nexus/content/groups/public/org/codehaus/mojo/exec-maven-plugin/1.2.1/exec-maven-plugin-1.2.1.pom

      [INFO] Downloading: https://repo.maven.apache.org/maven2/org/codehaus/mojo/exec-maven-plugin/1.2.1/exec-maven-plugin-1.2.1.pom

      [INFO] ------------------------------------------------------------------------

      [INFO] BUILD FAILURE

      [INFO] ------------------------------------------------------------------------

      [INFO] Total time: 0.805 s

      [INFO] Finished at: 2014-11-15T08:44:47-05:00

      [INFO] Final Memory: 7M/118M

      [INFO] ------------------------------------------------------------------------

      [ERROR] Plugin org.codehaus.mojo:exec-maven-plugin:1.2.1 or one of its dependencies could not be resolved: Failed to read artifact descriptor for org.codehaus.mojo:exec-maven-plugin:jar:1.2.1: Could not transfer artifact org.codehaus.mojo:exec-maven-plugin:pom:1.2.1 from/to jboss-public-repository-group (http://repository.jboss.org/nexus/content/groups/public): cis-americas-pitc-cinciz.proxy.corporate.ge.com: Unknown host cis-americas-pitc-cinciz.proxy.corporate.ge.com -> [Help 1]

      [ERROR]

      [ERROR] To see the full stack trace of the errors, re-run Maven with the -e switch.

      [ERROR] Re-run Maven using the -X switch to enable full debug logging.

      [ERROR]

      [ERROR] For more information about the errors and possible solutions, please read the following articles:

      [ERROR] [Help 1] http://cwiki.apache.org/confluence/display/MAVEN/PluginResolutionException

       

      Could any of you help me on this asap please???

       

      Regards,

      Sriram